{"text_format":"1","workbook":"xlsx","n_sheets":32,"sheets":["Instructions","CONTENTS","Business & other details","2.1 Expenditure summary","2.2 Repex","2.3 Augex (b)","2.5 Connections","2.6 Non-network","2.10 Overheads","2.11 Labour","2.14 Forecast price changes","2.16 Opex Summary","2.17 Step Changes","3.1 Revenue","3.2 Operating expenditure","3.3 Assets (RAB)","3.4 Operational data","3.5 Physical assets","3.7 Operating environment","5.4 MD & Utilisation - Spatial","7.1  Policies and Procedures","7.2 Contingent projects","7.3 Obligations","7.4 Shared Assets","7.9 STPIS","8.2 Capex","Formatting Styles","AER Sheet Heading","AER CF","AER NRs","AER lookups","AER ETL"],"not_rendered":{"charts":0,"images":5,"macros":1,"external_links":1,"defined_names":518,"comments":2,"pivot_tables":0},"unopened":[],"bounds":{"document_bytes":16777216,"sheet_cells":100000,"rows_first":2000,"rows_last":500,"rows_between":2000,"halvings":0,"cell_chars":16384,"cell_head_chars":4096},"cells_cut":0,"cells_raw":0,"read":"whole","date_system":"1900"}

{"sheet":"Instructions","index":0,"n_rows":27,"n_cols":4,"rows_kept":27,"cut":false,"hidden":false,"merged":[[1,1,1,4],[2,1,2,4],[3,1,3,4],[4,1,4,4],[5,2,5,4],[7,1,8,1],[7,2,7,3],[8,2,8,4],[18,1,24,1],[18,2,18,4],[26,2,26,4],[10,2,10,4],[12,1,14,1],[12,2,12,4],[13,2,13,3],[14,2,14,4],[16,2,16,4]]}
[]
[null,{"$f":"CONCATENATE(dms_Sector,\" \",dms_Segment,\" \", \"Network Service Provider\")","v":"Electricity Transmission Network Service Provider"}]
[null,{"$f":"IF(dms_Model=\"Reset\",\"Regulatory Proposal RIN Template\",\"Annual Reporting RIN\")","v":"Regulatory Proposal RIN Template"}]
[null,{"$f":"CONCATENATE(\"This template is to be used by \",dms_TradingNameFull,\" to fulfil its reporting obligations to the AER.\")","v":"This template is to be used by TasNetworks (T) to fulfil its reporting obligations to the AER."}]
[null,"INSTRUCTIONS"]
[null,"GENERAL","Complete the Business & other details worksheet before entering data or values in any other worksheets. The Business & other details worksheet is linked to other worksheets within the workbook and automatically generates certain column headings and conditional formatting."]
[]
[null,"CONFIDENTIAL INFORMATION","\nPlease use the macro at the top of each \nworksheet to identify confidential information\nin the confidential workbook. \n\n"]
[null,null,"-Do this by selecting the cell or cells that contain confidential information and then run the Mark selection as CONFIDENTIAL macro. This will format the cells a specific colour that is identified by the AER's database which in turn marks that information as confidential.\n\n-To reverse this, select the cell or cells and run the Return selection to NON-CONFIDENTIAL macro."]
[]
[null,"RESPONSES","\nPlease return two (2) files to the AER: \n\n1. A confidential version which must contain a complete set of all responses with confidential information marked using the Mark selection CONFIDENTIAL macro and which has been completed using the locked template file provided by the AER. \n\n2. A public version with confidential information either removed completely or aggregated in some form together with writtten consent to disclose the public version of the response.\n\nUse the drop down box on the Business and other details worksheet to identify the file as either confidential ('consolidated') or public. "]
[]
[null,"AMENDMENTS","\nIf an NSP wishes to correct data previously submitted to the AER it should resubmit that data using the original completed submission as the starting point. Please make any necessary changes to the data. Data that is not being amended should be left unchanged. \n\nNSPs must identify the reason for the amendments in the Amendment Reason box on the  Business and other details worksheet. NSPs may provide further details regarding any amendments in the Amendments worksheet. \n\n."]
[null,null,"NSP may use Amended Data macro \nto highlight cells that contain amended data.\nNB: if data is also CONFIDENTIAL, re-apply \nthe Confidentiality macro after applying the \nAmended macro"]
[null,null,"Please resubmit two (2) files - a confidential version and a public version of the amended submission to the AER"]
[]
[null,"UNITS OF MEASURE","\nAll amounts are to be unrounded and reported on a one for one basis: that is 1000 is to be entered as '1000'. Applicable units of measure may be identified in the table column headings or row descriptors.\n\n"]
[]
[null,"INPUT / NON-INPUT CELLS"]
[null,null,null,"Yellow = Input cell (mandatory)"]
[null,null,null,"Darker yellow = input cell (mandatory)"]
[null,null,null,"Orange = input cell (if data available)"]
[null,null,null,"Grey = Not applicable/No inputs required"]
[null,null,null,"PLEASE DO NOT ENTER TEXT into cells that are to contain numbers (including 'numbers stored as text')"]
[]
[]
[null,"NAVIGATION","\nMany tables in the worksheets have been \"grouped\" to allow for easy navigation. To ungroup or group data use the outline symbols in the left margin (for Row groupings) or above the columns (for column groupings). \n\n\n\n"]

{"sheet":"CONTENTS","index":1,"n_rows":38,"n_cols":4,"rows_kept":38,"cut":false,"hidden":false,"merged":[[5,2,5,3]]}
[null,null,{"$f":"INDEX(dms_Worksheet_List,MATCH(dms_Model,dms_Model_List))","v":"REGULATORY REPORTING STATEMENT"}]
[null,null,{"$f":"INDEX(dms_TradingNameFull_List,MATCH(dms_TradingName,dms_TradingName_List))","v":"TasNetworks (T)"}]
[null,null,{"$f":"CONCATENATE(\"REGULATORY PERIOD FROM \", FRCP_y1,\" TO \",dms_MultiYear_FinalYear_Result)","v":"REGULATORY PERIOD FROM 2024-25 TO 2028-29"}]
[]
[]
[null,null,"CONTENTS"]
[]
[null,null,"TEMPLATE","FINAL RIN OCTOBER 2022"]
[]
[null,null,"SUBMISSION","Business & other details"]
[]
[null,null,"EXPENDITURE","2.1 Expenditure summary"]
[null,null,null,"2.2 Repex"]
[null,null,null,"2.3 Augex (b)"]
[null,null,null,"2.5 Connections"]
[null,null,null,"2.6 Non-network"]
[null,null,null,"2.10 Overheads"]
[null,null,null,"2.11 Labour"]
[null,null,null,"2.14 Forecast price changes"]
[null,null,null,"2.16 Opex Summary"]
[null,null,null,"2.17 Step Changes"]
[]
[null,null,"ECONOMIC BENCHMARKING","3.1 Revenue"]
[null,null,null,"3.2 Operating expenditure"]
[null,null,null,"3.3 Assets (RAB)"]
[null,null,null,"3.4 Operational data"]
[null,null,null,"3.5 Physical assets"]
[null,null,null,"3.7 Operating environment"]
[]
[null,null,"NETWORK","5.4 MD & Utilisation - Spatial"]
[]
[null,null,"OTHER","7.1  Policies and Procedures"]
[null,null,null,"7.2 Contingent projects"]
[null,null,null,"7.3 Obligations"]
[null,null,null,"7.4 Shared Assets"]
[null,null,null,"7.9 STPIS"]
[]
[null,null,"CAPEX","8.2 Capex"]

{"sheet":"Business & other details","index":2,"n_rows":74,"n_cols":79,"rows_kept":74,"cut":false,"hidden":false,"merged":[[61,25,61,34],[61,37,61,52],[69,25,71,34],[69,37,71,81],[73,25,73,34],[73,37,73,52],[63,25,63,34],[63,37,63,52],[65,25,65,34],[65,37,65,52],[67,25,67,34],[67,37,67,52],[51,37,51,44],[51,46,51,53],[51,55,51,62],[51,64,51,71],[51,73,51,80],[53,25,53,34],[53,37,53,44],[55,25,55,34],[55,37,55,44],[49,25,49,34],[49,37,49,44],[49,46,49,53],[49,55,49,62],[49,64,49,71],[49,73,49,80],[50,37,50,44],[50,46,50,53],[50,55,50,62],[50,64,50,71],[50,73,50,80],[46,37,46,44],[46,46,46,53],[46,55,46,62],[46,64,46,71],[46,73,46,80],[47,37,47,44],[47,46,47,53],[47,55,47,62],[47,64,47,71],[47,73,47,80],[43,37,43,44],[43,46,43,53],[43,55,43,62],[43,64,43,71],[43,73,43,80],[45,25,45,34],[45,37,45,44],[45,46,45,53],[45,55,45,62],[45,64,45,71],[45,73,45,80],[41,25,41,34],[41,37,41,44],[41,46,41,53],[41,55,41,62],[41,64,41,71],[41,73,41,80],[42,37,42,44],[42,46,42,53],[42,55,42,62],[42,64,42,71],[42,73,42,80],[31,21,31,35],[31,37,31,58],[31,60,31,66],[31,68,31,89],[32,21,32,35],[32,37,32,58],[32,60,32,66],[32,68,32,89],[33,21,33,35],[33,37,33,58],[33,60,33,66],[33,68,33,89],[23,21,23,35],[23,37,23,58],[23,60,23,66],[23,68,23,89],[24,21,24,35],[24,37,24,51],[24,60,24,66],[24,68,24,82],[25,21,25,35],[25,37,25,40],[25,49,25,51],[25,60,25,66],[25,68,25,71],[25,80,25,82],[0,7,2,15],[3,21,3,57],[6,21,6,75],[8,16,8,93],[15,21,15,35],[15,37,15,58],[16,21,16,35],[16,37,16,48],[22,21,22,35],[22,37,22,58],[22,60,22,66],[22,68,22,89]]}
[null,null,null,null,null,null,null,null,null,null,null,null,null,null,null,null,null,null,null,null,null,{"$f":"INDEX(dms_Worksheet_List,MATCH(dms_Model,dms_Model_List))","v":"REGULATORY REPORTING STATEMENT"}]
[null,null,null,null,null,null,null,null,null,null,null,null,null,null,null,null,null,null,null,null,null,{"$f":"INDEX(dms_TradingNameFull_List,MATCH(dms_TradingName,dms_TradingName_List))","v":"TasNetworks (T)"}]
[null,null,null,null,null,null,null,null,null,null,null,null,null,null,null,null,null,null,null,null,null,{"$f":"CONCATENATE(\"REGULATORY PERIOD FROM \", FRCP_y1,\" TO \",dms_MultiYear_FinalYear_Result)","v":"REGULATORY PERIOD FROM 2024-25 TO 2028-29"}]
[null,null,null,null,null,null,null,null,null,null,null,null,null,null,null,null,null,null,null,null,null,"BUSINESS & OTHER DETAILS"]
[]
[null,null,null,null,null,null,null,null,null,null,null,null,null,null,null,null,null,null,null,null,null,"INSTRUCTIONS"]
[null,null,null,null,null,null,null,null,null,null,null,null,null,null,null,null,null,null,null,null,null,"Complete the following business details regulatory template before entering data or values in any other regulatory template. This regulatory template is linked to other cells within the spreadsheet and automatically generates column headings and conditional formatting to distinguish business specific input and non-input cells. "]
[]
[null,null,null,null,null,null,null,null,null,null,null,null,null,null,null,null,"SUBMISSION PARTICULARS INPUT SHEET"]
[]
[]
[null,null,null,null,null,null,null,null,null,null,null,null,null,null,null,null,null,null,null,null,null,"ENTITY DETAILS"]
[]
[null,null,null,null,null,null,null,null,null,null,null,null,null,null,null,null,null,null,null,null,null,"Business Name"]
[]
[null,null,null,null,null,null,null,null,null,null,null,null,null,null,null,null,null,null,null,null,null,"Short name",null,null,null,null,null,null,null,null,null,null,null,null,null,null,null,"TasNetworks (T)"]
[null,null,null,null,null,null,null,null,null,null,null,null,null,null,null,null,null,null,null,null,null,"ACN/ABN",null,null,null,null,null,null,null,null,null,null,null,null,null,null,null,{"$f":"INDEX(dms_ABN_List,MATCH(dms_TradingName,dms_TradingName_List))","v":24167357299}]
[]
[]
[]
[null,null,null,null,null,null,null,null,null,null,null,null,null,null,null,null,null,null,null,null,null,"Business Address",null,null,null,null,null,null,null,null,null,null,null,null,null,null,null,null,null,null,null,null,null,null,null,null,null,null,null,null,null,null,null,null,null,null,null,null,null,null,null,null,null,null,null,null,null,null,"Postal Address"]
[]
[null,null,null,null,null,null,null,null,null,null,null,null,null,null,null,null,null,null,null,null,null,"Address 1",null,null,null,null,null,null,null,null,null,null,null,null,null,null,null,{"$f":"INDEX(dms_Addr1_List,MATCH(dms_TradingName,dms_TradingName_List))","v":"1-7 Maria Street"},null,null,null,null,null,null,null,null,null,null,null,null,null,null,null,null,null,null,null,null,null,null,"Address 1",null,null,null,null,null,null,null,{"$f":"INDEX(dms_PAddr1_List,MATCH(dms_TradingName,dms_TradingName_List))","v":"PO Box 606"}]
[null,null,null,null,null,null,null,null,null,null,null,null,null,null,null,null,null,null,null,null,null,"Address 2",null,null,null,null,null,null,null,null,null,null,null,null,null,null,null,{"$f":"IF(ISBLANK(INDEX(dms_Addr2_List,MATCH(dms_TradingName,dms_TradingName_List))),\"\",(INDEX(dms_Addr2_List,MATCH(dms_TradingName,dms_TradingName_List))))","v":""},null,null,null,null,null,null,null,null,null,null,null,null,null,null,null,null,null,null,null,null,null,null,"Address 2",null,null,null,null,null,null,null,{"$f":"IF(ISBLANK(INDEX(dms_PAddr2_List,MATCH(dms_TradingName,dms_TradingName_List))),\"\",(INDEX(dms_PAddr2_List,MATCH(dms_TradingName,dms_TradingName_List))))","v":""}]
[null,null,null,null,null,null,null,null,null,null,null,null,null,null,null,null,null,null,null,null,null,"Suburb",null,null,null,null,null,null,null,null,null,null,null,null,null,null,null,{"$f":"INDEX(dms_Suburb_List,MATCH(dms_TradingName,dms_TradingName_List))","v":"LENAH VALLEY"},null,null,null,null,null,null,null,null,null,null,null,null,null,null,null,null,null,null,null,null,null,null,"Suburb",null,null,null,null,null,null,null,{"$f":"INDEX(dms_PSuburb_List,MATCH(dms_TradingName,dms_TradingName_List))","v":"MOONAH"}]
[null,null,null,null,null,null,null,null,null,null,null,null,null,null,null,null,null,null,null,null,null,"State",null,null,null,null,null,null,null,null,null,null,null,null,null,null,null,{"$f":"INDEX(dms_State_List,MATCH(dms_TradingName,dms_TradingName_List))","v":"Tas"},null,null,null,null,null,null,null,null,null,"Post code",null,null,null,null,null,null,null,null,null,null,null,null,"State",null,null,null,null,null,null,null,{"$f":"INDEX(dms_PState_List,MATCH(dms_TradingName,dms_TradingName_List))","v":"Tas"},null,null,null,null,null,null,null,null,null,"Post code"]
[]
[null,null,null,null,null,null,null,null,null,null,null,null,null,null,null,null,null,null,null,null,null,null,null,null,null,null,null,null,null,null,null,null,null,null,null,null,null,null,null,null,null,null,null,null,null,null,null,null,null,null,null,null,"`"]
[]
[null,null,null,null,null,null,null,null,null,null,null,null,null,null,null,null,null,null,null,null,null,"Contact Names"]
[]
[null,null,null,null,null,null,null,null,null,null,null,null,null,null,null,null,null,null,null,null,null,"Name",null,null,null,null,null,null,null,null,null,null,null,null,null,null,null,null,null,null,null,null,null,null,null,null,null,null,null,null,null,null,null,null,null,null,null,null,null,null,"Name"]
[null,null,null,null,null,null,null,null,null,null,null,null,null,null,null,null,null,null,null,null,null,"Phone",null,null,null,null,null,null,null,null,null,null,null,null,null,null,null,null,null,null,null,null,null,null,null,null,null,null,null,null,null,null,null,null,null,null,null,null,null,null,"Phone"]
[null,null,null,null,null,null,null,null,null,null,null,null,null,null,null,null,null,null,null,null,null,"Email",null,null,null,null,null,null,null,null,null,null,null,null,null,null,null,null,null,null,null,null,null,null,null,null,null,null,null,null,null,null,null,null,null,null,null,null,null,null,"Email"]
[]
[]
[]
[]
[null,null,null,null,null,null,null,null,null,null,null,null,null,null,null,null,"REGULATORY CONTROL PERIODS"]
[]
[]
[null,null,null,null,null,null,null,null,null,null,null,null,null,null,null,null,null,null,null,null,null,null,null,null,null,"Forthcoming period",null,null,null,null,null,null,null,null,null,null,null,"2024-25",null,null,null,null,null,null,null,null,{"$f":"FRCP_y2","v":"2025-26"},null,null,null,null,null,null,null,null,{"$f":"FRCP_y3","v":"2026-27"},null,null,null,null,null,null,null,null,{"$f":"FRCP_y4","v":"2027-28"},null,null,null,null,null,null,null,null,{"$f":"FRCP_y5","v":"2028-29"}]
[null,null,null,null,null,null,null,null,null,null,null,null,null,null,null,null,null,null,null,null,null,null,null,null,null,null,null,null,null,null,null,null,null,null,null,null,null,{"$f":"FRCP_y6","v":"2029-30"},null,null,null,null,null,null,null,null,{"$f":"FRCP_y7","v":"2030-31"},null,null,null,null,null,null,null,null,{"$f":"FRCP_y8","v":"2031-32"},null,null,null,null,null,null,null,null,{"$f":"FRCP_y9","v":"2032-33"},null,null,null,null,null,null,null,null,{"$f":"FRCP_y10","v":"2033-34"}]
[null,null,null,null,null,null,null,null,null,null,null,null,null,null,null,null,null,null,null,null,null,null,null,null,null,null,null,null,null,null,null,null,null,null,null,null,null,{"$f":"FRCP_y11","v":"2034-35"},null,null,null,null,null,null,null,null,{"$f":"FRCP_y12","v":"2035-36"},null,null,null,null,null,null,null,null,{"$f":"FRCP_y13","v":"2036-37"},null,null,null,null,null,null,null,null,{"$f":"FRCP_y14","v":"2037-38"},null,null,null,null,null,null,null,null,{"$f":"FRCP_y15","v":"2038-39"}]
[]
[null,null,null,null,null,null,null,null,null,null,null,null,null,null,null,null,null,null,null,null,null,null,null,"RESETS",null,"Current period",null,null,null,null,null,null,null,null,null,null,null,{"$f":"CRCP_y1","v":"2019-20"},null,null,null,null,null,null,null,null,{"$f":"CRCP_y2","v":"2020-21"},null,null,null,null,null,null,null,null,{"$f":"CRCP_y3","v":"2021-22"},null,null,null,null,null,null,null,null,{"$f":"CRCP_y4","v":"2022-23"},null,null,null,null,null,null,null,null,{"$f":"CRCP_y5","v":"2023-24"}]
[null,null,null,null,null,null,null,null,null,null,null,null,null,null,null,null,null,null,null,null,null,null,null,null,null,null,null,null,null,null,null,null,null,null,null,null,null,{"$f":"CRCP_y6","v":"2024-25"},null,null,null,null,null,null,null,null,{"$f":"CRCP_y7","v":"2025-26"},null,null,null,null,null,null,null,null,{"$f":"CRCP_y8","v":"2026-27"},null,null,null,null,null,null,null,null,{"$f":"CRCP_y9","v":"2027-28"},null,null,null,null,null,null,null,null,{"$f":"CRCP_y10","v":"2028-29"}]
[null,null,null,null,null,null,null,null,null,null,null,null,null,null,null,null,null,null,null,null,null,null,null,null,null,null,null,null,null,null,null,null,null,null,null,null,null,{"$f":"CRCP_y11","v":"2029-30"},null,null,null,null,null,null,null,null,{"$f":"CRCP_y12","v":"2030-31"},null,null,null,null,null,null,null,null,{"$f":"CRCP_y13","v":"2031-32"},null,null,null,null,null,null,null,null,{"$f":"CRCP_y14","v":"2032-33"},null,null,null,null,null,null,null,null,{"$f":"CRCP_y15","v":"2033-34"}]
[]
[null,null,null,null,null,null,null,null,null,null,null,null,null,null,null,null,null,null,null,null,null,null,null,null,null,"Previous period",null,null,null,null,null,null,null,null,null,null,null,{"$f":"PRCP_y1","v":"2014-15"},null,null,null,null,null,null,null,null,{"$f":"PRCP_y2","v":"2015-16"},null,null,null,null,null,null,null,null,{"$f":"PRCP_y3","v":"2016-17"},null,null,null,null,null,null,null,null,{"$f":"PRCP_y4","v":"2017-18"},null,null,null,null,null,null,null,null,{"$f":"PRCP_y5","v":"2018-19"}]
[null,null,null,null,null,null,null,null,null,null,null,null,null,null,null,null,null,null,null,null,null,null,null,null,null,null,null,null,null,null,null,null,null,null,null,null,null,{"$f":"PRCP_y6","v":"2019-20"},null,null,null,null,null,null,null,null,{"$f":"PRCP_y7","v":"2020-21"},null,null,null,null,null,null,null,null,{"$f":"PRCP_y8","v":"2021-22"},null,null,null,null,null,null,null,null,{"$f":"PRCP_y9","v":"2022-23"},null,null,null,null,null,null,null,null,{"$f":"PRCP_y10","v":"2023-24"}]
[null,null,null,null,null,null,null,null,null,null,null,null,null,null,null,null,null,null,null,null,null,null,null,null,null,null,null,null,null,null,null,null,null,null,null,null,null,{"$f":"PRCP_y11","v":"2024-25"},null,null,null,null,null,null,null,null,{"$f":"PRCP_y12","v":"2025-26"},null,null,null,null,null,null,null,null,{"$f":"PRCP_y13","v":"2026-27"},null,null,null,null,null,null,null,null,{"$f":"PRCP_y14","v":"2027-28"},null,null,null,null,null,null,null,null,{"$f":"PRCP_y15","v":"2028-29"}]
[]
[null,null,null,null,null,null,null,null,null,null,null,null,null,null,null,null,null,null,null,null,null,null,null,null,null,"Commencing year",null,null,null,null,null,null,null,null,null,null,null,"2022-23"]
[null,null,null,null,null,null,null,null,null,null,null,null,null,null,null,null,null,null,null,null,null,null,null,"ANNUAL RINS"]
[null,null,null,null,null,null,null,null,null,null,null,null,null,null,null,null,null,null,null,null,null,null,null,null,null,"Final year",null,null,null,null,null,null,null,null,null,null,null,"2022-23"]
[]
[]
[]
[null,null,null,null,null,null,null,null,null,null,null,null,null,null,null,null,"SUBMISSION DETAILS"]
[]
[null,null,null,null,null,null,null,null,null,null,null,null,null,null,null,null,null,null,null,null,null,null,null,null,null,"RIN type",null,null,null,null,null,null,null,null,null,null,null,{"$f":"INDIRECT(dms_Model)","v":"Regulatory Reporting (Reset)"}]
[]
[null,null,null,null,null,null,null,null,null,null,null,null,null,null,null,null,null,null,null,null,null,null,null,null,null,"Source",null,null,null,null,null,null,null,null,null,null,null,"Regulatory proposal"]
[]
[null,null,null,null,null,null,null,null,null,null,null,null,null,null,null,null,null,null,null,null,null,null,null,"THIS FILE",null,"Data Quality",null,null,null,null,null,null,null,null,null,null,null,"Consolidated"]
[]
[null,null,null,null,null,null,null,null,null,null,null,null,null,null,null,null,null,null,null,null,null,null,null,null,null,"Confidentiality Status",null,null,null,null,null,null,null,null,null,null,null,"Public"]
[]
[null,null,null,null,null,null,null,null,null,null,null,null,null,null,null,null,null,null,null,null,null,null,null,null,null,"Amended RIN \nAmendment Reason",null,null,null,null,null,null,null,null,null,null,null,"."]
[]
[]
[]
[null,null,null,null,null,null,null,null,null,null,null,null,null,null,null,null,null,null,null,null,null,null,null,null,null,"Submission Date",null,null,null,null,null,null,null,null,null,null,null,"2023-01-31",null,null,null,null,null,null,null,null,null,null,null,null,null,null,null,null,null,"Please enter date this file submitted to AER"]

{"sheet":"2.1 Expenditure summary","index":3,"n_rows":40,"n_cols":9,"rows_kept":40,"cut":false,"hidden":false,"merged":[]}
[null,{"$f":"(LOOKUP(dms_Model,dms_Model_List,dms_Worksheet_List))","v":"REGULATORY REPORTING STATEMENT"}]
[null,{"$f":"INDEX(dms_TradingNameFull_List,MATCH(dms_TradingName,dms_TradingName_List))","v":"TasNetworks (T)"}]
[null,{"$f":"CONCATENATE(\"REGULATORY PERIOD FROM \", FRCP_y1,\" TO \",dms_MultiYear_FinalYear_Result)","v":"REGULATORY PERIOD FROM 2024-25 TO 2028-29"}]
[null,"2.1 - EXPENDITURE SUMMARY AND RECONCILIATION"]
[]
[null,"There are three tables on this worksheet. Each has been grouped for ease of navigation. See the Instructions sheet on how to group or ungroup tables. "]
[]
[null,"2.1.1 - PRESCRIBED TRANSMISSION SERVICES CAPEX (as incurred)"]
[null,null,"EXPENDITURE"]
[null,null,{"$f":"CONCATENATE(\"Forecast  ($0's. real \",dms_DollarReal,\")\")","v":"Forecast  ($0's. real June 2024)"}]
[null,null,{"$f":"dms_y1","v":"2022-23"},{"$f":"dms_y2","v":"2023-24"},{"$f":"dms_y3","v":"2024-25"},{"$f":"dms_y4","v":"2025-26"},{"$f":"dms_y5","v":"2026-27"},{"$f":"dms_y6","v":"2027-28"},{"$f":"dms_y7","v":"2028-29"}]
[null,"Replacement expenditure",{"$f":"SUM('2.2 Repex'!D58:D66)","v":40111257.405507952},{"$f":"SUM('2.2 Repex'!E58:E66)","v":32351178.161272921},{"$f":"SUM('2.2 Repex'!F58:F66)","v":30698966.183155864},{"$f":"SUM('2.2 Repex'!G58:G66)","v":39636985.655833676},{"$f":"SUM('2.2 Repex'!H58:H66)","v":32940742.865979038},{"$f":"SUM('2.2 Repex'!I58:I66)","v":37900872.451414026},{"$f":"SUM('2.2 Repex'!J58:J66)","v":26186389.069813751}]
[null,"Connections",{"$f":"SUM('2.5 Connections'!C13:C63)","v":0},{"$f":"SUM('2.5 Connections'!D13:D63)","v":0},{"$f":"SUM('2.5 Connections'!E13:E63)","v":0},{"$f":"SUM('2.5 Connections'!F13:F63)","v":0},{"$f":"SUM('2.5 Connections'!G13:G63)","v":0},{"$f":"SUM('2.5 Connections'!H13:H63)","v":0},{"$f":"SUM('2.5 Connections'!I13:I63)","v":0}]
[null,"Augmentation Expenditure",{"$f":"SUM('2.3 Augex (b)'!C12:C14)","v":3914022.5000264542},{"$f":"SUM('2.3 Augex (b)'!D12:D14)","v":3144795.7702324591},{"$f":"SUM('2.3 Augex (b)'!E12:E14)","v":1548819.0952772885},{"$f":"SUM('2.3 Augex (b)'!F12:F14)","v":5363592.4379941598},{"$f":"SUM('2.3 Augex (b)'!G12:G14)","v":5599665.6122062793},{"$f":"SUM('2.3 Augex (b)'!H12:H14)","v":536021.9611514865},{"$f":"SUM('2.3 Augex (b)'!I12:I14)","v":7673144.9643952241}]
[null,"Non-network",{"$f":"SUM('2.6 Non-network'!E33:E51)","v":10010777.788651586},{"$f":"SUM('2.6 Non-network'!F33:F51)","v":9119269.1594766434},{"$f":"SUM('2.6 Non-network'!G33:G51)","v":7946972.4963587532},{"$f":"SUM('2.6 Non-network'!H33:H51)","v":10226322.588837948},{"$f":"SUM('2.6 Non-network'!I33:I51)","v":7950527.6183963716},{"$f":"SUM('2.6 Non-network'!J33:J51)","v":7201127.0916383537},{"$f":"SUM('2.6 Non-network'!K33:K51)","v":6013304.871937654}]
[null,"Capitalised network overheads",{"$f":"dms_021001_capex_SCS_Values","v":6475998.7346166195},5428596.2173258206,6016764.3261085795,6436774.7906484399,6289386.6476132898,6280934.79889342,6151108.23997596]
[null,"Capitalised corporate overheads",{"$f":"'2.10 Overheads'!D29","v":5401761.2246925002},{"$f":"'2.10 Overheads'!E29","v":5428596.2173258206},{"$f":"'2.10 Overheads'!F29","v":6016764.3261085795},{"$f":"'2.10 Overheads'!G29","v":6436774.7906484399},{"$f":"'2.10 Overheads'!H29","v":6289386.6476132898},{"$f":"'2.10 Overheads'!I29","v":6280934.79889342},{"$f":"'2.10 Overheads'!J29","v":6151108.23997596}]
[null,"Total",{"$f":"SUM(C12:C17)","v":65913817.653495118},55472435.52563367,52228286.427009068,68100450.263962656,59069709.391808264,58199891.101990715,52175055.386098549]
[]
[null,"2.1.2 - PRESCRIBED TRANSMISSION SERVICES OPEX"]
[null,null,"EXPENDITURE"]
[null,null,{"$f":"CONCATENATE(\"Forecast  ($0's. real \",dms_DollarReal,\")\")","v":"Forecast  ($0's. real June 2024)"}]
[null,null,{"$f":"dms_y1","v":"2022-23"},{"$f":"dms_y2","v":"2023-24"},{"$f":"dms_y3","v":"2024-25"},{"$f":"dms_y4","v":"2025-26"},{"$f":"dms_y5","v":"2026-27"},{"$f":"dms_y6","v":"2027-28"},{"$f":"dms_y7","v":"2028-29"}]
[null,"Vegetation management"]
[null,"Maintenance"]
[null,"Non-network"]
[null,"Network overheads"]
[null,"Corporate overheads"]
[null,"Total",{"$f":"SUM(C24:C28)","v":0},0,0,0,0,0,0]
[]
[]
[null,"2.1.8 - PRESCRIBED TRANSMISSION SERVICES CAPITALISED OVERHEADS"]
[null,null,"EXPENDITURE"]
[null,null,{"$f":"CONCATENATE(\"Forecast  ($0's. real \",dms_DollarReal,\")\")","v":"Forecast  ($0's. real June 2024)"}]
[null,null,{"$f":"dms_y1","v":"2022-23"},{"$f":"dms_y2","v":"2023-24"},{"$f":"dms_y3","v":"2024-25"},{"$f":"dms_y4","v":"2025-26"},{"$f":"dms_y5","v":"2026-27"},{"$f":"dms_y6","v":"2027-28"},{"$f":"dms_y7","v":"2028-29"}]
[null,"Replacement expenditure",10808761.56297129,9880045.1155329999,11145684.234901417,11150688.769055357,10569504.520943567,12378521.945358871,9370991.8087306824]
[null,"Connections",0,0,0,0,0,0,0]
[null,"Augmentation Expenditure",1068998.39633782,977147.31911864819,887844.4173157363,1722860.8122415238,2009268.774283017,183347.65242795969,2931224.6712212395]
[null,"Non-network"]
[null,"Total",{"$f":"SUM(C36:C39)","v":11877759.95930911},10857192.434651649,12033528.652217153,12873549.581296882,12578773.295226585,12561869.597786831,12302216.479951922]

{"sheet":"2.2 Repex","index":4,"n_rows":66,"n_cols":10,"rows_kept":66,"cut":false,"hidden":false,"merged":[[5,1,5,2]]}
[null,{"$f":"(LOOKUP(dms_Model,dms_Model_List,dms_Worksheet_List))","v":"REGULATORY REPORTING STATEMENT"}]
[null,{"$f":"INDEX(dms_TradingNameFull_List,MATCH(dms_TradingName,dms_TradingName_List))","v":"TasNetworks (T)"}]
[null,{"$f":"CONCATENATE(\"REGULATORY PERIOD FROM \", FRCP_y1,\" TO \",dms_MultiYear_FinalYear_Result)","v":"REGULATORY PERIOD FROM 2024-25 TO 2028-29"}]
[null,"2.2 REPEX"]
[]
[null,"There is ONE table (with three sub-tables) on this worksheet. See the Instructions sheet on how to group or ungroup tables. "]
[]
[null,"2.2.1 - REPLACEMENT EXPENDITURE, VOLUMES AND ASSET FAILURES BY ASSET CATEGORY"]
[null,"EXPENDITURE"]
[null,null,null,"EXPENDITURE"]
[null,null,null,{"$f":"CONCATENATE(\"Forecast  ($0's. real \",dms_DollarReal,\")\")","v":"Forecast  ($0's. real June 2024)"}]
[null,"ASSET GROUP",null,{"$f":"dms_y1","v":"2022-23"},{"$f":"dms_y2","v":"2023-24"},{"$f":"dms_y3","v":"2024-25"},{"$f":"dms_y4","v":"2025-26"},{"$f":"dms_y5","v":"2026-27"},{"$f":"dms_y6","v":"2027-28"},{"$f":"dms_y7","v":"2028-29"}]
[null,"TRANSMISSION TOWERS","Total",3088158.332730873,550397.42752163997,2291071.9089115439,3826260.9108425654,0,0,0]
[null,"TRANSMISSION TOWER SUPPORT STRUCTURES","Total",6504331.9107274963,4976983.6008138396,8591519.6584182885,4014863.1208055257,4017608.7667049426,4018883.7293001562,5170132.9502355885]
[null,"CONDUCTORS","Total",-924.05979179441397,7089.8648226399982,916428.76356461761,917682.99904126336,918310.57524684421,918601.99526860728,919134.74670854933]
[null,"TRANSMISSION CABLES","Total",57292.588872570384,0,56997.811394145821,57166.531230707362,57250.952822033025,57290.154662005007,1204598.2288155949]
[null,"SUBSTATION SWITCHBAYS","Total",1432031.7845450065,10662312.578386879,5247555.9439885169,14734778.611132285,17590589.170467246,5140072.6762750894,409563.39779730223]
[null,"SUBSTATION POWER TRANSFORMERS","Total",567671.10392204928,1194569.91548396,0,0,343505.71693219815,18442833.984958626,9605788.6500063129]
[null,"SUBSTATION REACTIVE PLANT","Total",0,0,0,0,0,0,0]
[null,"SCADA, NETWORK CONTROL AND PROTECTION SYSTEMS","Total",12978111.152383402,12978111.152383402,8087164.724248711,12265482.527991049,6538181.7588712564,5961308.0210218634,6143654.9091426283]
[null,"OTHER","Total",3057275.9972174745,3057275.9972174745,5508227.3726300402,3820750.9547902821,3475295.9249345129,3361881.889927675,2733516.1871077754]
[]
[]
[null,"ASSET REPLACEMENTS"]
[null,null,null,"VOLUMES "]
[null,null,null,"(0's)"]
[null,"ASSET GROUP",null,{"$f":"dms_y1","v":"2022-23"},{"$f":"dms_y2","v":"2023-24"},{"$f":"dms_y3","v":"2024-25"},{"$f":"dms_y4","v":"2025-26"},{"$f":"dms_y5","v":"2026-27"},{"$f":"dms_y6","v":"2027-28"},{"$f":"dms_y7","v":"2028-29"}]
[null,"TRANSMISSION TOWERS","Total",2,0,1,18,1,1,1]
[null,"TRANSMISSION TOWER SUPPORT STRUCTURES","Total",1453,1503,1340,1611,1340,1340,1340]
[null,"CONDUCTORS","Total",12,0,6,12.234,6,6,6]
[null,"TRANSMISSION CABLES","Total",0,0,0,0,0,0,1]
[null,"SUBSTATION SWITCHBAYS","Total",22,54,20,30,46,6,18]
[null,"SUBSTATION POWER TRANSFORMERS","Total",2,4,1,0,0,5,2]
[null,"SUBSTATION REACTIVE PLANT","Total",0,0,0,0,0,0,0]
[null,"SCADA, NETWORK CONTROL AND PROTECTION SYSTEMS","Total",82.8,160.97999999999999,243.78899999999999,215.81790000000001,197.59969000000001,156,150.5256249]
[null,"OTHER","Total",0,0,0,0,0,0,0]
[]
[]
[null,"ASSET FAILURES"]
[null,null,null,"VOLUMES "]
[null,null,null,"(0's)"]
[null,"ASSET GROUP",null,{"$f":"dms_y1","v":"2022-23"},{"$f":"dms_y2","v":"2023-24"},{"$f":"dms_y3","v":"2024-25"},{"$f":"dms_y4","v":"2025-26"},{"$f":"dms_y5","v":"2026-27"},{"$f":"dms_y6","v":"2027-28"},{"$f":"dms_y7","v":"2028-29"}]
[null,"TRANSMISSION TOWERS","Total",1,0,0,0,0,0,0]
[null,"TRANSMISSION TOWER SUPPORT STRUCTURES","Total",0,0,0,0,0,0,0]
[null,"CONDUCTORS","Total",0,0,0,0,0,0,0]
[null,"TRANSMISSION CABLES","Total"]
[null,"SUBSTATION SWITCHBAYS","Total",0,1,0,0,1,0,1]
[null,"SUBSTATION POWER TRANSFORMERS","Total",0,0,0,0,0,0,0]
[null,"SUBSTATION REACTIVE PLANT","Total",0,0,0,0,0,0,0]
[null,"SCADA, NETWORK CONTROL AND PROTECTION SYSTEMS","Total",204.4,215.84,228.42400000000001,242.2664,257.49304000000001,274.242344,292.66657839999999]
[null,"OTHER","Total",0,0,0,0,0,0,0]
[]
[]
[null,"EXPENDITURE AS INCURRED"]
[null,null,null,"EXPENDITURE"]
[null,null,null,{"$f":"CONCATENATE(\"Forecast  ($0's. real \",dms_DollarReal,\")\")","v":"Forecast  ($0's. real June 2024)"}]
[null,"ASSET GROUP",null,{"$f":"dms_y1","v":"2022-23"},{"$f":"dms_y2","v":"2023-24"},{"$f":"dms_y3","v":"2024-25"},{"$f":"dms_y4","v":"2025-26"},{"$f":"dms_y5","v":"2026-27"},{"$f":"dms_y6","v":"2027-28"},{"$f":"dms_y7","v":"2028-29"}]
[null,"TRANSMISSION TOWERS","Total",3685191.2469505579,2972239.8722930602,2291071.9089115439,3826260.9108425654,0,0,0]
[null,"TRANSMISSION TOWER SUPPORT STRUCTURES","Total",8831407.3664583229,7122849.0854499871,8591519.6584182885,4014863.1208055257,4017608.7667049426,4018883.7293001562,5170132.9502355885]
[null,"CONDUCTORS","Total",682486.79013418988,550450.25183664798,916428.76356461761,917682.99904126336,918310.57524684421,918601.99526860728,919134.74670854933]
[null,"TRANSMISSION CABLES","Total",28190.627879543114,22736.759802598805,56997.811394145821,57166.531230707362,57250.952822033025,57290.154662005007,1204598.2288155949]
[null,"SUBSTATION SWITCHBAYS","Total",7288641.7575550796,5878552.8877481408,5247555.9439885169,14734778.611132285,17590589.170467246,5140072.6762750894,409563.39779730223]
[null,"SUBSTATION POWER TRANSFORMERS","Total",3559952.4669293752,2871230.2718159282,0,0,343505.71693219815,18442833.984958626,9605788.6500063129]
[null,"SUBSTATION REACTIVE PLANT","Total",0,0,0,0,0,0,0]
[null,"SCADA, NETWORK CONTROL AND PROTECTION SYSTEMS","Total",12978111.152383402,10467315.493079133,8087164.724248711,12265482.527991049,6538181.7588712564,5961308.0210218634,6143654.9091426283]
[null,"OTHER","Total",3057275.9972174745,2465803.5392474215,5508227.3726300402,3820750.9547902821,3475295.9249345129,3361881.889927675,2733516.1871077754]

{"sheet":"2.3 Augex (b)","index":5,"n_rows":15,"n_cols":9,"rows_kept":15,"cut":false,"hidden":false,"merged":[[5,1,5,3]]}
[null,{"$f":"(LOOKUP(dms_Model,dms_Model_List,dms_Worksheet_List))","v":"REGULATORY REPORTING STATEMENT"}]
[null,{"$f":"INDEX(dms_TradingNameFull_List,MATCH(dms_TradingName,dms_TradingName_List))","v":"TasNetworks (T)"}]
[null,{"$f":"CONCATENATE(\"REGULATORY PERIOD FROM \", FRCP_y1,\" TO \",dms_MultiYear_FinalYear_Result)","v":"REGULATORY PERIOD FROM 2024-25 TO 2028-29"}]
[null,"2.3 AUGEX PROJECTS"]
[]
[null,"There is ONE table on this worksheet."]
[]
[null,"2.3.4 - AUGEX - TOTAL EXPENDITURE"]
[null,null,"EXPENDITURE"]
[null,null,{"$f":"CONCATENATE(\"Forecast  ($0's. real \",dms_DollarReal,\")\")","v":"Forecast  ($0's. real June 2024)"}]
[null,"As incurred",{"$f":"dms_y1","v":"2022-23"},{"$f":"dms_y2","v":"2023-24"},{"$f":"dms_y3","v":"2024-25"},{"$f":"dms_y4","v":"2025-26"},{"$f":"dms_y5","v":"2026-27"},{"$f":"dms_y6","v":"2027-28"},{"$f":"dms_y7","v":"2028-29"}]
[null,"Substations",1489178.2111380217,1196508.5380775246,1023870.7463003865,4832253.1840721108,5065128.5697107241,0,7134408.3903377429]
[null,"Lines",1075691.5753137453,864284.84151496144,524948.34897690185,531339.25392204907,534537.04249555559,536021.9611514865,538736.57405748125]
[null,"Other assets",1349152.7135746868,1084002.3906399729,0,0,0,0,0]
[null,"Total ",{"$f":"SUM(C12:C14)","v":3914022.5000264542},3144795.7702324591,1548819.0952772885,5363592.4379941598,5599665.6122062793,536021.9611514865,7673144.9643952241]

{"sheet":"2.5 Connections","index":6,"n_rows":93,"n_cols":9,"rows_kept":93,"cut":false,"hidden":false,"merged":[]}
[null,{"$f":"(LOOKUP(dms_Model,dms_Model_List,dms_Worksheet_List))","v":"REGULATORY REPORTING STATEMENT"}]
[null,{"$f":"INDEX(dms_TradingNameFull_List,MATCH(dms_TradingName,dms_TradingName_List))","v":"TasNetworks (T)"}]
[null,{"$f":"CONCATENATE(\"REGULATORY PERIOD FROM \", FRCP_y1,\" TO \",dms_MultiYear_FinalYear_Result)","v":"REGULATORY PERIOD FROM 2024-25 TO 2028-29"}]
[null,"2.5 CONNECTIONS EXPENDITURE"]
[]
[null,"There are TWO tables on this worksheet. Each has been grouped (or sub-grouped).  See the Instructions sheet on how to group or ungroup data."]
[]
[null,"2.5.1 - EXPENDITURE ON CONNECTION PROJECTS"]
[null,null,"EXPENDITURE"]
[null,null,{"$f":"CONCATENATE(\"Forecast  ($0's. real \",dms_DollarReal,\")\")","v":"Forecast  ($0's. real June 2024)"}]
[null,null,{"$f":"dms_y1","v":"2022-23"},{"$f":"dms_y2","v":"2023-24"},{"$f":"dms_y3","v":"2024-25"},{"$f":"dms_y4","v":"2025-26"},{"$f":"dms_y5","v":"2026-27"},{"$f":"dms_y6","v":"2027-28"},{"$f":"dms_y7","v":"2028-29"}]
[null,"DIRECT MATERIALS EXPENDITURE"]
[null,"<Enter project description here…>"]
[]
[]
[]
[]
[]
[]
[]
[]
[]
[]
[]
[]
[]
[]
[]
[]
[]
[]
[]
[]
[]
[]
[]
[]
[null,"DIRECT LABOUR EXPENDITURE"]
[null,{"$f":"IF(ISBLANK(B13),\"\",B13)","v":"<Enter project description here…>"}]
[null,""]
[null,""]
[null,""]
[null,""]
[null,""]
[null,""]
[null,""]
[null,""]
[null,""]
[null,""]
[null,""]
[null,""]
[null,""]
[null,""]
[null,""]
[null,""]
[null,""]
[null,""]
[null,""]
[null,""]
[null,""]
[null,""]
[null,""]
[null,""]
[]
[]
[]
[null,"2.5.2 - DESCRIPTION OF CONNECTION PROJECTS"]
[null,null,"CONNECTION RATING \n(MVA)","CONNECTION \nVOLTAGE \n(KV)","UNDERGROUND / OVERHEAD\n(drop down)","YEAR CONNECTION PROJECT COMPLETED "]
[null,{"$f":"IF(ISBLANK(B13),\"\",B13)","v":"<Enter project description here…>"}]
[null,""]
[null,""]
[null,""]
[null,""]
[null,""]
[null,""]
[null,""]
[null,""]
[null,""]
[null,""]
[null,""]
[null,""]
[null,""]
[null,""]
[null,""]
[null,""]
[null,""]
[null,""]
[null,""]
[null,""]
[null,""]
[null,""]
[null,""]
[null,""]

{"sheet":"2.6 Non-network","index":7,"n_rows":114,"n_cols":11,"rows_kept":114,"cut":false,"hidden":false,"merged":[[59,1,59,3],[60,1,60,3],[61,1,61,3],[5,1,5,2],[20,1,30,1],[40,1,50,1]]}
[null,{"$f":"(LOOKUP(dms_Model,dms_Model_List,dms_Worksheet_List))","v":"REGULATORY REPORTING STATEMENT"}]
[null,{"$f":"INDEX(dms_TradingNameFull_List,MATCH(dms_TradingName,dms_TradingName_List))","v":"TasNetworks (T)"}]
[null,{"$f":"CONCATENATE(\"REGULATORY PERIOD FROM \", FRCP_y1,\" TO \",dms_MultiYear_FinalYear_Result)","v":"REGULATORY PERIOD FROM 2024-25 TO 2028-29"}]
[null,"2.6 NON NETWORK EXPENDITURE"]
[]
[null,"There are THREE tables on this worksheet - each has been 'grouped' for easy navigation. See the Instructions sheet on how to group or ungroup tables. "]
[]
[null,"2.6.1 - NON-NETWORK EXPENDITURE"]
[null,null,null,null,"EXPENDITURE"]
[null,null,null,null,{"$f":"CONCATENATE(\"Forecast  ($0's. real \",dms_DollarReal,\")\")","v":"Forecast  ($0's. real June 2024)"}]
[null,"SERVICE SUBCATEGORY","ASSET CATEGORY",null,{"$f":"dms_y1","v":"2022-23"},{"$f":"dms_y2","v":"2023-24"},{"$f":"dms_y3","v":"2024-25"},{"$f":"dms_y4","v":"2025-26"},{"$f":"dms_y5","v":"2026-27"},{"$f":"dms_y6","v":"2027-28"},{"$f":"dms_y7","v":"2028-29"}]
[null,"OPEX"]
[null,"IT & COMMUNICATIONS","Total IT and communications",null,4314650.3395781815,4343987.1061333157,6035366.4727756754,7332171.8003647309,7968337.3034690283,8061538.3909266414,8081487.0292337062]
[null,"MOTOR VEHICLES","Car",null,12988.398200868454,13076.71071195394,13168.972929755557,13266.137846327154,13305.399301163145,13296.805817885454,13291.563749991696]
[null,null,"Light commercial vehicle",null,285886.71012621943,287830.55053415569,289861.32765604043,292000.0177322721,292864.19882560201,292675.0482756428,292559.66549162054]
[null,null,"Elevated work platform (LCV)  ",null,0,0,0,0,0,0,0]
[null,null,"Elevated work platform (HCV)",null,39036.169456162024,39301.589571446275,39578.880389975719,39870.906095518774,39988.905003495791,39963.077594737711,39947.322745876678]
[null,null,"Heavy commercial vehicle",null,28460.916276219945,28654.431669363556,28856.601884327752,29069.515171460047,29155.547102548746,29136.716573617854,29125.229856539176]
[null,"BUILDINGS AND PROPERTY","Total buildings and property expenditure",null,1112367.8724596533,1119931.2377452329,1127832.8685188822,1136154.3820614251,1139516.8583506614,1138780.8850179389,1138331.9375942387]
[null,"OTHER","Other expenditure",null,0,0,0,0,0,0,0]
[null,"OTHER - TNSP nominated",null,null,0,0,0,0,0,0,0]
[]
[]
[]
[]
[]
[]
[]
[]
[]
[]
[null,"CAPEX"]
[null,"IT & COMMUNICATIONS","Total IT and communications",null,8058191.9770127386,7614940.5812716922,6087202.2037849836,7264727.3865281874,5300548.6007472724,4383690.919512379,3734244.9748612731]
[null,"MOTOR VEHICLES","Car",null,68724.808447402931,56285.242360643126,113316.27233852723,361970.0296441454,171891.63923235727,310664.57043500588,286291.57201472274]
[null,null,"Light commercial vehicle",null,334460.73444402759,125559.38680451158,528809.27091312699,1327147.6006889888,1371544.4373908029,1147620.2835600085,812179.97638005274]
[null,null,"Elevated work platform (LCV)  "]
[null,null,"Elevated work platform (HCV)",null,27501.098144562377,251112.11263359591,428083.69550110283,310260.02540926752,105239.77912185139,190202.79822551383,194756.17143858693]
[null,null,"Heavy commercial vehicle",null,27489.923378961172,0,188860.45389754538,0,140319.70549580184,253603.73096735176,245392.77601261955]
[null,"BUILDINGS AND PROPERTY","Total buildings and property expenditure",null,1494409.2472238925,1071371.8364061995,600700.5999234675,962217.54656735831,860983.45640828589,915344.78893809416,740439.40123039857]
[null,"OTHER","Other expenditure"]
[null,"OTHER - TNSP nominated"]
[]
[]
[]
[]
[]
[]
[]
[]
[]
[]
[]
[]
[]
[null,"2.6.3 - ANNUAL DESCRIPTOR METRICS"]
[null,"IT & COMMUNICATIONS"]
[null,null,null,null,"VOLUMES "]
[null,null,null,null,"(0's)"]
[null,null,null,null,{"$f":"dms_y1","v":"2022-23"},{"$f":"dms_y2","v":"2023-24"},{"$f":"dms_y3","v":"2024-25"},{"$f":"dms_y4","v":"2025-26"},{"$f":"dms_y5","v":"2026-27"},{"$f":"dms_y6","v":"2027-28"},{"$f":"dms_y7","v":"2028-29"}]
[null,"Employee numbers",null,null,245.28,207.83099999999999,207.83099999999999,207.83099999999999,207.83099999999999,207.83099999999999,207.83099999999999]
[null,"User numbers",null,null,244,207,207,207,207,207,207]
[null,"Number of devices",null,null,610,517,517,517,517,517,517]
[]
[null,"MOTOR VEHICLES"]
[null,null,null,null,"VOLUMES"]
[null,null,null,null,"  (0's or %)"]
[null,null,null,"Units",{"$f":"dms_y1","v":"2022-23"},{"$f":"dms_y2","v":"2023-24"},{"$f":"dms_y3","v":"2024-25"},{"$f":"dms_y4","v":"2025-26"},{"$f":"dms_y5","v":"2026-27"},{"$f":"dms_y6","v":"2027-28"},{"$f":"dms_y7","v":"2028-29"}]
[null,"CAR","Average kilometres travelled ","0's",3955,3955,3955,3955,3955,3955,3955]
[null,null,"Number purchased","0's",8.5365021580745264,1.8970004795721171,0.94850023978605857,4.5579118959182612,1.9032255025058271,4.0467679030225581,4.910220257286424]
[null,null,"Number leased","0's"]
[null,null,"Number in fleet","0's",5,5,5,9,8,8,7]
[null,null,"Proportion of total fleet expenditure allocated as regulatory expenditure","%",0.18970004795721171,0.18970004795721171,0.18970004795721171,0.30386079306121738,0.27188935750083243,0.289054850215897,0.23382001225173446]
[null,"LIGHT COMMERCIAL VEHICLE","Average kilometres travelled ","0's",5070,5070,5070,5070,5070,5070,5070]
[null,null,"Number purchased","0's",28.455007193581757,4.9322012468875043,4.7425011989302925,12.154431722448695,11.14746365753413,11.562194008635879,10.755720563579786]
[null,null,"Number leased","0's"]
[null,null,"Number in fleet","0's",70,70,70,113,101,107,87]
[null,null,"Proportion of total fleet expenditure allocated as regulatory expenditure","%",0.18970004795721171,0.18970004795721171,0.18970004795721171,0.30386079306121738,0.27188935750083243,0.289054850215897,0.23382001225173446]
[null,"ELEVATED WORK PLATFORM (LCV) ","Average kilometres travelled ","0's"]
[null,null,"Number purchased","0's"]
[null,null,"Number leased","0's"]
[null,null,"Number in fleet","0's"]
[null,null,"Proportion of total fleet expenditure allocated as regulatory expenditure","%"]
[null,"ELEVATED WORK PLATFORM (HCV)","Average kilometres travelled ","0's",3787,3787,3787,3787,3787,3787,3787]
[null,null,"Number purchased","0's",0.75880019182884684,3.0352007673153873,1.3279003357004819,0.91158237918365215,0.27188935750083243,0.57810970043179399,1.1691000612586724]
[null,null,"Number leased","0's"]
[null,null,"Number in fleet","0's",10,10,10,17,15,16,13]
[null,null,"Proportion of total fleet expenditure allocated as regulatory expenditure","%",0.18970004795721171,0.18970004795721171,0.18970004795721171,0.30386079306121738,0.27188935750083243,0.289054850215897,0.23382001225173446]
[null,"HEAVY COMMERCIAL VEHICLE ","Average kilometres travelled ","0's",3150,3150,3150,3150,3150,3150,3150]
[null,null,"Number purchased","0's",1.1382002877432702,0,0.5691001438716351,0,0.37940009591442342,0.75880019182884684,1.3279003357004819]
[null,null,"Number leased","0's"]
[null,null,"Number in fleet","0's",7,7,7,11,10,10,8]
[null,null,"Proportion of total fleet expenditure allocated as regulatory expenditure","%",0.18970004795721171,0.18970004795721171,0.18970004795721171,0.30386079306121738,0.27188935750083243,0.289054850215897,0.23382001225173446]
[]
[]
[]
[null,"2.6.4 -  INFORMATION & COMMUNICATIONS TECHNOLOGY - CAPEX BY PURPOSE"]
[null,null,null,null,"EXPENDITURE"]
[null,null,null,null,{"$f":"CONCATENATE(\"Forecast  ($0's. real \",dms_DollarReal,\")\")","v":"Forecast  ($0's. real June 2024)"}]
[null,null,null,null,{"$f":"dms_y1","v":"2022-23"},{"$f":"dms_y2","v":"2023-24"},{"$f":"dms_y3","v":"2024-25"},{"$f":"dms_y4","v":"2025-26"},{"$f":"dms_y5","v":"2026-27"},{"$f":"dms_y6","v":"2027-28"},{"$f":"dms_y7","v":"2028-29"}]
[null,"RECURRENT"]
[null,"Client Device",null,null,1081367.843499389,1009794.4274844441,202052.58006409497,164208.46464514665,739258.9307538562,147981.80260801222,172428.43794730571]
[null,"Hardware and Software",null,null,2763223.552756968,2508172.0769893765,2496600.306673219,3489914.9500937383,2096569.3107592654,2272742.3691157405,2243340.2903175047]
[null,"Software",null,null,152671.60048176273,93594.812075673748,233233.51988537487,221029.06610959367,227246.61497039039,213863.28295756233,214106.41277013064]
[]
[]
[]
[]
[]
[]
[]
[null,"NON-RECURRENT"]
[null,"Maintaining existing services, functionalities, capability and/or market benefits",null,null,1411859.6495428665,1191286.7274362734,278800.32003733353,264211.48383471183,271643.75434664259,255645.72263072059,255936.3526807579]
[null,"Complying with new / altered regulatory obligations / requirements",null,null,2313311.3316895687,1934292.7828972575,1633075.7479835604,1826732.5838350367,1965829.9899171391,1493457.7422003413,848433.48114557564]
[null,"New or expanded ICT capability, functions and services",null,null,0,790522.49844287999,1243439.7291414058,1298630.8380099612,0,0,0]

{"sheet":"2.10 Overheads","index":8,"n_rows":32,"n_cols":10,"rows_kept":32,"cut":false,"hidden":false,"merged":[[5,1,5,2]]}
[null,{"$f":"(LOOKUP(dms_Model,dms_Model_List,dms_Worksheet_List))","v":"REGULATORY REPORTING STATEMENT"}]
[null,{"$f":"INDEX(dms_TradingNameFull_List,MATCH(dms_TradingName,dms_TradingName_List))","v":"TasNetworks (T)"}]
[null,{"$f":"CONCATENATE(\"REGULATORY PERIOD FROM \", FRCP_y1,\" TO \",dms_MultiYear_FinalYear_Result)","v":"REGULATORY PERIOD FROM 2024-25 TO 2028-29"}]
[null,"2.10 OVERHEADS"]
[]
[null,"There are TWO tables on this worksheet. Each has been grouped (and sub-grouped)  for ease of navigation. See the Instructions sheet on how to group or ungroup tables. "]
[]
[null,"2.10.1 - NETWORK OVERHEADS EXPENDITURE"]
[null,null,null,"EXPENDITURE"]
[null,null,null,{"$f":"CONCATENATE(\"Forecast  ($0's. real \",dms_DollarReal,\")\")","v":"Forecast  ($0's. real June 2024)"}]
[null,null,null,{"$f":"dms_y1","v":"2022-23"},{"$f":"dms_y2","v":"2023-24"},{"$f":"dms_y3","v":"2024-25"},{"$f":"dms_y4","v":"2025-26"},{"$f":"dms_y5","v":"2026-27"},{"$f":"dms_y6","v":"2027-28"},{"$f":"dms_y7","v":"2028-29"}]
[null,"OPEX"]
[null,"Prescribed Transmission Services","Total  ",13134694.24258819,13134694.24258819,13390978.446494484,13381730.276835581,13395247.046279762,13334826.511819769,13237815.344014978]
[null,"CAPEX"]
[null,"Prescribed Transmission Services","Total  ",6475998.7346166195,5428596.2173258206,6016764.3261085795,6436774.7906484399,6289386.6476132898,6280934.79889342,6151108.23997596]
[null,"OTHER TRANSMISSION SERVICES"]
[null,"Negotiated Services","Total  "]
[null,"Unregulated Services","Total  "]
[]
[]
[]
[null,"2.10.2 - CORPORATE OVERHEADS EXPENDITURE"]
[null,null,null,"EXPENDITURE"]
[null,null,null,{"$f":"CONCATENATE(\"Forecast  ($0's. real \",dms_DollarReal,\")\")","v":"Forecast  ($0's. real June 2024)"}]
[null,null,null,{"$f":"dms_y1","v":"2022-23"},{"$f":"dms_y2","v":"2023-24"},{"$f":"dms_y3","v":"2024-25"},{"$f":"dms_y4","v":"2025-26"},{"$f":"dms_y5","v":"2026-27"},{"$f":"dms_y6","v":"2027-28"},{"$f":"dms_y7","v":"2028-29"}]
[null,"OPEX"]
[null,"Prescribed Transmission Services","Total",8222485.4817951936,8222485.4817951936,10225577.165787149,11530440.687078543,12202163.929092746,12275664.676286172,12239746.145520497]
[null,"CAPEX"]
[null,"Prescribed Transmission Services","Total",5401761.2246925002,5428596.2173258206,6016764.3261085795,6436774.7906484399,6289386.6476132898,6280934.79889342,6151108.23997596]
[null,"OTHER TRANSMISSION SERVICES"]
[null,"Negotiated Services","Total"]
[null,"Unregulated Services","Total"]

{"sheet":"2.11 Labour","index":9,"n_rows":31,"n_cols":9,"rows_kept":31,"cut":false,"hidden":false,"merged":[[5,1,5,2],[7,1,7,2]]}
[null,{"$f":"(LOOKUP(dms_Model,dms_Model_List,dms_Worksheet_List))","v":"REGULATORY REPORTING STATEMENT"}]
[null,{"$f":"INDEX(dms_TradingNameFull_List,MATCH(dms_TradingName,dms_TradingName_List))","v":"TasNetworks (T)"}]
[null,{"$f":"CONCATENATE(\"REGULATORY PERIOD FROM \", FRCP_y1,\" TO \",dms_MultiYear_FinalYear_Result)","v":"REGULATORY PERIOD FROM 2024-25 TO 2028-29"}]
[null,"2.11 LABOUR"]
[]
[null,"There is ONE table on this worksheet. The table has been 'grouped' (and sub-grouped) for easy navigation.  See the Instructions sheet on how to group or ungroup data."]
[]
[null,"Table numbering in this template starts at 2.11.3.\n\nTables 2.11.1 & 2.11.2 appear in the Category Analysis RIN and are not required for this RIN."]
[]
[null,"2.11.3 - LABOUR / NON-LABOUR EXPENDITURE SPLIT"]
[null,"OPEX"]
[null,null,"EXPENDITURE"]
[null,null,{"$f":"CONCATENATE(\"Forecast  ($0's. real \",dms_DollarReal,\")\")","v":"Forecast  ($0's. real June 2024)"}]
[null,null,{"$f":"dms_y1","v":"2022-23"},{"$f":"dms_y2","v":"2023-24"},{"$f":"dms_y3","v":"2024-25"},{"$f":"dms_y4","v":"2025-26"},{"$f":"dms_y5","v":"2026-27"},{"$f":"dms_y6","v":"2027-28"},{"$f":"dms_y7","v":"2028-29"}]
[null,"In-house labour expenditure"]
[null,"Labour expenditure outsourced to related parties"]
[null,"Labour expenditure outsourced to unrelated parties"]
[null,"Controllable non-labour expenditure"]
[null,"Uncontrollable non-labour expenditure"]
[null,"Total",{"$f":"SUM(C15:C19)","v":0},0,0,0,0,0,0]
[]
[null,"CAPEX"]
[null,null,"EXPENDITURE"]
[null,null,{"$f":"CONCATENATE(\"Forecast  ($0's. real \",dms_DollarReal,\")\")","v":"Forecast  ($0's. real June 2024)"}]
[null,null,{"$f":"dms_y1","v":"2022-23"},{"$f":"dms_y2","v":"2023-24"},{"$f":"dms_y3","v":"2024-25"},{"$f":"dms_y4","v":"2025-26"},{"$f":"dms_y5","v":"2026-27"},{"$f":"dms_y6","v":"2027-28"},{"$f":"dms_y7","v":"2028-29"}]
[null,"In-house labour expenditure"]
[null,"Labour expenditure outsourced to related parties"]
[null,"Labour expenditure outsourced to unrelated parties"]
[null,"Controllable non-labour expenditure"]
[null,"Uncontrollable non-labour expenditure"]
[null,"Total",{"$f":"SUM(C26:C30)","v":0},0,0,0,0,0,0]

{"sheet":"2.14 Forecast price changes","index":10,"n_rows":16,"n_cols":9,"rows_kept":16,"cut":false,"hidden":false,"merged":[[6,2,6,3],[6,4,6,8]]}
[null,{"$f":"(LOOKUP(dms_Model,dms_Model_List,dms_Worksheet_List))","v":"REGULATORY REPORTING STATEMENT"}]
[null,{"$f":"INDEX(dms_TradingNameFull_List,MATCH(dms_TradingName,dms_TradingName_List))","v":"TasNetworks (T)"}]
[null,{"$f":"CONCATENATE(\"REGULATORY PERIOD FROM \", FRCP_y1,\" TO \",dms_MultiYear_FinalYear_Result)","v":"REGULATORY PERIOD FROM 2024-25 TO 2028-29"}]
[null,"2.14 FORECAST PRICE CHANGES"]
[]
[null,"2.14.2 - FORECAST CAPEX AND OPEX PRICE CHANGES"]
[null,null,"Price changes\n(% YoY real)\nCurrent regulatory period",null,"Price changes\n(%YoY real)\nForthcoming regulatory period "]
[null,null,"FORECAST"]
[null,null,{"$f":"dms_y1","v":"2022-23"},{"$f":"dms_y2","v":"2023-24"},{"$f":"dms_y3","v":"2024-25"},{"$f":"dms_y4","v":"2025-26"},{"$f":"dms_y5","v":"2026-27"},{"$f":"dms_y6","v":"2027-28"},{"$f":"dms_y7","v":"2028-29"}]
[null,"OPEX"]
[null,"Forecast output change",2.0475276484367005E-3,2.2276655192234609E-3,3.56846899538486E-3,3.8368966862349298E-3,3.74672479781233E-3,2.4156128028916799E-3,1.05981519904691E-3]
[null,"Forecast price change",2.9977282537189303E-3,3.3322573837891107E-3,9.2613039924406004E-3,8.5707424171394403E-3,4.2369223412935097E-3,1.9556787475285401E-3,3.5653156481030598E-3]
[null,"Forecast productivity change",null,null,-0.03,-5.0000000000000001E-3,-5.0000000000000001E-3,-5.0000000000000001E-3,-5.0000000000000001E-3]
[null,"CAPEX"]
[null,"Real Cost Escalation - Network overheads",-1.0111599581452024E-2,-1.2188013019100996E-2,-9.0595341775150384E-3,-6.1262406115639712E-3,-4.658521606438093E-3,-3.9769745678279733E-3,-2.7310232292390157E-3]
[null,"Real Cost Escalation - Corporate overheads",-1.0111599581452024E-2,-1.2188013019100996E-2,-9.0595341775150384E-3,-6.1262406115639712E-3,-4.658521606437982E-3,-3.9769745678279733E-3,-2.7310232292390157E-3]

{"sheet":"2.16 Opex Summary","index":11,"n_rows":60,"n_cols":13,"rows_kept":60,"cut":false,"hidden":false,"merged":[[8,10,8,11],[23,1,23,8],[5,10,5,12],[6,1,6,8],[6,10,6,11],[6,12,7,12],[7,1,7,8],[7,10,7,11]]}
[null,{"$f":"(LOOKUP(dms_Model,dms_Model_List,dms_Worksheet_List))","v":"REGULATORY REPORTING STATEMENT"}]
[null,{"$f":"INDEX(dms_TradingNameFull_List,MATCH(dms_TradingName,dms_TradingName_List))","v":"TasNetworks (T)"}]
[null,{"$f":"CONCATENATE(\"REGULATORY PERIOD FROM \", FRCP_y1,\" TO \",dms_MultiYear_FinalYear_Result)","v":"REGULATORY PERIOD FROM 2024-25 TO 2028-29"}]
[null,"2.16 OPEX SUMMARY"]
[]
[null,"Instructions",null,null,null,null,null,null,null,null,"IMPORTANT!"]
[null,{"$f":"CONCATENATE(\"Complete the tables below in accordance with the regulatory information notice.\n\n\",dms_TradingName, \"'s total forecast opex must reconcile to Table 2.16.1. If \",dms_TradingName,\" did not forecast its total opex using a Base Year approach, total forecast opex must reconcile to Table 2.16.2\")","v":"Complete the tables below in accordance with the regulatory information notice.\n\nTasNetworks (T)'s total forecast opex must reconcile to Table 2.16.1. If TasNetworks (T) did not forecast its total opex using a Base Year approach, total forecast opex must reconcile to Table 2.16.2"},null,null,null,null,null,null,null,null,{"$f":"CONCATENATE(\"Has \",dms_TradingName,\" used a base-step-trend model to derive its opex forecast? \")","v":"Has TasNetworks (T) used a base-step-trend model to derive its opex forecast? "},null,"Yes"]
[null,"The total step changes and category specific forecasts in Table 2.16.1 must reconcile (in each year) to the total step changes and category secific forecasts for each year in Tables 2.17.1 and 2.17.5 of worksheet 2.17 Step Changes.\")",null,null,null,null,null,null,null,null,"Yes /  No"]
[null,null,null,null,null,null,null,null,null,null,"Please nominate the base year.",null,"2021-22"]
[]
[null,"2.16.1 - PRESCRIBED TRANSMISSION SERVICES - OPEX BY DRIVER"]
[null,null,"EXPENDITURE"]
[null,null,{"$f":"CONCATENATE(\"Forecast  ($0's. real \",dms_DollarReal,\")\")","v":"Forecast  ($0's. real June 2024)"}]
[null,null,{"$f":"CRCP_y1","v":"2019-20"},{"$f":"CRCP_y2","v":"2020-21"},{"$f":"CRCP_y3","v":"2021-22"},{"$f":"CRCP_y4","v":"2022-23"},{"$f":"CRCP_y5","v":"2023-24"},{"$f":"FRCP_y1","v":"2024-25"},{"$f":"FRCP_y2","v":"2025-26"},{"$f":"FRCP_y3","v":"2026-27"},{"$f":"FRCP_y4","v":"2027-28"},{"$f":"FRCP_y5","v":"2028-29"}]
[null,"Base year total opex, excluding category specific",null,null,36589612.780818097,38318664.678711995,38562161.504149802,37709253.897210285,37246341.317761138,37903950.5499897,37867497.860340491,37910840.324432008]
[null,"Increment from base year to final year",null,null,null,null,null,377168.90057491523]
[null,"Price growth",null,null,null,null,null,209184.35220731207,193638.47092793588,95716.033293520799,44122.019837983265,80328.204641793884]
[null,"Output growth",null,null,null,null,null,34298.745129298994,36878.768373448125,36012.071024293757,23217.936870015332,10186.534181263331]
[null,"Productivity growth",null,null,null,null,null,-1165428.5594141833,-53249.222391052434,-504012.17429449898,-432251.29764737625,-519157.4520840827]
[null,"Step changes",null,null,null,null,null,2633619.0934106628,4144813.8113944498,4982588.2829710329,5160299.1896756813,5198683.2377054458]
[null,"Category specific"]
[null,"Total opex",{"$f":"SUM(C15:C21)","v":0},0,36589612.780818097,38318664.678711995,38562161.504149802,39798096.429118291,41568423.146065921,42514254.762984045,42662885.709076792,42680880.848876439]
[]
[]
[]
[null,"2.16.2 - PRESCRIBED TRANSMISSION SERVICES - OPEX BY CATEGORY"]
[null,null,"EXPENDITURE"]
[null,null,{"$f":"CONCATENATE(\"Forecast  ($0's. real \",dms_DollarReal,\")\")","v":"Forecast  ($0's. real June 2024)"}]
[null,null,{"$f":"CRCP_y1","v":"2019-20"},{"$f":"CRCP_y2","v":"2020-21"},{"$f":"CRCP_y3","v":"2021-22"},{"$f":"CRCP_y4","v":"2022-23"},{"$f":"CRCP_y5","v":"2023-24"},{"$f":"FRCP_y1","v":"2024-25"},{"$f":"FRCP_y2","v":"2025-26"},{"$f":"FRCP_y3","v":"2026-27"},{"$f":"FRCP_y4","v":"2027-28"},{"$f":"FRCP_y5","v":"2028-29"}]
[]
[]
[]
[]
[]
[]
[]
[]
[]
[]
[]
[]
[]
[]
[]
[]
[]
[]
[]
[]
[]
[]
[]
[]
[]
[]
[]
[]
[]
[]
[null,"Total opex",{"$f":"SUM(C30:C59)","v":0},0,0,0,0,0,0,0,0,0]

{"sheet":"2.17 Step Changes","index":12,"n_rows":69,"n_cols":12,"rows_kept":69,"cut":false,"hidden":false,"merged":[[68,1,68,2],[46,1,46,2],[67,1,67,2],[23,1,23,2],[24,1,24,2]]}
[null,{"$f":"(LOOKUP(dms_Model,dms_Model_List,dms_Worksheet_List))","v":"REGULATORY REPORTING STATEMENT"}]
[null,{"$f":"INDEX(dms_TradingNameFull_List,MATCH(dms_TradingName,dms_TradingName_List))","v":"TasNetworks (T)"}]
[null,{"$f":"CONCATENATE(\"REGULATORY PERIOD FROM \", FRCP_y1,\" TO \",dms_MultiYear_FinalYear_Result)","v":"REGULATORY PERIOD FROM 2024-25 TO 2028-29"}]
[null,"2.17 STEP CHANGES"]
[]
[null,"2.17.1 - STEP CHANGES FOR PRESCRIBED TRANSMISSION SERVICES - FORECAST OPEX "]
[null,null,null,null,null,"EXPENDITURE"]
[null,null,null,null,null,{"$f":"CONCATENATE(\"Forecast  ($0's. real \",dms_DollarReal,\")\")","v":"Forecast  ($0's. real June 2024)"}]
[null,"Step change","Description",{"$f":"CRCP_y1","v":"2019-20"},{"$f":"CRCP_y2","v":"2020-21"},{"$f":"dms_y1","v":"2022-23"},{"$f":"dms_y2","v":"2023-24"},{"$f":"dms_y3","v":"2024-25"},{"$f":"dms_y4","v":"2025-26"},{"$f":"dms_y5","v":"2026-27"},{"$f":"dms_y6","v":"2027-28"},{"$f":"dms_y7","v":"2028-29"}]
[null,"Insurance","forecast increases of insurance premiums that are not captured in the base opex or the forecast rate of change.\n\n",null,null,null,null,972888.55684046471,1219555.417774457,1434206.7527357154,1515861.8800516278,1532555.9133807088]
[null,"Cybersecurity","opex associated with meeting new cyber security / security of critical infrastructure obligations\n",null,null,null,null,1660730.5365701979,2925258.3936199932,3548381.5302353175,3644437.3096240545,3666127.3243247373]
[]
[]
[]
[]
[]
[]
[]
[]
[]
[]
[]
[]
[null,"Total",null,{"$f":"SUM(D17:D23)","v":0},0,{"$f":"SUM(F10:F23)","v":0},{"$f":"SUM(G10:G23)","v":0},2633619.0934106624,4144813.8113944503,4982588.2829710329,5160299.1896756822,5198683.2377054458]
[null,"Check",null,null,null,null,null,{"$f":"IF(ROUND(H$24,0)-ROUND('2.16 Opex Summary'!C$20,0)=0,\"OK\",\"Error\")","v":"Error"},{"$f":"IF(ROUND(I$24,0)-ROUND('2.16 Opex Summary'!D$20,0)=0,\"OK\",\"Error\")","v":"Error"},{"$f":"IF(ROUND(J$24,0)-ROUND('2.16 Opex Summary'!E$20,0)=0,\"OK\",\"Error\")","v":"Error"},{"$f":"IF(ROUND(K$24,0)-ROUND('2.16 Opex Summary'!F$20,0)=0,\"OK\",\"Error\")","v":"Error"},{"$f":"IF(ROUND(L$24,0)-ROUND('2.16 Opex Summary'!G$20,0)=0,\"OK\",\"Error\")","v":"Error"}]
[]
[]
[null,"2.17.2 - STEP CHANGES FOR PRESCRIBED TRANSMISSION SERVICES - FORECAST CAPEX"]
[null,null,null,null,null,"EXPENDITURE"]
[null,null,null,null,null,{"$f":"CONCATENATE(\"Forecast  ($0's. real \",dms_DollarReal,\")\")","v":"Forecast  ($0's. real June 2024)"}]
[null,"Step change","Description",{"$f":"CRCP_y1","v":"2019-20"},{"$f":"CRCP_y2","v":"2020-21"},{"$f":"dms_y1","v":"2022-23"},{"$f":"dms_y2","v":"2023-24"},{"$f":"dms_y3","v":"2024-25"},{"$f":"dms_y4","v":"2025-26"},{"$f":"dms_y5","v":"2026-27"},{"$f":"dms_y6","v":"2027-28"},{"$f":"dms_y7","v":"2028-29"}]
[]
[]
[]
[]
[]
[]
[]
[]
[]
[]
[]
[]
[]
[]
[]
[null,"Total",null,{"$f":"SUM(D32:D46)","v":0},0,0,0,0,0,0,0,0]
[]
[]
[null,"2.17.5 - CATEGORY SPECIFIC OPEX FOR PRESCRIBED TRANSMISSION SERVICES"]
[null,null,null,null,null,"EXPENDITURE"]
[null,null,null,null,null,{"$f":"CONCATENATE(\"Forecast  ($0's. real \",dms_DollarReal,\")\")","v":"Forecast  ($0's. real June 2024)"}]
[null,"Category","Description",{"$f":"CRCP_y1","v":"2019-20"},{"$f":"CRCP_y2","v":"2020-21"},{"$f":"dms_y1","v":"2022-23"},{"$f":"dms_y2","v":"2023-24"},{"$f":"dms_y3","v":"2024-25"},{"$f":"dms_y4","v":"2025-26"},{"$f":"dms_y5","v":"2026-27"},{"$f":"dms_y6","v":"2027-28"},{"$f":"dms_y7","v":"2028-29"}]
[]
[]
[]
[]
[]
[]
[]
[]
[]
[]
[]
[]
[]
[]
[null,"Total",null,{"$f":"SUM(D61:D67)","v":0},0,{"$f":"SUM(F54:F67)","v":0},{"$f":"SUM(G54:G67)","v":0},0,0,0,0,0]
[null,"Check",null,null,null,null,null,{"$f":"IF(ROUND(H$68,0)-ROUND('2.16 Opex Summary'!C$21,0)=0,\"OK\",\"Error\")","v":"OK"},{"$f":"IF(ROUND(I$68,0)-ROUND('2.16 Opex Summary'!D$21,0)=0,\"OK\",\"Error\")","v":"OK"},{"$f":"IF(ROUND(J$68,0)-ROUND('2.16 Opex Summary'!E$21,0)=0,\"OK\",\"Error\")","v":"OK"},{"$f":"IF(ROUND(K$68,0)-ROUND('2.16 Opex Summary'!F$21,0)=0,\"OK\",\"Error\")","v":"OK"},{"$f":"IF(ROUND(L$68,0)-ROUND('2.16 Opex Summary'!G$21,0)=0,\"OK\",\"Error\")","v":"OK"}]

{"sheet":"3.1 Revenue","index":13,"n_rows":43,"n_cols":9,"rows_kept":43,"cut":false,"hidden":false,"merged":[]}
[null,{"$f":"(LOOKUP(dms_Model,dms_Model_List,dms_Worksheet_List))","v":"REGULATORY REPORTING STATEMENT"}]
[null,{"$f":"INDEX(dms_TradingNameFull_List,MATCH(dms_TradingName,dms_TradingName_List))","v":"TasNetworks (T)"}]
[null,{"$f":"CONCATENATE(\"REGULATORY PERIOD FROM \", FRCP_y1,\" TO \",dms_MultiYear_FinalYear_Result)","v":"REGULATORY PERIOD FROM 2024-25 TO 2028-29"}]
[null,"3.1 REVENUE"]
[]
[]
[null,"3.1.1 - REVENUE GROUPING BY CHARGEABLE QUANTITY"]
[null,null,"REVENUE"]
[null,null,{"$f":"CONCATENATE(\"Forecast  ($0's. real \",dms_DollarReal,\")\")","v":"Forecast  ($0's. real June 2024)"}]
[null,null,{"$f":"dms_y1","v":"2022-23"},{"$f":"dms_y2","v":"2023-24"},{"$f":"dms_y3","v":"2024-25"},{"$f":"dms_y4","v":"2025-26"},{"$f":"dms_y5","v":"2026-27"},{"$f":"dms_y6","v":"2027-28"},{"$f":"dms_y7","v":"2028-29"}]
["TREV0101","From Fixed Customer (Exit Point) Charges"]
["TREV0102","From Variable Customer (Exit Point) Charges"]
["TREV0103","From Fixed Generator (Entry Point) Charges"]
["TREV0104","From Variable Generator (Entry Point) Charges"]
["TREV0105","From Fixed Energy Usage Charges (Charge per day basis)"]
["TREV0106","From Variable Energy Usage charges (Charge per kWh basis)"]
["TREV0107","From Energy based Common Service and General Charges"]
["TREV0108","From Fixed Demand based Usage Charges"]
["TREV0109","From Variable Demand based Usage Charges"]
["TREV0110","Revenue from other Sources"]
["TREV01","Total",{"$f":"SUM(C11:C20)","v":0},0,0,0,0,0,0]
[]
[]
[null,"3.1.2 - REVENUE GROUPING BY TYPE OF CONNECTED EQUIPMENT"]
[null,null,"REVENUE"]
[null,null,{"$f":"CONCATENATE(\"Forecast  ($0's. real \",dms_DollarReal,\")\")","v":"Forecast  ($0's. real June 2024)"}]
[null,null,{"$f":"dms_y1","v":"2022-23"},{"$f":"dms_y2","v":"2023-24"},{"$f":"dms_y3","v":"2024-25"},{"$f":"dms_y4","v":"2025-26"},{"$f":"dms_y5","v":"2026-27"},{"$f":"dms_y6","v":"2027-28"},{"$f":"dms_y7","v":"2028-29"}]
["TREV0201","From Other connected transmission networks"]
["TREV0202","From Distribution networks"]
["TREV0203","From Directly connected end–users"]
["TREV0204","From Generators"]
["TREV0205","Other revenue"]
["TREV02","Total",{"$f":"SUM(C28:C32)","v":0},0,0,0,0,0,0]
[]
[]
[null,"3.1.3 - REVENUE (penalties) ALLOWED (deducted) THROUGH INCENTIVE SCHEMES"]
[null,null,"REVENUE"]
[null,null,{"$f":"CONCATENATE(\"Forecast  ($0's. real \",dms_DollarReal,\")\")","v":"Forecast  ($0's. real June 2024)"}]
[null,null,{"$f":"dms_y1","v":"2022-23"},{"$f":"dms_y2","v":"2023-24"},{"$f":"dms_y3","v":"2024-25"},{"$f":"dms_y4","v":"2025-26"},{"$f":"dms_y5","v":"2026-27"},{"$f":"dms_y6","v":"2027-28"},{"$f":"dms_y7","v":"2028-29"}]
["TREV0301","EBSS",4583064.4487838494,null,2481883.3701753002,-2073180.9855268302,-174604.03603099901,0,-38867.350767432596]
["TREV0302","STPIS"]
["TREV0303","Other",969547.3000091298,969547.3000091298,633607.702521445,633607.702521445,633607.702521445,633607.702521445,633607.702521445]
["TREV03","Total",{"$f":"SUM(C40:C42)","v":5552611.7487929789},969547.3000091298,3115491.0726967454,-1439573.2830053852,459003.66649044596,633607.702521445,594740.3517540124]

{"sheet":"3.2 Operating expenditure","index":14,"n_rows":94,"n_cols":9,"rows_kept":94,"cut":false,"hidden":false,"merged":[[50,1,50,3]]}
[null,{"$f":"(LOOKUP(dms_Model,dms_Model_List,dms_Worksheet_List))","v":"REGULATORY REPORTING STATEMENT"}]
[null,{"$f":"INDEX(dms_TradingNameFull_List,MATCH(dms_TradingName,dms_TradingName_List))","v":"TasNetworks (T)"}]
[null,{"$f":"CONCATENATE(\"REGULATORY PERIOD FROM \", FRCP_y1,\" TO \",dms_MultiYear_FinalYear_Result)","v":"REGULATORY PERIOD FROM 2024-25 TO 2028-29"}]
[null,"3.2 OPERATING EXPENDITURE"]
[]
[]
[null,"3.2.1 - OPEX CATEGORIES"]
[null,null,"EXPENDITURE"]
[null,null,{"$f":"CONCATENATE(\"Forecast  ($0's. real \",dms_DollarReal,\")\")","v":"Forecast  ($0's. real June 2024)"}]
[null,null,{"$f":"dms_y1","v":"2022-23"},{"$f":"dms_y2","v":"2023-24"},{"$f":"dms_y3","v":"2024-25"},{"$f":"dms_y4","v":"2025-26"},{"$f":"dms_y5","v":"2026-27"},{"$f":"dms_y6","v":"2027-28"},{"$f":"dms_y7","v":"2028-29"}]
[null,"OPEX CATEGORIES AND COST ALLOCATIONS - approved CAM"]
[null,"Field operations and maintenance",16831565.930617411,16946009.438573182,17709596.160583336,17998797.946706843,18191769.703098066,18234686.867955413,18238944.692057569]
[null,"Maintenance Support",2864947.3924455172,2884427.1384805418,3014399.3464822699,3063625.1824181862,3096471.4388252036,3103776.4881626242,3104501.2241800115]
[null,"Network Monitoring & Control",1790592.1202784486,1802766.9615503387,1883999.5915514186,1914765.7390113666,1935294.6492657522,1939860.3051016398,1940313.2651125072]
[null,"Asset Management Support",3939302.6646125866,3966087.3154107444,4144799.1014131205,4212484.6258250056,4257648.228384655,4267692.6712236078,4268689.1832475159]
[null,"Corporate",10385434.297614999,10456048.376991963,12190551.151394149,13532771.410654098,14187287.737817021,14276472.226798112,14293970.7198922]
[]
[]
[]
[]
[]
[]
[]
[]
[]
[]
[]
[]
[]
[]
[]
[]
[]
[]
[]
[]
[]
[]
[]
[]
[]
[]
[]
[]
[]
[]
[null,"Total ",{"$f":"SUM(C12:C46)","v":35811842.405568957},36055339.231006771,38943345.351424292,40722444.904615499,41668471.7573907,41822488.559241399,41846419.084489807]
[]
[]
[]
[null,"Instructions\nTable 3.2.3 must be completed if there are any proposed changes to the CAM reported in response to Schedule 1, paragraph 1.3."]
[]
[null,"3.2.3 - OPEX CATEGORIES - Revised CAM"]
[null,null,"EXPENDITURE"]
[null,null,{"$f":"CONCATENATE(\"Forecast  ($0's. real \",dms_DollarReal,\")\")","v":"Forecast  ($0's. real June 2024)"}]
[null,null,{"$f":"dms_y1","v":"2022-23"},{"$f":"dms_y2","v":"2023-24"},{"$f":"dms_y3","v":"2024-25"},{"$f":"dms_y4","v":"2025-26"},{"$f":"dms_y5","v":"2026-27"},{"$f":"dms_y6","v":"2027-28"},{"$f":"dms_y7","v":"2028-29"}]
[null,"OPEX CATEGORIES AND COST ALLOCATIONS - revised CAM"]
[]
[]
[]
[]
[]
[]
[]
[]
[]
[]
[]
[]
[]
[]
[]
[]
[]
[]
[]
[]
[]
[]
[]
[]
[]
[]
[]
[]
[]
[]
[]
[]
[]
[]
[]
[]
[null,"Total",{"$f":"SUM(C58:C93)","v":0},0,0,0,0,0,0]

{"sheet":"3.3 Assets (RAB)","index":15,"n_rows":97,"n_cols":9,"rows_kept":97,"cut":false,"hidden":false,"merged":[]}
[null,{"$f":"(LOOKUP(dms_Model,dms_Model_List,dms_Worksheet_List))","v":"REGULATORY REPORTING STATEMENT"}]
[null,{"$f":"INDEX(dms_TradingNameFull_List,MATCH(dms_TradingName,dms_TradingName_List))","v":"TasNetworks (T)"}]
[null,{"$f":"CONCATENATE(\"REGULATORY PERIOD FROM \", FRCP_y1,\" TO \",dms_MultiYear_FinalYear_Result)","v":"REGULATORY PERIOD FROM 2024-25 TO 2028-29"}]
[null,"3.3 ASSETS"]
[]
[null,"There are FOUR tables on this worksheet. Each table has been grouped (and sub-grouped) for ease of navigation. See the Instructions sheet on how to group or ungroup tables. "]
[]
[null,"3.3.1 - REGULATORY ASSET BASE VALUES"]
[null,null,"VALUES"]
[null,null,{"$f":"CONCATENATE(\"Forecast  ($0's. real \",dms_DollarReal,\")\")","v":"Forecast  ($0's. real June 2024)"}]
[null,null,{"$f":"dms_y1","v":"2022-23"},{"$f":"dms_y2","v":"2023-24"},{"$f":"dms_y3","v":"2024-25"},{"$f":"dms_y4","v":"2025-26"},{"$f":"dms_y5","v":"2026-27"},{"$f":"dms_y6","v":"2027-28"},{"$f":"dms_y7","v":"2028-29"}]
[null,"For total asset base:"]
["TRAB0101","Opening value",1770.1742221783686,1776.7894201657691,1758.7470734445046,1740.1131399629874,1738.9114464883442,1727.1222693789161,1714.1948581898732]
["TRAB0102","Inflation addition",0,0,0,0,0,0,0]
["TRAB0103","Straight line depreciation",-56.760775769576476,-58.830746479023624,-70.681793532153236,-68.997341259063873,-70.51175305729852,-70.600803366195791,-71.467218747612847]
["TRAB0105","Actual additions (recognised in RAB)",63.442252017250844,40.852006533453725,52.228286427009053,68.100526105302222,59.069790075638934,58.199827701057956,52.175008644617414]
["TRAB0106","Disposals ",-6.6278260273945552E-2,-6.3606775694765402E-2,-0.18042637637305092,-0.30487832088151906,-0.34721412776821442,-0.52643552390501336,-0.6153587421472122]
["TRAB0107","Closing value ",{"$f":"SUM(C13:C17)","v":1776.7894201657691},1758.7470734445044,1740.1131399629874,1738.9114464883442,1727.1222693789161,1714.1948581898732,1694.2872893447307]
[]
[]
[null,"3.3.2 - ASSET VALUE ROLL FORWARD"]
[null,null,"VALUES"]
[null,null,{"$f":"CONCATENATE(\"Forecast  ($0's. real \",dms_DollarReal,\")\")","v":"Forecast  ($0's. real June 2024)"}]
[null,null,{"$f":"dms_y1","v":"2022-23"},{"$f":"dms_y2","v":"2023-24"},{"$f":"dms_y3","v":"2024-25"},{"$f":"dms_y4","v":"2025-26"},{"$f":"dms_y5","v":"2026-27"},{"$f":"dms_y6","v":"2027-28"},{"$f":"dms_y7","v":"2028-29"}]
[null,"For overhead assets:"]
["TRAB0201","Opening value",681.78856508781485,684.30756248503155,697.44372421929563,700.76707220364972,698.34578096699806,691.00088209351588,683.17488035011218]
["TRAB0202","Inflation addition",0,0,0,0,0,0,0]
["TRAB0203","Straight line depreciation",-16.231459971844384,-16.823394212660208,-14.772349741985783,-15.223728061159207,-15.563148137578324,-16.066031148556018,-17.747375053137407]
["TRAB0205","Actual additions (recognised in RAB)",18.750457369061085,29.959555946924233,18.095697726339861,12.802436824507591,8.2182492640961158,8.2400294051523222,10.012007374537712]
["TRAB0206","Disposals ",0,0,0,0,0,0,0]
["TRAB0207","Closing value ",{"$f":"SUM(C26:C30)","v":684.30756248503155},697.44372421929552,700.76707220364972,698.34578096699806,691.00088209351588,683.17488035011218,675.43951267151249]
[null,"For underground assets:"]
["TRAB0301","Opening value",null,{"$f":"C38","v":0},0,0,0,0,0]
["TRAB0302","Inflation addition"]
["TRAB0303","Straight line depreciation"]
["TRAB0305","Actual additions (recognised in RAB)"]
["TRAB0306","Disposals "]
["TRAB0307","Closing value ",{"$f":"SUM(C33:C37)","v":0},0,0,0,0,0,0]
[null,"For switchyards, substations"]
["TRAB0401","Opening value",727.70906201062951,720.12579679649832,705.95252748054179,694.0554281347155,696.11218942441553,702.42925738464544,710.30025951830305]
["TRAB0402","Inflation addition",0,0,0,0,0,0,0]
["TRAB0403","Straight line depreciation",-23.159960800413181,-24.004565896781422,-26.72105110353213,-27.051637427000383,-27.332306088060527,-28.045643449035161,-26.298457308092047]
["TRAB0405","Actual additions (recognised in RAB)",15.576695586281945,9.831296580824846,14.82395175770583,29.10839871670041,33.649374048290369,35.916645582692858,26.736727444983792]
["TRAB0406","Disposals ",0,0,0,0,0,0,0]
["TRAB0407","Closing value ",{"$f":"SUM(C40:C44)","v":720.12579679649832},705.95252748054179,694.0554281347155,696.11218942441553,702.42925738464544,710.30025951830305,710.73852965519484]
[null,"For easements:"]
["TRAB0501","Opening value",142.2371736548225,142.2371736548225,141.09267710304124,141.91139718050943,142.66539524808562,143.41886842500799,144.17608361521431]
["TRAB0502","Inflation addition",0,0,0,0,0,0,0]
["TRAB0503","Straight line depreciation",0,0,0,0,0,0,0]
["TRAB0505","Actual additions (recognised in RAB)",0,-1.1444965517812471,0.8187200774681952,0.75399806757619847,0.7534731769223636,0.75721519020632866,0.79038240529996917]
["TRAB0506","Disposals ",0,0,0,0,0,0,0]
["TRAB0507","Closing value ",{"$f":"SUM(C47:C51)","v":142.2371736548225},141.09267710304124,141.91139718050943,142.66539524808562,143.41886842500799,144.17608361521431,144.96646602051428]
[null,"For “other” assets with long lives:"]
["TRAB0601","Opening value",185.79442029825191,190.25087380485522,168.63328603371335,156.13800904476159,148.18307327105566,134.4312902411996,121.19909854585073]
["TRAB0602","Inflation addition",0,0,0,0,0,0,0]
["TRAB0603","Straight line depreciation",-15.136558263268958,-15.688563267111784,-21.547459312727099,-21.167514131694155,-20.599534785749114,-18.613750165548762,-18.963624435197406]
["TRAB0605","Actual additions (recognised in RAB)",19.593011769872273,-5.9290245040300853,9.0521823237753658,13.212578357988246,6.8477517558930696,5.3815584701998951,7.7768997769347257]
["TRAB0606","Disposals ",0,0,0,0,0,0,0]
["TRAB0607","Closing value ",{"$f":"SUM(C54:C58)","v":190.25087380485522},168.63328603371335,156.13800904476159,148.18307327105566,134.4312902411996,121.19909854585073,110.01237388758805]
[null,"For “other” assets with short lives:"]
["TRAB0701","Opening value",32.645001126849827,39.868013424561468,45.624858607912465,47.241233399350996,53.605007577789131,55.841971234547373,55.344536160393055]
["TRAB0702","Inflation addition",0,0,0,0,0,0,0]
["TRAB0703","Straight line depreciation",-2.2327967340499577,-2.3142231024702062,-7.6409333739082284,-5.554461639210122,-7.0167640459105529,-7.8753786030558519,-8.4577619511859865]
["TRAB0705","Actual additions (recognised in RAB)",9.5220872920355415,8.1346750615159724,9.4377345417198057,12.223114138529777,9.6009418304370122,7.9043790528065472,6.8589916428612145]
["TRAB0706","Disposals ",-6.6278260273945552E-2,-6.3606775694765402E-2,-0.18042637637305092,-0.30487832088151906,-0.34721412776821442,-0.52643552390501336,-0.6153587421472122]
["TRAB0707","Closing value ",{"$f":"SUM(C61:C65)","v":39.868013424561461},45.624858607912465,47.241233399350996,53.605007577789131,55.841971234547373,55.344536160393055,53.130407109921066]
[]
[]
[]
[null,"3.3.3 - TOTAL DISAGGREGATED RAB ASSET VALUES"]
[null,null,"VALUES"]
[null,null,{"$f":"CONCATENATE(\"Forecast  ($0's. real \",dms_DollarReal,\")\")","v":"Forecast  ($0's. real June 2024)"}]
[null,null,{"$f":"dms_y1","v":"2022-23"},{"$f":"dms_y2","v":"2023-24"},{"$f":"dms_y3","v":"2024-25"},{"$f":"dms_y4","v":"2025-26"},{"$f":"dms_y5","v":"2026-27"},{"$f":"dms_y6","v":"2027-28"},{"$f":"dms_y7","v":"2028-29"}]
["TRAB0801","Overhead transmission assets (wires and towers/poles etc)",683.0480637864232,690.87564335216359,699.10539821147268,699.55642658532383,694.67333153025697,687.08788122181409,679.30719651081233]
["TRAB0802","Underground transmission assets (cables, ducts etc)",0,0,0,0,0,0,0]
["TRAB0803","Substations, switchyards, transformers etc with transmission function",723.91742940356392,713.03916213852006,700.00397780762864,695.08380877956552,699.27072340453049,706.36475845147424,710.51939458674894]
["TRAB0804","Easements",142.2371736548225,141.66492537893185,141.50203714177533,142.28839621429751,143.04213183654679,143.79747602011116,144.57127481786429]
["TRAB0805","Other assets with long lives (please specify)",188.02264705155358,179.44207991928428,162.38564753923748,152.16054115790863,141.30718175612765,127.81519439352516,115.60573621671939]
["TRAB0806","Other assets with short lives (please specify)",36.256507275705644,42.74643601623697,46.433046003631731,50.423120488570063,54.723489406168255,55.593253697470217,54.237471635157064]
[]
[]
[null,"3.3.4 - ASSET LIVES"]
[null,null,"ASSET LIFE"]
[null,null,"(Years)"]
[null,null,{"$f":"dms_y1","v":"2022-23"},{"$f":"dms_y2","v":"2023-24"},{"$f":"dms_y3","v":"2024-25"},{"$f":"dms_y4","v":"2025-26"},{"$f":"dms_y5","v":"2026-27"},{"$f":"dms_y6","v":"2027-28"},{"$f":"dms_y7","v":"2028-29"}]
[null,"ESTIMATED SERVICE LIFE OF NEW ASSETS"]
["TRAB0901","Overhead transmission assets (wires and towers/poles etc)",54.74,54.64,54.1,53.74,53.42,53.12,52.84]
["TRAB0902","Underground transmission assets (cables, ducts etc)",0,0,0,0,0,0,0]
["TRAB0903","Substations, switchyards, transformers etc with transmission function",47.72,47.79,47.09,47.12,47.13,47.13,47.62]
["TRAB0904","Other assets with long lives",23.43,23.37,24.45,25.04,25.3,26.18,27.14]
["TRAB0905","Other assets with short lives",6.04,5.91,6.03,6.31,6.57,6.68,6.77]
[null,"ESTIMATED RESIDUAL SERVICE LIFE"]
["TRAB1001","Overhead transmission assets (wires and towers/poles etc)",37.32,36.74,36.33,35.33,34.28,33.47,32.82]
["TRAB1002","Underground transmission assets (cables, ducts etc)",0,0,0,0,0,0,0]
["TRAB1003","Substations, switchyards, transformers etc with transmission function",31.82,31.24,30.48,30.08,29.94,31.33,29.97]
["TRAB1004","Other assets with long lives",14.91,14.96,14.83,14.34,14.39,14.53,14.67]
["TRAB1005","Other assets with short lives",5.35,5.74,5.74,5.41,4.6500000000000004,3.97,3.79]

{"sheet":"3.4 Operational data","index":16,"n_rows":93,"n_cols":10,"rows_kept":93,"cut":false,"hidden":false,"merged":[]}
[null,{"$f":"(LOOKUP(dms_Model,dms_Model_List,dms_Worksheet_List))","v":"REGULATORY REPORTING STATEMENT"}]
[null,{"$f":"INDEX(dms_TradingNameFull_List,MATCH(dms_TradingName,dms_TradingName_List))","v":"TasNetworks (T)"}]
[null,{"$f":"CONCATENATE(\"REGULATORY PERIOD FROM \", FRCP_y1,\" TO \",dms_MultiYear_FinalYear_Result)","v":"REGULATORY PERIOD FROM 2024-25 TO 2028-29"}]
[null,"3.4 OPERATIONAL DATA"]
[]
[null,"There are THREE tables on this worksheet. Each table has been grouped for ease of navigation. See the Instructions sheet on how to group or ungroup tables. "]
[]
[null,"3.4.1 - ENERGY DELIVERY"]
[null,null,null,"VOLUMES "]
[null,null,null,"Forecast (0's)"]
[null,null,"Units",{"$f":"dms_y1","v":"2022-23"},{"$f":"dms_y2","v":"2023-24"},{"$f":"dms_y3","v":"2024-25"},{"$f":"dms_y4","v":"2025-26"},{"$f":"dms_y5","v":"2026-27"},{"$f":"dms_y6","v":"2027-28"},{"$f":"dms_y7","v":"2028-29"}]
[null,"Energy grouping by downstream connection type"]
["TOPED0101","To Other connected transmission networks","GWh",2644.2623585963106,2644.2623585963106,2644.2623585963106,2644.2623585963106,2644.2623585963106,2644.2623585963106,2644.2623585963106]
["TOPED0102","To Distribution networks","GWh",4715.137190770236,5263.9977629104415,5485.2142598485279,5780.2755451569356,6077.8990810303148,6270.0393596034874,6353.2411453235054]
["TOPED0103","To Directly connected end–users (330 kV)","GWh",0,0,0,0,0,0,0]
["TOPED0104","To Directly connected end–users (275 kV)","GWh",0,0,0,0,0,0,0]
["TOPED0105","To Directly connected end–users (220 kV)","GWh"]
["TOPED0106","To Directly connected end–users (132 kV)","GWh",0,0,0,0,0,0,0]
["TOPED0107","To Directly connected end–users (110 kV)","GWh"]
["TOPED0108","To Directly connected end–users (44 kV) ","GWh"]
["TOPED0109","To Directly connected end–users (33 kV)","GWh",0,0,0,0,0,0,0]
["TOPED0110","To Directly connected end–users (22 kV)","GWh"]
["TOPED0111","To Directly connected end–users (11 kV)","GWh"]
["TOPED0112","To Directly connected end–users (6.6 kV)","GWh"]
["TOPED0113","Pumping and Power Station Auxillaries","GWh",63.117395875099881,63.117395875099881,63.117395875099881,63.117395875099881,63.117395875099881,63.117395875099881,63.117395875099881]
["TOPED01","Total energy transported","GWh",13430.311649803059,13983.011654471413,14251.321454471412,14551.489254471413,14849.21445447141,15019.313454471416,15054.337354471412]
[]
[]
[null,"3.4.2 -  CONNECTION POINTS"]
[null,null,null,"VOLUMES "]
[null,null,null,"Forecast (0's)"]
[null,null,"Units",{"$f":"dms_y1","v":"2022-23"},{"$f":"dms_y2","v":"2023-24"},{"$f":"dms_y3","v":"2024-25"},{"$f":"dms_y4","v":"2025-26"},{"$f":"dms_y5","v":"2026-27"},{"$f":"dms_y6","v":"2027-28"},{"$f":"dms_y7","v":"2028-29"}]
[null,"Number of entry points at each transmission voltage level"]
["TOPCP0101","500kV","number",0,0,0,0,0,0,0]
["TOPCP0102","330kV","number",0,0,0,0,0,0,0]
["TOPCP0103","275kV","number",0,0,0,0,0,0,0]
["TOPCP0104","220kV","number",15,15,15,15,15,15,15]
["TOPCP0105","132 kV","number",0,0,0,0,0,0,0]
["TOPCP0106","110kV","number",13,13,13,13,13,13,13]
["TOPCP0107","66 kV","number",0,0,0,0,0,0,0]
["TOPCP0108","33 kV","number",0,0,0,0,0,0,0]
["TOPCP0109","22 kV","number",0,0,0,0,0,0,0]
["TOPCP0110","11 kV","number",0,0,0,0,0,0,0]
["TOPCP0111","6.6 kV","number",0,0,0,0,0,0,0]
[null,"Number of exit points at each transmission voltage level "]
["TOPCP0201","500kV","number",0,0,0,0,0,0,0]
["TOPCP0202","330kV","number",0,0,0,0,0,0,0]
["TOPCP0203","275kV","number",0,0,0,0,0,0,0]
["TOPCP0204","220kV","number",2,2,2,2,2,2,2]
["TOPCP0205","132 kV","number",0,0,0,0,0,0,0]
["TOPCP0206","110kV","number",3,3,3,3,3,3,3]
["TOPCP0207","66 kV","number",0,0,0,0,0,0,0]
["TOPCP0208","44 kV","number",1,1,1,1,1,1,1]
["TOPCP0209","33kV","number",5,5,5,5,5,5,5]
["TOPCP0210","22kV","number",30,30,30,30,30,30,31]
["TOPCP0211","11kV","number",13,13,13,13,13,13,13]
["TOPCP0212","6.6kV","number",2,2,2,2,2,2,2]
[]
[]
[]
[null,"3.4.3 - SYSTEM DEMAND"]
[null,null,null,"VOLUMES "]
[null,null,null,"Forecast (0's)"]
[null,null,"Units",{"$f":"dms_y1","v":"2022-23"},{"$f":"dms_y2","v":"2023-24"},{"$f":"dms_y3","v":"2024-25"},{"$f":"dms_y4","v":"2025-26"},{"$f":"dms_y5","v":"2026-27"},{"$f":"dms_y6","v":"2027-28"},{"$f":"dms_y7","v":"2028-29"}]
[null,"Annual system maximum demand characteristics – MW measure"]
["TOPSD0101","Transmission System coincident maximum demand","MW"]
["TOPSD0102","Transmission System coincident weather adjusted maximum demand 10% POE","MW",2286.2681316024973,2335.4273803332471,2374.5422087569168,2409.5469957403084,2445.8025968074867,2468.785665270555,2467.6022985355776]
["TOPSD0103","Transmission System coincident weather adjusted maximum demand 50% POE","MW",2245.360070883351,2293.546700917685,2335.3026848511799,2371.5346561954179,2409.0872303833867,2432.5542053764484,2434.1368920656732]
["TOPSD0104","Transmission System non-coincident summated maximum demand","MW"]
["TOPSD0105","Transmission System non-coincident weather adjusted summated maximum demand 10% POE","MW",2368.7106541271733,2372.5126269484167,2374.2673109943994,2375.7705382821573,2377.1083812360243,2378.3109221910131,2379.895315013182]
["TOPSD0106","Transmission System non-coincident weather adjusted summated maximum demand 50% POE","MW",2337.2579482535161,2341.033233419942,2342.6699211037831,2344.0283249514678,2345.2506550562643,2346.3648947915704,2347.8354739358479]
[null,"Annual system maximum demand characteristics – MVA measure"]
["TOPSD0201","Transmission System coincident maximum demand","MVA"]
["TOPSD0202","Transmission System coincident weather adjusted maximum demand 10% POE","MVA",2314.6468807788806,2364.416328274222,2404.0166771360105,2439.4559678663786,2476.1615986543507,2499.4299489381297,2498.2318934327095]
["TOPSD0203","Transmission System coincident weather adjusted maximum demand 50% POE","MVA",2273.2310407759337,2322.0157967555569,2364.2900849851585,2400.971792741645,2438.9904955822753,2462.7487589802495,2464.3510910767463]
["TOPSD0204","Transmission System non-coincident summated maximum demand","MVA"]
["TOPSD0205","Transmission System non-coincident weather adjusted summated maximum demand 10% POE","MVA",2414.6425267617356,2418.417446955566,2420.1355755736931,2421.5973577974828,2422.8962788713902,2424.0605560056501,2425.6047206791363]
["TOPSD0206","Transmission System non-coincident weather adjusted summated maximum demand 50% POE","MVA",2382.954910557798,2386.7031747559408,2388.3033656157513,2389.6193959420434,2390.8022933510601,2391.877512235676,2393.3074173372406]
[null,"Power factor"]
[null,"Power factor conversion between MVA and MW"]
["TOPSD0301","Average overall network power factor conversion between MVA and MW","Factor",0.98773949088647439,0.98773949088647439,0.98773949088647439,0.98773949088647439,0.98773949088647439,0.98773949088647439,0.98773949088647439]
["TOPSD0302","Average power factor conversion for 500 kV lines","Factor",0,0,0,0,0,0,0]
["TOPSD0303","Average power factor conversion for 330 kV lines","Factor",0,0,0,0,0,0,0]
["TOPSD0304","Average power factor conversion for  275 kV lines","Factor",0,0,0,0,0,0,0]
["TOPSD0305","Average power factor conversion for  220 kV lines","Factor"]
["TOPSD0306","Average power factor conversion for  132 kV lines","Factor",0,0,0,0,0,0,0]
["TOPSD0307","Average power factor conversion for  110 kV lines","Factor"]
["TOPSD0308","Average power factor conversion for  88 kV lines","Factor",0,0,0,0,0,0,0]
["TOPSD0309","Average power factor conversion for  66 kV lines","Factor",0,0,0,0,0,0,0]
["TOPSD0310","Average power factor conversion for  33 kV lines","Factor",0.99671350193424146,0.99671350193424146,0.99671350193424146,0.99671350193424146,0.99671350193424146,0.99671350193424146,0.99671350193424146]
["TOPSD0311","Average power factor conversion for  22 kV lines","Factor",0.9943173793908564,0.9943173793908564,0.9943173793908564,0.9943173793908564,0.9943173793908564,0.9943173793908564,0.9943173793908564]
["TOPSD0311","Average power factor conversion for  11 kV lines","Factor",0.97246239491764397,0.97246239491764397,0.97246239491764397,0.97246239491764397,0.97246239491764397,0.97246239491764397,0.97246239491764397]
["TOPSD0312","Average power factor conversion for  6.6 kV lines","Factor"]

{"sheet":"3.5 Physical assets","index":17,"n_rows":75,"n_cols":10,"rows_kept":75,"cut":false,"hidden":false,"merged":[[37,1,37,2],[5,1,5,2],[23,1,23,2]]}
[null,{"$f":"(LOOKUP(dms_Model,dms_Model_List,dms_Worksheet_List))","v":"REGULATORY REPORTING STATEMENT"}]
[null,{"$f":"INDEX(dms_TradingNameFull_List,MATCH(dms_TradingName,dms_TradingName_List))","v":"TasNetworks (T)"}]
[null,{"$f":"CONCATENATE(\"REGULATORY PERIOD FROM \", FRCP_y1,\" TO \",dms_MultiYear_FinalYear_Result)","v":"REGULATORY PERIOD FROM 2024-25 TO 2028-29"}]
[null,"3.5 PHYSICAL ASSETS"]
[]
[null,"There is ONE table on this worksheet. It has been sub-grouped for ease of navigation. See the Instructions sheet on how to group or ungroup tables. "]
[]
[null,"3.5.1 - TRANSMISSION SYSTEM CAPACITIES "]
[null,null,null,"VOLUMES "]
[null,null,null,"Forecast (0's)"]
[null,null,"Units",{"$f":"dms_y1","v":"2022-23"},{"$f":"dms_y2","v":"2023-24"},{"$f":"dms_y3","v":"2024-25"},{"$f":"dms_y4","v":"2025-26"},{"$f":"dms_y5","v":"2026-27"},{"$f":"dms_y6","v":"2027-28"},{"$f":"dms_y7","v":"2028-29"}]
[null,"Overhead network length of circuit at each voltage"]
["TPA0101","500 kV","km",0,0,0,0,0,0,0]
["TPA0102","330 kV","km",0,0,0,0,0,0,0]
["TPA0103","275 kV","km",0,0,0,0,0,0,0]
["TPA0104","220 kV","km",1688.6103708432313,1690.3886123467485,1692.1687264805059,1693.9507152165331,1695.7345805289358,1697.5203243938986,1699.3079487896873]
["TPA0105","132 kV","km",0,0,0,0,0,0,0]
["TPA0106","110 kV","km",1648.0277100300407,1646.1086573141713,1644.1918392472123,1642.2772532270174,1640.3648966544702,1638.4547669334813,1636.5468614709844]
["TPA0107","88 kV","km",0,0,0,0,0,0,0]
["TPA0108","66 kV","km",0,0,0,0,0,0,0]
["TPA0109","33 kV","km",0,0,0,0,0,0,0]
["TPA0109","22 kV","km",0,0,0,0,0,0,0]
["TPA0109","11 kV","km",0,0,0,0,0,0,0]
["TPA01","Total",null,{"$f":"SUM(D13:D23)","v":3336.638080873272},3336.4972696609198,3336.3605657277185,3336.2279684435507,3336.0994771834057,3335.9750913273801,3335.8548102606719]
[]
[null,"Underground cable circuit length at each voltage"]
["TPA0201","500 kV","km",0,0,0,0,0,0,0]
["TPA0202","330 kV","km",0,0,0,0,0,0,0]
["TPA0203","275 kV","km",0,0,0,0,0,0,0]
["TPA0204","220 kV","km",0,0,0,0,0,0,0]
["TPA0205","132 kV","km",0,0,0,0,0,0,0]
["TPA0206","110 kV","km",24.164000000000001,24.164000000000001,24.164000000000001,24.164000000000001,24.164000000000001,24.164000000000001,24.164000000000001]
["TPA0207","88 kV","km",0,0,0,0,0,0,0]
["TPA0208","66 kV","km",0,0,0,0,0,0,0]
["TPA0209","33 kV","km",0,0,0,0,0,0,0]
["TPA0210","22 kV","km",0,0,0,0,0,0,0]
["TPA0211","11 kV","km",0,0,0,0,0,0,0]
["TPA02","Total",null,{"$f":"SUM(D27:D37)","v":24.164000000000001},24.164000000000001,24.164000000000001,24.164000000000001,24.164000000000001,24.164000000000001,24.164000000000001]
[]
[null,"Estimated overhead network weighted average MVA capacity by voltage class"]
["TPA0301","500 kV","MVA",0,0,0,0,0,0,0]
["TPA0302","330 kV","MVA",0,0,0,0,0,0,0]
["TPA0303","275 kV","MVA",0,0,0,0,0,0,0]
["TPA0304","220 kV","MVA",411.49060984102186,411.49060984102186,411.49060984102186,411.49060984102186,411.49060984102186,411.49060984102186,411.49060984102186]
["TPA0305","132 kV","MVA",0,0,0,0,0,0,0]
["TPA0306","110 kV","MVA",109.98064338518695,109.98064338518695,109.98064338518695,109.98064338518695,109.98064338518695,109.98064338518695,109.98064338518695]
["TPA0307","88 kV","MVA",0,0,0,0,0,0,0]
["TPA0308","66 kV","MVA",0,0,0,0,0,0,0]
["TPA0309","33 kV","MVA",0,0,0,0,0,0,0]
["TPA0310","22 kV","MVA",0,0,0,0,0,0,0]
["TPA0311","11 kV","MVA",0,0,0,0,0,0,0]
[]
[null,"Estimated underground network weighted average MVA capacity by voltage class"]
["TPA0401","500 kV","MVA",0,0,0,0,0,0,0]
["TPA0402","330 kV","MVA",0,0,0,0,0,0,0]
["TPA0403","275 kV","MVA",0,0,0,0,0,0,0]
["TPA0404","220 kV","MVA",0,0,0,0,0,0,0]
["TPA0405","132 kV","MVA",0,0,0,0,0,0,0]
["TPA0406","110 kV","MVA",141.99,141.99,141.99,141.99,141.99,141.99,141.99]
["TPA0407","88 kV","MVA",0,0,0,0,0,0,0]
["TPA0408","66 kV","MVA",0,0,0,0,0,0,0]
["TPA0409","33 kV","MVA",0,0,0,0,0,0,0]
["TPA0410","22 kV","MVA",0,0,0,0,0,0,0]
["TPA0411","11 kV","MVA",0,0,0,0,0,0,0]
[]
[null,"Installed transmission system transformer capacity"]
["TPA0501","Transmission substations (eg 500 kV to 330 kV)","MVA",3300.8320862017358,3311.6998362610652,3322.60336759865,3333.5427980217523,3344.5182457255055,3355.5298292941916,3366.5776677025233]
["TPA0502","Terminal points to DNSP systems","MVA",3484.2741040485248,3539.4070064557291,3595.4122962920137,3652.3037776524507,3710.0954730591939,3768.8016269177288,3828.436709027811]
["TPA0503","Transformer capacity for directly connected end–users owned by the TNSP","MVA",604.20914554921558,610.48276181490496,616.82151820854347,623.22609109223072,629.69716385086008,636.23542696503773,642.84157808475879]
["TPA0504","Transformer capacity for directly connected end–users owned by the end–user","MVA",496.22328931572633,496.44667915185289,496.67016955363198,496.89376056633625,497.11745223525872,497.3412446057128,497.56513772303236]
["TPA0505","Interconnector capacity","MVA",519,519,519,519,519,519,519]
["TPA0506","Other","MVA",0,0,0,0,0,0,0]
[]
[null,"Cold spare capacity"]
["TPA06","Cold spare capacity included in 3.5.1.5","MVA",319,319,319,319,319,319,319]

{"sheet":"3.7 Operating environment","index":18,"n_rows":27,"n_cols":10,"rows_kept":27,"cut":false,"hidden":false,"merged":[]}
[null,{"$f":"(LOOKUP(dms_Model,dms_Model_List,dms_Worksheet_List))","v":"REGULATORY REPORTING STATEMENT"}]
[null,{"$f":"INDEX(dms_TradingNameFull_List,MATCH(dms_TradingName,dms_TradingName_List))","v":"TasNetworks (T)"}]
[null,{"$f":"CONCATENATE(\"REGULATORY PERIOD FROM \", FRCP_y1,\" TO \",dms_MultiYear_FinalYear_Result)","v":"REGULATORY PERIOD FROM 2024-25 TO 2028-29"}]
[null,"3.7 OPERATING ENVIRONMENT FACTORS"]
[]
[]
["TEF01","3.7.1 - TERRAIN FACTORS"]
[null,null,null,"VOLUMES "]
[null,null,null,"Forecast (0's)"]
[null,null,"Units",{"$f":"dms_y1","v":"2022-23"},{"$f":"dms_y2","v":"2023-24"},{"$f":"dms_y3","v":"2024-25"},{"$f":"dms_y4","v":"2025-26"},{"$f":"dms_y5","v":"2026-27"},{"$f":"dms_y6","v":"2027-28"},{"$f":"dms_y7","v":"2028-29"}]
["TEF0101","Total number of vegetation maintenance spans","Number of spans",914]
["TEF0102","Average vegetation maintenance span cycle","Years",5]
["TEF0103","Average number of trees per vegetation maintenance span","Trees",1403]
["TEF0104","Average number of defects per vegetation maintenance span","Defects",0]
["TEF0105","Tropical proportion","Number of spans",0]
["TEF0106","Standard vehicle access","km",70]
["TEF0107","Altitude","km",492]
["TEF0108","Bushfire risk","Number of spans",238]
[]
["TEF02","3.7.2 - NETWORK CHARACTERISTICS"]
[null,null,null,"VOLUMES "]
[null,null,null,"Forecast (0's)"]
[null,null,"Units",{"$f":"dms_y1","v":"2022-23"},{"$f":"dms_y2","v":"2023-24"},{"$f":"dms_y3","v":"2024-25"},{"$f":"dms_y4","v":"2025-26"},{"$f":"dms_y5","v":"2026-27"},{"$f":"dms_y6","v":"2027-28"},{"$f":"dms_y7","v":"2028-29"}]
["TEF0201","Route line length","km",2361.1999999999998,2361.1999999999998,2361.1999999999998,2361.1999999999998,2361.1999999999998,2361.1999999999998,2361.1999999999998]
["TEF0202","Variability of dispatch","%",0.995,0.995,0.995,0.995,0.995,0.995,0.995]
["TEF0203","Concentrated load distance","km",305,305,305,305,305,305,305]
["TEF0204","Total number of spans","number",7970,7970,7970,7970,7970,7970,7970]

{"sheet":"5.4 MD & Utilisation - Spatial","index":19,"n_rows":4883,"n_cols":23,"rows_kept":4883,"cut":false,"hidden":false,"merged":[[5,1,5,2],[11,1,24,1],[11,2,12,2],[11,3,12,3],[13,2,14,2],[13,3,14,3],[15,2,16,2],[15,3,16,3],[17,2,18,2],[17,3,18,3],[19,2,20,2],[19,3,20,3],[21,2,22,2],[21,3,22,3],[23,2,24,2],[23,3,24,3],[25,1,38,1],[25,2,26,2],[25,3,26,3],[27,2,28,2],[27,3,28,3],[29,2,30,2],[29,3,30,3],[31,2,32,2],[31,3,32,3],[33,2,34,2],[33,3,34,3],[35,2,36,2],[35,3,36,3],[37,2,38,2],[37,3,38,3],[39,1,52,1],[39,2,40,2],[39,3,40,3],[41,2,42,2],[41,3,42,3],[43,2,44,2],[43,3,44,3],[45,2,46,2],[45,3,46,3],[47,2,48,2],[47,3,48,3],[49,2,50,2],[49,3,50,3],[51,2,52,2],[51,3,52,3],[53,1,66,1],[53,2,54,2],[53,3,54,3],[55,2,56,2],[55,3,56,3],[57,2,58,2],[57,3,58,3],[59,2,60,2],[59,3,60,3],[61,2,62,2],[61,3,62,3],[63,2,64,2],[63,3,64,3],[65,2,66,2],[65,3,66,3],[67,1,80,1],[67,2,68,2],[67,3,68,3],[69,2,70,2],[69,3,70,3],[71,2,72,2],[71,3,72,3],[73,2,74,2],[73,3,74,3],[75,2,76,2],[75,3,76,3],[77,2,78,2],[77,3,78,3],[79,2,80,2],[79,3,80,3],[81,1,94,1],[81,2,82,2],[81,3,82,3],[83,2,84,2],[83,3,84,3],[85,2,86,2],[85,3,86,3],[87,2,88,2],[87,3,88,3],[89,2,90,2],[89,3,90,3],[91,2,92,2],[91,3,92,3],[93,2,94,2],[93,3,94,3],[95,1,108,1],[95,2,96,2],[95,3,96,3],[97,2,98,2],[97,3,98,3],[99,2,100,2],[99,3,100,3],[101,2,102,2],[101,3,102,3],[103,2,104,2],[103,3,104,3],[105,2,106,2],[105,3,106,3],[107,2,108,2],[107,3,108,3],[109,1,122,1],[109,2,110,2],[109,3,110,3],[111,2,112,2],[111,3,112,3],[113,2,114,2],[113,3,114,3],[115,2,116,2],[115,3,116,3],[117,2,118,2],[117,3,118,3],[119,2,120,2],[119,3,120,3],[121,2,122,2],[121,3,122,3],[123,1,136,1],[123,2,124,2],[123,3,124,3],[125,2,126,2],[125,3,126,3],[127,2,128,2],[127,3,128,3],[129,2,130,2],[129,3,130,3],[131,2,132,2],[131,3,132,3],[133,2,134,2],[133,3,134,3],[135,2,136,2],[135,3,136,3],[137,1,150,1],[137,2,138,2],[137,3,138,3],[139,2,140,2],[139,3,140,3],[141,2,142,2],[141,3,142,3],[143,2,144,2],[143,3,144,3],[145,2,146,2],[145,3,146,3],[147,2,148,2],[147,3,148,3],[149,2,150,2],[149,3,150,3],[151,1,164,1],[151,2,152,2],[151,3,152,3],[153,2,154,2],[153,3,154,3],[155,2,156,2],[155,3,156,3],[157,2,158,2],[157,3,158,3],[159,2,160,2],[159,3,160,3],[161,2,162,2],[161,3,162,3],[163,2,164,2],[163,3,164,3],[165,1,178,1],[165,2,166,2],[165,3,166,3],[167,2,168,2],[167,3,168,3],[169,2,170,2],[169,3,170,3],[171,2,172,2],[171,3,172,3],[173,2,174,2],[173,3,174,3],[175,2,176,2],[175,3,176,3],[177,2,178,2],[177,3,178,3],[179,1,192,1],[179,2,180,2],[179,3,180,3],[181,2,182,2],[181,3,182,3],[183,2,184,2],[183,3,184,3],[185,2,186,2],[185,3,186,3],[187,2,188,2],[187,3,188,3],[189,2,190,2],[189,3,190,3],[191,2,192,2],[191,3,192,3],[193,1,206,1],[193,2,194,2],[193,3,194,3],[195,2,196,2],[195,3,196,3],[197,2,198,2],[197,3,198,3],[199,2,200,2],[199,3,200,3],[201,2,202,2],[201,3,202,3],[203,2,204,2],[203,3,204,3],[205,2,206,2],[205,3,206,3],[207,1,220,1],[207,2,208,2],[207,3,208,3],[209,2,210,2],[209,3,210,3],[211,2,212,2],[211,3,212,3],[213,2,214,2],[213,3,214,3],[215,2,216,2],[215,3,216,3],[217,2,218,2],[217,3,218,3],[219,2,220,2],[219,3,220,3],[221,1,234,1],[221,2,222,2],[221,3,222,3],[223,2,224,2],[223,3,224,3],[225,2,226,2],[225,3,226,3],[227,2,228,2],[227,3,228,3],[229,2,230,2],[229,3,230,3],[231,2,232,2],[231,3,232,3],[233,2,234,2],[233,3,234,3],[235,1,248,1],[235,2,236,2],[235,3,236,3],[237,2,238,2],[237,3,238,3],[239,2,240,2],[239,3,240,3],[241,2,242,2],[241,3,242,3],[243,2,244,2],[243,3,244,3],[245,2,246,2],[245,3,246,3],[247,2,248,2],[247,3,248,3],[249,1,262,1],[249,2,250,2],[249,3,250,3],[251,2,252,2],[251,3,252,3],[253,2,254,2],[253,3,254,3],[255,2,256,2],[255,3,256,3],[257,2,258,2],[257,3,258,3],[259,2,260,2],[259,3,260,3],[261,2,262,2],[261,3,262,3],[263,1,276,1],[263,2,264,2],[263,3,264,3],[265,2,266,2],[265,3,266,3],[267,2,268,2],[267,3,268,3],[269,2,270,2],[269,3,270,3],[271,2,272,2],[271,3,272,3],[273,2,274,2],[273,3,274,3],[275,2,276,2],[275,3,276,3],[277,1,290,1],[277,2,278,2],[277,3,278,3],[279,2,280,2],[279,3,280,3],[281,2,282,2],[281,3,282,3],[283,2,284,2],[283,3,284,3],[285,2,286,2],[285,3,286,3],[287,2,288,2],[287,3,288,3],[289,2,290,2],[289,3,290,3],[291,1,304,1],[291,2,292,2],[291,3,292,3],[293,2,294,2],[293,3,294,3],[295,2,296,2],[295,3,296,3],[297,2,298,2],[297,3,298,3],[299,2,300,2],[299,3,300,3],[301,2,302,2],[301,3,302,3],[303,2,304,2],[303,3,304,3],[305,1,318,1],[305,2,306,2],[305,3,306,3],[307,2,308,2],[307,3,308,3],[309,2,310,2],[309,3,310,3],[311,2,312,2],[311,3,312,3],[313,2,314,2],[313,3,314,3],[315,2,316,2],[315,3,316,3],[317,2,318,2],[317,3,318,3],[319,1,332,1],[319,2,320,2],[319,3,320,3],[321,2,322,2],[321,3,322,3],[323,2,324,2],[323,3,324,3],[325,2,326,2],[325,3,326,3],[327,2,328,2],[327,3,328,3],[329,2,330,2],[329,3,330,3],[331,2,332,2],[331,3,332,3],[333,1,346,1],[333,2,334,2],[333,3,334,3],[335,2,336,2],[335,3,336,3],[337,2,338,2],[337,3,338,3],[339,2,340,2],[339,3,340,3],[341,2,342,2],[341,3,342,3],[343,2,344,2],[343,3,344,3],[345,2,346,2],[345,3,346,3],[347,1,360,1],[347,2,348,2],[347,3,348,3],[349,2,350,2],[349,3,350,3],[351,2,352,2],[351,3,352,3],[353,2,354,2],[353,3,354,3],[355,2,356,2],[355,3,356,3],[357,2,358,2],[357,3,358,3],[359,2,360,2],[359,3,360,3],[361,1,374,1],[361,2,362,2],[361,3,362,3],[363,2,364,2],[363,3,364,3],[365,2,366,2],[365,3,366,3],[367,2,368,2],[367,3,368,3],[369,2,370,2],[369,3,370,3],[371,2,372,2],[371,3,372,3],[373,2,374,2],[373,3,374,3],[375,1,388,1],[375,2,376,2],[375,3,376,3],[377,2,378,2],[377,3,378,3],[379,2,380,2],[379,3,380,3],[381,2,382,2],[381,3,382,3],[383,2,384,2],[383,3,384,3],[385,2,386,2],[385,3,386,3],[387,2,388,2],[387,3,388,3],[389,1,402,1],[389,2,390,2],[389,3,390,3],[391,2,392,2],[391,3,392,3],[393,2,394,2],[393,3,394,3],[395,2,396,2],[395,3,396,3],[397,2,398,2],[397,3,398,3],[399,2,400,2],[399,3,400,3],[401,2,402,2],[401,3,402,3],[403,1,416,1],[403,2,404,2],[403,3,404,3],[405,2,406,2],[405,3,406,3],[407,2,408,2],[407,3,408,3],[409,2,410,2],[409,3,410,3],[411,2,412,2],[411,3,412,3],[413,2,414,2],[413,3,414,3],[415,2,416,2],[415,3,416,3],[417,1,430,1],[417,2,418,2],[417,3,418,3],[419,2,420,2],[419,3,420,3],[421,2,422,2],[421,3,422,3],[423,2,424,2],[423,3,424,3],[425,2,426,2],[425,3,426,3],[427,2,428,2],[427,3,428,3],[429,2,430,2],[429,3,430,3],[431,1,444,1],[431,2,432,2],[431,3,432,3],[433,2,434,2],[433,3,434,3],[435,2,436,2],[435,3,436,3],[437,2,438,2],[437,3,438,3],[439,2,440,2],[439,3,440,3],[441,2,442,2],[441,3,442,3],[443,2,444,2],[443,3,444,3],[445,1,458,1],[445,2,446,2],[445,3,446,3],[447,2,448,2],[447,3,448,3],[449,2,450,2],[449,3,450,3],[451,2,452,2],[451,3,452,3],[453,2,454,2],[453,3,454,3],[455,2,456,2],[455,3,456,3],[457,2,458,2],[457,3,458,3],[459,1,472,1],[459,2,460,2],[459,3,460,3],[461,2,462,2],[461,3,462,3],[463,2,464,2],[463,3,464,3],[465,2,466,2],[465,3,466,3],[467,2,468,2],[467,3,468,3],[469,2,470,2],[469,3,470,3],[471,2,472,2],[471,3,472,3],[473,1,486,1],[473,2,474,2],[473,3,474,3],[475,2,476,2],[475,3,476,3],[477,2,478,2],[477,3,478,3],[479,2,480,2],[479,3,480,3],[481,2,482,2],[481,3,482,3],[483,2,484,2],[483,3,484,3],[485,2,486,2],[485,3,486,3],[487,1,500,1],[487,2,488,2],[487,3,488,3],[489,2,490,2],[489,3,490,3],[491,2,492,2],[491,3,492,3],[493,2,494,2],[493,3,494,3],[495,2,496,2],[495,3,496,3],[497,2,498,2],[497,3,498,3],[499,2,500,2],[499,3,500,3],[501,1,514,1],[501,2,502,2],[501,3,502,3],[503,2,504,2],[503,3,504,3],[505,2,506,2],[505,3,506,3],[507,2,508,2],[507,3,508,3],[509,2,510,2],[509,3,510,3],[511,2,512,2],[511,3,512,3],[513,2,514,2],[513,3,514,3],[515,1,528,1],[515,2,516,2],[515,3,516,3],[517,2,518,2],[517,3,518,3],[519,2,520,2],[519,3,520,3],[521,2,522,2],[521,3,522,3],[523,2,524,2],[523,3,524,3],[525,2,526,2],[525,3,526,3],[527,2,528,2],[527,3,528,3],[529,1,542,1],[529,2,530,2],[529,3,530,3],[531,2,532,2],[531,3,532,3],[533,2,534,2],[533,3,534,3],[535,2,536,2],[535,3,536,3],[537,2,538,2],[537,3,538,3],[539,2,540,2],[539,3,540,3],[541,2,542,2],[541,3,542,3],[543,1,556,1],[543,2,544,2],[543,3,544,3],[545,2,546,2],[545,3,546,3],[547,2,548,2],[547,3,548,3],[549,2,550,2],[549,3,550,3],[551,2,552,2],[551,3,552,3],[553,2,554,2],[553,3,554,3],[555,2,556,2],[555,3,556,3],[557,1,570,1],[557,2,558,2],[557,3,558,3],[559,2,560,2],[559,3,560,3],[561,2,562,2],[561,3,562,3],[563,2,564,2],[563,3,564,3],[565,2,566,2],[565,3,566,3],[567,2,568,2],[567,3,568,3],[569,2,570,2],[569,3,570,3],[571,1,584,1],[571,2,572,2],[571,3,572,3],[573,2,574,2],[573,3,574,3],[575,2,576,2],[575,3,576,3],[577,2,578,2],[577,3,578,3],[579,2,580,2],[579,3,580,3],[581,2,582,2],[581,3,582,3],[583,2,584,2],[583,3,584,3],[585,1,598,1],[585,2,586,2],[585,3,586,3],[587,2,588,2],[587,3,588,3],[589,2,590,2],[589,3,590,3],[591,2,592,2],[591,3,592,3],[593,2,594,2],[593,3,594,3],[595,2,596,2],[595,3,596,3],[597,2,598,2],[597,3,598,3],[599,1,612,1],[599,2,600,2],[599,3,600,3],[601,2,602,2],[601,3,602,3],[603,2,604,2],[603,3,604,3],[605,2,606,2],[605,3,606,3],[607,2,608,2],[607,3,608,3],[609,2,610,2],[609,3,610,3],[611,2,612,2],[611,3,612,3],[613,1,626,1],[613,2,614,2],[613,3,614,3],[615,2,616,2],[615,3,616,3],[617,2,618,2],[617,3,618,3],[619,2,620,2],[619,3,620,3],[621,2,622,2],[621,3,622,3],[623,2,624,2],[623,3,624,3],[625,2,626,2],[625,3,626,3],[627,1,640,1],[627,2,628,2],[627,3,628,3],[629,2,630,2],[629,3,630,3],[631,2,632,2],[631,3,632,3],[633,2,634,2],[633,3,634,3],[635,2,636,2],[635,3,636,3],[637,2,638,2],[637,3,638,3],[639,2,640,2],[639,3,640,3],[641,1,654,1],[641,2,642,2],[641,3,642,3],[643,2,644,2],[643,3,644,3],[645,2,646,2],[645,3,646,3],[647,2,648,2],[647,3,648,3],[649,2,650,2],[649,3,650,3],[651,2,652,2],[651,3,652,3],[653,2,654,2],[653,3,654,3],[655,1,668,1],[655,2,656,2],[655,3,656,3],[657,2,658,2],[657,3,658,3],[659,2,660,2],[659,3,660,3],[661,2,662,2],[661,3,662,3],[663,2,664,2],[663,3,664,3],[665,2,666,2],[665,3,666,3],[667,2,668,2],[667,3,668,3],[669,1,682,1],[669,2,670,2],[669,3,670,3],[671,2,672,2],[671,3,672,3],[673,2,674,2],[673,3,674,3],[675,2,676,2],[675,3,676,3],[677,2,678,2],[677,3,678,3],[679,2,680,2],[679,3,680,3],[681,2,682,2],[681,3,682,3],[683,1,696,1],[683,2,684,2],[683,3,684,3],[685,2,686,2],[685,3,686,3],[687,2,688,2],[687,3,688,3],[689,2,690,2],[689,3,690,3],[691,2,692,2],[691,3,692,3],[693,2,694,2],[693,3,694,3],[695,2,696,2],[695,3,696,3],[697,1,710,1],[697,2,698,2],[697,3,698,3],[699,2,700,2],[699,3,700,3],[701,2,702,2],[701,3,702,3],[703,2,704,2],[703,3,704,3],[705,2,706,2],[705,3,706,3],[707,2,708,2],[707,3,708,3],[709,2,710,2],[709,3,710,3],[711,1,724,1],[711,2,712,2],[711,3,712,3],[713,2,714,2],[713,3,714,3],[715,2,716,2],[715,3,716,3],[717,2,718,2],[717,3,718,3],[719,2,720,2],[719,3,720,3],[721,2,722,2],[721,3,722,3],[723,2,724,2],[723,3,724,3],[725,1,738,1],[725,2,726,2],[725,3,726,3],[727,2,728,2],[727,3,728,3],[729,2,730,2],[729,3,730,3],[731,2,732,2],[731,3,732,3],[733,2,734,2],[733,3,734,3],[735,2,736,2],[735,3,736,3],[737,2,738,2],[737,3,738,3],[739,1,752,1],[739,2,740,2],[739,3,740,3],[741,2,742,2],[741,3,742,3],[743,2,744,2],[743,3,744,3],[745,2,746,2],[745,3,746,3],[747,2,748,2],[747,3,748,3],[749,2,750,2],[749,3,750,3],[751,2,752,2],[751,3,752,3],[753,1,766,1],[753,2,754,2],[753,3,754,3],[755,2,756,2],[755,3,756,3],[757,2,758,2],[757,3,758,3],[759,2,760,2],[759,3,760,3],[761,2,762,2],[761,3,762,3],[763,2,764,2],[763,3,764,3],[765,2,766,2],[765,3,766,3],[767,1,780,1],[767,2,768,2],[767,3,768,3],[769,2,770,2],[769,3,770,3],[771,2,772,2],[771,3,772,3],[773,2,774,2],[773,3,774,3],[775,2,776,2],[775,3,776,3],[777,2,778,2],[777,3,778,3],[779,2,780,2],[779,3,780,3],[781,1,794,1],[781,2,782,2],[781,3,782,3],[783,2,784,2],[783,3,784,3],[785,2,786,2],[785,3,786,3],[787,2,788,2],[787,3,788,3],[789,2,790,2],[789,3,790,3],[791,2,792,2],[791,3,792,3],[793,2,794,2],[793,3,794,3],[795,1,808,1],[795,2,796,2],[795,3,796,3],[797,2,798,2],[797,3,798,3],[799,2,800,2],[799,3,800,3],[801,2,802,2],[801,3,802,3],[803,2,804,2],[803,3,804,3],[805,2,806,2],[805,3,806,3],[807,2,808,2],[807,3,808,3],[809,1,822,1],[809,2,810,2],[809,3,810,3],[811,2,812,2],[811,3,812,3],[813,2,814,2],[813,3,814,3],[815,2,816,2],[815,3,816,3],[817,2,818,2],[817,3,818,3],[819,2,820,2],[819,3,820,3],[821,2,822,2],[821,3,822,3],[823,1,836,1],[823,2,824,2],[823,3,824,3],[825,2,826,2],[825,3,826,3],[827,2,828,2],[827,3,828,3],[829,2,830,2],[829,3,830,3],[831,2,832,2],[831,3,832,3],[833,2,834,2],[833,3,834,3],[835,2,836,2],[835,3,836,3],[837,1,850,1],[837,2,838,2],[837,3,838,3],[839,2,840,2],[839,3,840,3],[841,2,842,2],[841,3,842,3],[843,2,844,2],[843,3,844,3],[845,2,846,2],[845,3,846,3],[847,2,848,2],[847,3,848,3],[849,2,850,2],[849,3,850,3],[851,1,864,1],[851,2,852,2],[851,3,852,3],[853,2,854,2],[853,3,854,3],[855,2,856,2],[855,3,856,3],[857,2,858,2],[857,3,858,3],[859,2,860,2],[859,3,860,3],[861,2,862,2],[861,3,862,3],[863,2,864,2],[863,3,864,3],[865,1,878,1],[865,2,866,2],[865,3,866,3],[867,2,868,2],[867,3,868,3],[869,2,870,2],[869,3,870,3],[871,2,872,2],[871,3,872,3],[873,2,874,2],[873,3,874,3],[875,2,876,2],[875,3,876,3],[877,2,878,2],[877,3,878,3],[879,1,892,1],[879,2,880,2],[879,3,880,3],[881,2,882,2],[881,3,882,3],[883,2,884,2],[883,3,884,3],[885,2,886,2],[885,3,886,3],[887,2,888,2],[887,3,888,3],[889,2,890,2],[889,3,890,3],[891,2,892,2],[891,3,892,3],[893,1,906,1],[893,2,894,2],[893,3,894,3],[895,2,896,2],[895,3,896,3],[897,2,898,2],[897,3,898,3],[899,2,900,2],[899,3,900,3],[901,2,902,2],[901,3,902,3],[903,2,904,2],[903,3,904,3],[905,2,906,2],[905,3,906,3],[907,1,920,1],[907,2,908,2],[907,3,908,3],[909,2,910,2],[909,3,910,3],[911,2,912,2],[911,3,912,3],[913,2,914,2],[913,3,914,3],[915,2,916,2],[915,3,916,3],[917,2,918,2],[917,3,918,3],[919,2,920,2],[919,3,920,3],[921,1,934,1],[921,2,922,2],[921,3,922,3],[923,2,924,2],[923,3,924,3],[925,2,926,2],[925,3,926,3],[927,2,928,2],[927,3,928,3],[929,2,930,2],[929,3,930,3],[931,2,932,2],[931,3,932,3],[933,2,934,2],[933,3,934,3],[935,1,948,1],[935,2,936,2],[935,3,936,3],[937,2,938,2],[937,3,938,3],[939,2,940,2],[939,3,940,3],[941,2,942,2],[941,3,942,3]],"merged_total":5221,"flags":["merged_cut"]}
[null,{"$f":"(LOOKUP(dms_Model,dms_Model_List,dms_Worksheet_List))","v":"REGULATORY REPORTING STATEMENT"}]
[null,{"$f":"INDEX(dms_TradingNameFull_List,MATCH(dms_TradingName,dms_TradingName_List))","v":"TasNetworks (T)"}]
[null,{"$f":"CONCATENATE(\"REGULATORY PERIOD FROM \", FRCP_y1,\" TO \",dms_MultiYear_FinalYear_Result)","v":"REGULATORY PERIOD FROM 2024-25 TO 2028-29"}]
[null,"5.4 MAXIMUM DEMAND AND UTILISATION AT SPATIAL LEVEL"]
[]
[null,"There is ONE table on this worksheet. It has been sub-grouped into blocks of approximately 500 rows for ease of navigation. See the Instructions sheet on how to group or ungroup data."]
[]
[null,"5.4.1 - NON-COINCIDENT & COINCIDENT MAXIMUM DEMAND"]
[null,null,null,null,null,null,null,null,null,null,null,null,null,null,null,null,"VOLUMES "]
[null,null,null,null,null,null,null,null,null,null,null,null,null,null,null,null,"Forecast (0's)"]
[null,"CONNECTION POINT","FORECASTING ELEMENTS","UNIT","MAX DEMAND",null,"TNSP NAME","SERVICE","SERVICE SUBCATEGORY","DATA TYPE","DATA TYPE SUBCATEGORY","LOCATION","LOCATION SUBCATEGORY","MEASUREMENT","DENOMINATION",null,{"$f":"dms_y1","v":"2022-23"},{"$f":"dms_y2","v":"2023-24"},{"$f":"dms_y3","v":"2024-25"},{"$f":"dms_y4","v":"2025-26"},{"$f":"dms_y5","v":"2026-27"},{"$f":"dms_y6","v":"2027-28"},{"$f":"dms_y7","v":"2028-29"}]
[null,"Arthurs Lake","CONNECTION POINT RATING","MVA","Non-coincident",null,"TNSP NAME","DEMAND FORECASTING","NON-COINCIDENT MAXIMUM DEMAND","DESCRIPTOR METRIC","CONNECTION POINT RATING","CONNECTION POINT",{"$f":"B12","v":"Arthurs Lake"},"RATING","MVA",null,35.437759522859224,35.437759522859224,35.437759522859224,35.437759522859224,35.437759522859224,35.437759522859224,35.437759522859224]
[null,null,null,null,"Coincident",null,"TNSP NAME","DEMAND FORECASTING","COINCIDENT MAXIMUM DEMAND","DESCRIPTOR METRIC","CONNECTION POINT RATING","CONNECTION POINT",{"$f":"M12","v":"Arthurs Lake"},"RATING","MVA",null,35.437759522859224,35.437759522859224,35.437759522859224,35.437759522859224,35.437759522859224,35.437759522859224,35.437759522859224]
[null,null,"WINTER/SUMMER PEAKING",null,"Non-coincident",null,"TNSP NAME","DEMAND FORECASTING","NON-COINCIDENT MAXIMUM DEMAND","DESCRIPTOR METRIC","WINTER/SUMMER PEAKING","CONNECTION POINT",{"$f":"#REF!","v":{"$error":"#REF!"}},"WINTER/SUMMER","WINTER/SUMMER",null,"Winter","Winter","Winter","Winter","Winter","Winter","Winter"]
[null,null,null,null,"Coincident",null,"TNSP NAME","DEMAND FORECASTING","COINCIDENT MAXIMUM DEMAND","DESCRIPTOR METRIC","WINTER/SUMMER PEAKING","CONNECTION POINT",{"$f":"M14","v":{"$error":"#REF!"}},"WINTER/SUMMER","WINTER/SUMMER",null,"Winter","Winter","Winter","Winter","Winter","Winter","Winter"]
[null,null,"ADJUSTMENTS - EMBEDDED GENERATION","MW","Non-coincident",null,"TNSP NAME","DEMAND FORECASTING","NON-COINCIDENT MAXIMUM DEMAND","DESCRIPTOR METRIC","ADJUSTMENTS - EMBEDDED GENERATION","CONNECTION POINT",{"$error":"#REF!"},"GENERATED LOAD","MW"]
[null,null,null,null,"Coincident",null,"TNSP NAME","DEMAND FORECASTING","COINCIDENT MAXIMUM DEMAND","DESCRIPTOR METRIC","ADJUSTMENTS - EMBEDDED GENERATION","CONNECTION POINT",{"$error":"#REF!"},"GENERATED LOAD","MW"]
[null,null,"WEATHER CORRECTED MD 10% POE","MW","Non-coincident",null,"TNSP NAME","DEMAND FORECASTING","NON-COINCIDENT MAXIMUM DEMAND","DESCRIPTOR METRIC","WEATHER CORRECTED MD 10% POE","CONNECTION POINT",{"$error":"#REF!"},"MAXIMUM DEMAND","MW",null,7.1426420000000004,7.1426420000000004,7.1426420000000004,7.1426420000000004,7.1426420000000004,7.1426420000000004,7.1426420000000004]
[null,null,null,null,"Coincident",null,"TNSP NAME","DEMAND FORECASTING","COINCIDENT MAXIMUM DEMAND","DESCRIPTOR METRIC","WEATHER CORRECTED MD 10% POE","CONNECTION POINT",{"$error":"#REF!"},"MAXIMUM DEMAND","MW",null,6.8225742966099734,6.8225742966099734,6.8225742966099734,6.8225742966099734,6.8225742966099734,6.8225742966099734,6.8225742966099734]
[null,null,"WEATHER CORRECTED MD 10% POE","MVA","Non-coincident",null,"TNSP NAME","DEMAND FORECASTING","NON-COINCIDENT MAXIMUM DEMAND","DESCRIPTOR METRIC","WEATHER CORRECTED MD 10% POE","CONNECTION POINT",{"$error":"#REF!"},"MAXIMUM DEMAND","MVA",null,7.3573320507324276,7.3573320507324276,7.3573320507324276,7.3573320507324276,7.3573320507324276,7.3573320507324276,7.3573320507324276]
[null,null,null,null,"Coincident",null,"TNSP NAME","DEMAND FORECASTING","COINCIDENT MAXIMUM DEMAND","DESCRIPTOR METRIC","WEATHER CORRECTED MD 10% POE","CONNECTION POINT",{"$error":"#REF!"},"MAXIMUM DEMAND","MVA",null,7.0222551564428688,7.0222551564428688,7.0222551564428688,7.0222551564428688,7.0222551564428688,7.0222551564428688,7.0222551564428688]
[null,null,"WEATHER CORRECTED MD 50% POE","MW","Non-coincident",null,"TNSP NAME","DEMAND FORECASTING","NON-COINCIDENT MAXIMUM DEMAND","DESCRIPTOR METRIC","WEATHER CORRECTED MD 50% POE","CONNECTION POINT",{"$error":"#REF!"},"MAXIMUM DEMAND","MW",null,7.1426420000000004,7.1426420000000004,7.1426420000000004,7.1426420000000004,7.1426420000000004,7.1426420000000004,7.1426420000000004]
[null,null,null,null,"Coincident",null,"TNSP NAME","DEMAND FORECASTING","COINCIDENT MAXIMUM DEMAND","DESCRIPTOR METRIC","WEATHER CORRECTED MD 50% POE","CONNECTION POINT",{"$error":"#REF!"},"MAXIMUM DEMAND","MW",null,6.8225742966099734,6.8225742966099734,6.8225742966099734,6.8225742966099734,6.8225742966099734,6.8225742966099734,6.8225742966099734]
[null,null,"WEATHER CORRECTED MD 50% POE","MVA","Non-coincident",null,"TNSP NAME","DEMAND FORECASTING","NON-COINCIDENT MAXIMUM DEMAND","DESCRIPTOR METRIC","WEATHER CORRECTED MD 50% POE","CONNECTION POINT",{"$error":"#REF!"},"MAXIMUM DEMAND","MVA",null,7.3573320507324276,7.3573320507324276,7.3573320507324276,7.3573320507324276,7.3573320507324276,7.3573320507324276,7.3573320507324276]
[null,null,null,null,"Coincident",null,"TNSP NAME","DEMAND FORECASTING","COINCIDENT MAXIMUM DEMAND","DESCRIPTOR METRIC","WEATHER CORRECTED MD 50% POE","CONNECTION POINT",{"$error":"#REF!"},"MAXIMUM DEMAND","MVA",null,7.0222551564428688,7.0222551564428688,7.0222551564428688,7.0222551564428688,7.0222551564428688,7.0222551564428688,7.0222551564428688]
[null,"Avoca","CONNECTION POINT RATING","MVA","Non-coincident",null,"TNSP NAME","DEMAND FORECASTING","NON-COINCIDENT MAXIMUM DEMAND","DESCRIPTOR METRIC","CONNECTION POINT RATING","CONNECTION POINT",{"$f":"B26","v":"Avoca"},"RATING","MVA"]
[null,null,null,null,"Coincident",null,"TNSP NAME","DEMAND FORECASTING","COINCIDENT MAXIMUM DEMAND","DESCRIPTOR METRIC","CONNECTION POINT RATING","CONNECTION POINT",{"$f":"M26","v":"Avoca"},"RATING","MVA"]
[null,null,"WINTER/SUMMER PEAKING",null,"Non-coincident",null,"TNSP NAME","DEMAND FORECASTING","NON-COINCIDENT MAXIMUM DEMAND","DESCRIPTOR METRIC","WINTER/SUMMER PEAKING","CONNECTION POINT",{"$f":"#REF!","v":{"$error":"#REF!"}},"WINTER/SUMMER","WINTER/SUMMER",null,"Summer","Summer","Summer","Summer","Summer","Summer","Summer"]
[null,null,null,null,"Coincident",null,"TNSP NAME","DEMAND FORECASTING","COINCIDENT MAXIMUM DEMAND","DESCRIPTOR METRIC","WINTER/SUMMER PEAKING","CONNECTION POINT",{"$f":"M28","v":{"$error":"#REF!"}},"WINTER/SUMMER","WINTER/SUMMER",null,"Winter","Winter","Winter","Winter","Winter","Winter","Winter"]
[null,null,"ADJUSTMENTS - EMBEDDED GENERATION","MW","Non-coincident",null,"TNSP NAME","DEMAND FORECASTING","NON-COINCIDENT MAXIMUM DEMAND","DESCRIPTOR METRIC","ADJUSTMENTS - EMBEDDED GENERATION","CONNECTION POINT",{"$error":"#REF!"},"GENERATED LOAD","MW"]
[null,null,null,null,"Coincident",null,"TNSP NAME","DEMAND FORECASTING","COINCIDENT MAXIMUM DEMAND","DESCRIPTOR METRIC","ADJUSTMENTS - EMBEDDED GENERATION","CONNECTION POINT",{"$error":"#REF!"},"GENERATED LOAD","MW"]
[null,null,"WEATHER CORRECTED MD 10% POE","MW","Non-coincident",null,"TNSP NAME","DEMAND FORECASTING","NON-COINCIDENT MAXIMUM DEMAND","DESCRIPTOR METRIC","WEATHER CORRECTED MD 10% POE","CONNECTION POINT",{"$error":"#REF!"},"MAXIMUM DEMAND","MW",null,6.3933819999999999,6.3933819999999999,6.3933819999999999,6.3933819999999999,6.3933819999999999,6.3933819999999999,6.3933819999999999]
[null,null,null,null,"Coincident",null,"TNSP NAME","DEMAND FORECASTING","COINCIDENT MAXIMUM DEMAND","DESCRIPTOR METRIC","WEATHER CORRECTED MD 10% POE","CONNECTION POINT",{"$error":"#REF!"},"MAXIMUM DEMAND","MW",null,6.374964426480104,6.374964426480104,6.374964426480104,6.374964426480104,6.374964426480104,6.374964426480104,6.374964426480104]
[null,null,"WEATHER CORRECTED MD 10% POE","MVA","Non-coincident",null,"TNSP NAME","DEMAND FORECASTING","NON-COINCIDENT MAXIMUM DEMAND","DESCRIPTOR METRIC","WEATHER CORRECTED MD 10% POE","CONNECTION POINT",{"$error":"#REF!"},"MAXIMUM DEMAND","MVA",null,6.6078193492075359,6.6078193492075359,6.6078193492075359,6.6078193492075359,6.6078193492075359,6.6078193492075359,6.6078193492075359]
[null,null,null,null,"Coincident",null,"TNSP NAME","DEMAND FORECASTING","COINCIDENT MAXIMUM DEMAND","DESCRIPTOR METRIC","WEATHER CORRECTED MD 10% POE","CONNECTION POINT",{"$error":"#REF!"},"MAXIMUM DEMAND","MVA",null,6.5744943217656608,6.5744943217656608,6.5744943217656608,6.5744943217656608,6.5744943217656608,6.5744943217656608,6.5744943217656608]
[null,null,"WEATHER CORRECTED MD 50% POE","MW","Non-coincident",null,"TNSP NAME","DEMAND FORECASTING","NON-COINCIDENT MAXIMUM DEMAND","DESCRIPTOR METRIC","WEATHER CORRECTED MD 50% POE","CONNECTION POINT",{"$error":"#REF!"},"MAXIMUM DEMAND","MW",null,6.3933819999999999,6.3933819999999999,6.3933819999999999,6.3933819999999999,6.3933819999999999,6.3933819999999999,6.3933819999999999]
[null,null,null,null,"Coincident",null,"TNSP NAME","DEMAND FORECASTING","COINCIDENT MAXIMUM DEMAND","DESCRIPTOR METRIC","WEATHER CORRECTED MD 50% POE","CONNECTION POINT",{"$error":"#REF!"},"MAXIMUM DEMAND","MW",null,6.374964426480104,6.374964426480104,6.374964426480104,6.374964426480104,6.374964426480104,6.374964426480104,6.374964426480104]
[null,null,"WEATHER CORRECTED MD 50% POE","MVA","Non-coincident",null,"TNSP NAME","DEMAND FORECASTING","NON-COINCIDENT MAXIMUM DEMAND","DESCRIPTOR METRIC","WEATHER CORRECTED MD 50% POE","CONNECTION POINT",{"$error":"#REF!"},"MAXIMUM DEMAND","MVA",null,6.6078193492075359,6.6078193492075359,6.6078193492075359,6.6078193492075359,6.6078193492075359,6.6078193492075359,6.6078193492075359]
[null,null,null,null,"Coincident",null,"TNSP NAME","DEMAND FORECASTING","COINCIDENT MAXIMUM DEMAND","DESCRIPTOR METRIC","WEATHER CORRECTED MD 50% POE","CONNECTION POINT",{"$error":"#REF!"},"MAXIMUM DEMAND","MVA",null,6.5744943217656608,6.5744943217656608,6.5744943217656608,6.5744943217656608,6.5744943217656608,6.5744943217656608,6.5744943217656608]
[null,"Boyer","CONNECTION POINT RATING","MVA","Non-coincident"]
[null,null,null,null,"Coincident"]
[null,null,"WINTER/SUMMER PEAKING",null,"Non-coincident"]
[null,null,null,null,"Coincident"]
[null,null,"ADJUSTMENTS - EMBEDDED GENERATION","MW","Non-coincident"]
[null,null,null,null,"Coincident"]
[null,null,"WEATHER CORRECTED MD 10% POE","MW","Non-coincident"]
[null,null,null,null,"Coincident"]
[null,null,"WEATHER CORRECTED MD 10% POE","MVA","Non-coincident"]
[null,null,null,null,"Coincident"]
[null,null,"WEATHER CORRECTED MD 50% POE","MW","Non-coincident"]
[null,null,null,null,"Coincident"]
[null,null,"WEATHER CORRECTED MD 50% POE","MVA","Non-coincident"]
[null,null,null,null,"Coincident"]
[null,"Bridgewater","CONNECTION POINT RATING","MVA","Non-coincident",null,null,null,null,null,null,null,null,null,null,null,84,84,84,84,84,84,84]
[null,null,null,null,"Coincident",null,null,null,null,null,null,null,null,null,null,null,84,84,84,84,84,84,84]
[null,null,"WINTER/SUMMER PEAKING",null,"Non-coincident",null,null,null,null,null,null,null,null,null,null,null,"Winter","Winter","Winter","Winter","Winter","Winter","Winter"]
[null,null,null,null,"Coincident",null,null,null,null,null,null,null,null,null,null,null,"Winter","Winter","Winter","Winter","Winter","Winter","Winter"]
[null,null,"ADJUSTMENTS - EMBEDDED GENERATION","MW","Non-coincident"]
[null,null,null,null,"Coincident"]
[null,null,"WEATHER CORRECTED MD 10% POE","MW","Non-coincident",null,null,null,null,null,null,null,null,null,null,null,34.901269999999997,35.161839999999998,35.414299999999997,35.661119999999997,35.905569999999997,36.157890000000002,36.417470000000002]
[null,null,null,null,"Coincident",null,null,null,null,null,null,null,null,null,null,null,32.690284136534565,32.934347098640437,33.170813827017646,33.401997847844953,33.630962007520971,33.867297604859708,34.110433283193522]
[null,null,"WEATHER CORRECTED MD 10% POE","MVA","Non-coincident",null,null,null,null,null,null,null,null,null,null,null,34.931535593559282,35.192331553981745,35.445010481595268,35.692044518328096,35.936706499850416,36.1892453060591,36.449050407975911]
[null,null,null,null,"Coincident",null,null,null,null,null,null,null,null,null,null,null,32.718632413058998,32.962907021056665,33.199578808043242,33.430963306435167,33.660126018662325,33.896666560896549,34.140013081002607]
[null,null,"WEATHER CORRECTED MD 50% POE","MW","Non-coincident",null,null,null,null,null,null,null,null,null,null,null,33.857129999999998,34.10989,34.354590000000002,34.593789999999998,34.830750000000002,35.07564,35.328020000000002]
[null,null,null,null,"Coincident",null,null,null,null,null,null,null,null,null,null,null,31.712290118599942,31.949037842059592,32.178236164304316,32.402282910037606,32.624231559155341,32.853607844952272,33.089999641307493]
[null,null,"WEATHER CORRECTED MD 50% POE","MVA","Non-coincident",null,null,null,null,null,null,null,null,null,null,null,33.886490138919406,34.139469326686161,34.384381525002844,34.623788953843665,34.860954440207053,35.106056803287437,35.358655661526768]
[null,null,null,null,"Coincident",null,null,null,null,null,null,null,null,null,null,null,31.739790300787114,31.976743326528723,32.206140404385074,32.430381438399124,32.652522556375594,32.882097752110134,33.118694542095362]
[null,"Burnie","CONNECTION POINT RATING","MVA","Non-coincident",null,null,null,null,null,null,null,null,null,null,null,120.41217214218834,120.41217214218834,120.41217214218834,120.41217214218834,120.41217214218834,120.41217214218834,120.41217214218834]
[null,null,null,null,"Coincident",null,null,null,null,null,null,null,null,null,null,null,120.41217214218834,120.41217214218834,120.41217214218834,120.41217214218834,120.41217214218834,120.41217214218834,120.41217214218834]
[null,null,"WINTER/SUMMER PEAKING",null,"Non-coincident",null,null,null,null,null,null,null,null,null,null,null,"Winter","Winter","Winter","Winter","Winter","Winter","Winter"]
[null,null,null,null,"Coincident",null,null,null,null,null,null,null,null,null,null,null,"Winter","Winter","Winter","Winter","Winter","Winter","Winter"]
[null,null,"ADJUSTMENTS - EMBEDDED GENERATION","MW","Non-coincident"]
[null,null,null,null,"Coincident"]
[null,null,"WEATHER CORRECTED MD 10% POE","MW","Non-coincident",null,null,null,null,null,null,null,null,null,null,null,58.261020000000002,58.060090000000002,57.890329999999999,57.711550000000003,57.525100000000002,57.340299999999999,57.179760000000002]
[null,null,null,null,"Coincident",null,null,null,null,null,null,null,null,null,null,null,54.123777456279782,53.937115935347087,53.779410964493877,53.61332652358238,53.440116746157898,53.268439798622126,53.119300095389484]
[null,null,"WEATHER CORRECTED MD 10% POE","MVA","Non-coincident",null,null,null,null,null,null,null,null,null,null,null,58.301859584203626,58.100788737070253,57.930909739362789,57.75200441885066,57.565423721851623,57.380494181463192,57.219841646755633]
[null,null,null,null,"Coincident",null,null,null,null,null,null,null,null,null,null,null,54.161716932225168,53.974924566022317,53.817109047749298,53.650908185609516,53.477576992265945,53.305779703288252,53.156535456683933]
[null,null,"WEATHER CORRECTED MD 50% POE","MW","Non-coincident",null,null,null,null,null,null,null,null,null,null,null,56.86347,56.716760000000001,56.55059,56.375590000000003,56.193219999999997,56.012689999999999,55.856650000000002]
[null,null,null,null,"Coincident",null,null,null,null,null,null,null,null,null,null,null,52.825470540540515,52.689178738738711,52.534808834128221,52.372235967143588,52.202816459989371,52.035106290408031,51.890147032326418]
[null,null,"WEATHER CORRECTED MD 50% POE","MVA","Non-coincident",null,null,null,null,null,null,null,null,null,null,null,56.90332993501616,56.756517094808444,56.590230613605279,56.41510794278291,56.232610105766469,56.05195355854611,55.895804178231131]
[null,null,null,null,"Coincident",null,null,null,null,null,null,null,null,null,null,null,52.86249993433136,52.72611259523007,52.571634481001595,52.408947654318169,52.239409388133851,52.071581657727236,51.926520786666195]
[null,"Chapel Street","CONNECTION POINT RATING","MVA","Non-coincident",null,null,null,null,null,null,null,null,null,null,null,120.41217214218834,120.41217214218834,120.41217214218834,120.41217214218834,120.41217214218834,120.41217214218834,120.41217214218834]
[null,null,null,null,"Coincident",null,null,null,null,null,null,null,null,null,null,null,120.41217214218834,120.41217214218834,120.41217214218834,120.41217214218834,120.41217214218834,120.41217214218834,120.41217214218834]
[null,null,"WINTER/SUMMER PEAKING",null,"Non-coincident",null,null,null,null,null,null,null,null,null,null,null,"Winter","Winter","Winter","Winter","Winter","Winter","Winter"]
[null,null,null,null,"Coincident",null,null,null,null,null,null,null,null,null,null,null,"Winter","Winter","Winter","Winter","Winter","Winter","Winter"]
[null,null,"ADJUSTMENTS - EMBEDDED GENERATION","MW","Non-coincident"]
[null,null,null,null,"Coincident"]
[null,null,"WEATHER CORRECTED MD 10% POE","MW","Non-coincident",null,null,null,null,null,null,null,null,null,null,null,40.453890000000001,40.636870000000002,40.825850000000003,41.01529,41.209919999999997,41.406640000000003,41.604280000000003]
[null,null,null,null,"Coincident",null,null,null,null,null,null,null,null,null,null,null,36.483355341914717,36.648375921158483,36.81880760257441,36.989654135156876,37.16518127111825,37.342593274336281,37.520834979887368]
[null,null,"WEATHER CORRECTED MD 10% POE","MVA","Non-coincident",null,null,null,null,null,null,null,null,null,null,null,40.463198410733355,40.646220514298577,40.83524399845944,41.024727588465971,41.219402372687732,41.41616763781699,41.613853114637571]
[null,null,null,null,"Coincident",null,null,null,null,null,null,null,null,null,null,null,36.491750135504489,36.656808685863794,36.827279583485939,36.998165427731578,37.173732952359565,37.351185777950796,37.529468496788986]
[null,null,"WEATHER CORRECTED MD 50% POE","MW","Non-coincident",null,null,null,null,null,null,null,null,null,null,null,38.763919999999999,38.939430000000002,39.120699999999999,39.302410000000002,39.489100000000001,39.677799999999998,39.867370000000001]
[null,null,null,null,"Coincident",null,null,null,null,null,null,null,null,null,null,null,34.959255285599347,35.117539042638775,35.281017457763468,35.444892687047464,35.613259131134349,35.783438294448906,35.954402067578435]
[null,null,"WEATHER CORRECTED MD 50% POE","MVA","Non-coincident",null,null,null,null,null,null,null,null,null,null,null,38.772839549862695,38.948389934586338,39.129701644681795,39.311453456020935,39.498186413254466,39.686929832987531,39.876543452906972]
[null,null,null,null,"Coincident",null,null,null,null,null,null,null,null,null,null,null,34.967299384872142,35.125619562889199,35.289135594278584,35.453048531133923,35.621453716217417,35.791672037633958,35.962675149403623]
[null,"Comalco","CONNECTION POINT RATING","MVA","Non-coincident"]
[null,null,null,null,"Coincident"]
[null,null,"WINTER/SUMMER PEAKING",null,"Non-coincident"]
[null,null,null,null,"Coincident"]
[null,null,"ADJUSTMENTS - EMBEDDED GENERATION","MW","Non-coincident"]
[null,null,null,null,"Coincident"]
[null,null,"WEATHER CORRECTED MD 10% POE","MW","Non-coincident"]
[null,null,null,null,"Coincident"]
[null,null,"WEATHER CORRECTED MD 10% POE","MVA","Non-coincident"]
[null,null,null,null,"Coincident"]
[null,null,"WEATHER CORRECTED MD 50% POE","MW","Non-coincident"]
[null,null,null,null,"Coincident"]
[null,null,"WEATHER CORRECTED MD 50% POE","MVA","Non-coincident"]
[null,null,null,null,"Coincident"]
[null,"Creek Road","CONNECTION POINT RATING","MVA","Non-coincident",null,null,null,null,null,null,null,null,null,null,null,216,216,216,216,216,216,216]
[null,null,null,null,"Coincident",null,null,null,null,null,null,null,null,null,null,null,216,216,216,216,216,216,216]
[null,null,"WINTER/SUMMER PEAKING",null,"Non-coincident",null,null,null,null,null,null,null,null,null,null,null,"Winter","Winter","Winter","Winter","Winter","Winter","Winter"]
[null,null,null,null,"Coincident",null,null,null,null,null,null,null,null,null,null,null,"Winter","Winter","Winter","Winter","Winter","Winter","Winter"]
[null,null,"ADJUSTMENTS - EMBEDDED GENERATION","MW","Non-coincident"]
[null,null,null,null,"Coincident"]
[null,null,"WEATHER CORRECTED MD 10% POE","MW","Non-coincident",null,null,null,null,null,null,null,null,null,null,null,91.837239999999994,92.199250000000006,92.606960000000001,92.997550000000004,93.413349999999994,93.796970000000002,94.211070000000007]
[null,null,null,null,"Coincident",null,null,null,null,null,null,null,null,null,null,null,86.804473217798574,87.146644730679157,87.532011840749405,87.901197142857129,88.294210913348934,88.656808177985937,89.048215110070245]
[null,null,"WEATHER CORRECTED MD 10% POE","MVA","Non-coincident",null,null,null,null,null,null,null,null,null,null,null,92.909805188542464,93.276043095695442,93.688514732184302,94.083666424554337,94.504322543982525,94.892422833869603,95.311359099033666]
[null,null,null,null,"Coincident",null,null,null,null,null,null,null,null,null,null,null,87.81826082926402,88.164428556025001,88.554296360443985,88.92779336990661,89.325397139932889,89.692229170374162,90.088207335761084]
[null,null,"WEATHER CORRECTED MD 50% POE","MW","Non-coincident",null,null,null,null,null,null,null,null,null,null,null,89.636300000000006,89.987539999999996,90.384370000000004,90.764110000000002,91.168930000000003,91.541569999999993,91.944670000000002]
[null,null,null,null,"Coincident",null,null,null,null,null,null,null,null,null,null,null,84.724146791569083,85.056138510538631,85.431221854800924,85.790151747072585,86.172787231850108,86.525006210772816,86.906015953161585]
[null,null,"WEATHER CORRECTED MD 50% POE","MVA","Non-coincident",null,null,null,null,null,null,null,null,null,null,null,90.683160456713964,91.038502581264126,91.439967150462522,91.82414212591145,92.233690010151278,92.610682064849982,93.01848986124611]
[null,null,null,null,"Coincident",null,null,null,null,null,null,null,null,null,null,null,85.713638314589588,86.049507357841208,86.428971292568306,86.792093119479759,87.17919739601183,87.535529932958895,87.920989480091166]
[null,"Derby","CONNECTION POINT RATING","MVA","Non-coincident",null,null,null,null,null,null,null,null,null,null,null,25.378008432499186,25.378008432499186,25.378008432499186,25.378008432499186,25.378008432499186,25.378008432499186,25.378008432499186]
[null,null,null,null,"Coincident",null,null,null,null,null,null,null,null,null,null,null,25.378008432499186,25.378008432499186,25.378008432499186,25.378008432499186,25.378008432499186,25.378008432499186,25.378008432499186]
[null,null,"WINTER/SUMMER PEAKING",null,"Non-coincident",null,null,null,null,null,null,null,null,null,null,null,"Summer","Summer","Summer","Summer","Summer","Summer","Summer"]
[null,null,null,null,"Coincident",null,null,null,null,null,null,null,null,null,null,null,"Winter","Winter","Winter","Winter","Winter","Winter","Winter"]
[null,null,"ADJUSTMENTS - EMBEDDED GENERATION","MW","Non-coincident"]
[null,null,null,null,"Coincident"]
[null,null,"WEATHER CORRECTED MD 10% POE","MW","Non-coincident",null,null,null,null,null,null,null,null,null,null,null,6.7765199999999997,6.7355299999999998,6.6775399999999996,6.6065800000000001,6.5206499999999998,6.4700499999999996,6.4301000000000004]
[null,null,null,null,"Coincident",null,null,null,null,null,null,null,null,null,null,null,4.8188586666666655,4.7897102222222214,4.7484728888888883,4.6980124444444442,4.6369066666666656,4.6009244444444439,4.5725155555555554]
[null,null,"WEATHER CORRECTED MD 10% POE","MVA","Non-coincident",null,null,null,null,null,null,null,null,null,null,null,6.8902175466208408,6.8485398097830563,6.7895768442006412,6.717426265864237,6.6300545184509438,6.5786055434816353,6.5379852559317575]
[null,null,null,null,"Coincident",null,null,null,null,null,null,null,null,null,null,null,4.8997102553748197,4.8700727536235062,4.8281435336537895,4.7768364557256797,4.7147054353428928,4.6781194975869402,4.649233959773694]
[null,null,"WEATHER CORRECTED MD 50% POE","MW","Non-coincident",null,null,null,null,null,null,null,null,null,null,null,6.4908000000000001,6.4507099999999999,6.3936900000000003,6.3237399999999999,6.2389000000000001,6.1894799999999996,6.1507800000000001]
[null,null,null,null,"Coincident",null,null,null,null,null,null,null,null,null,null,null,4.6156799999999993,4.587171555555555,4.5466239999999996,4.4968817777777774,4.4365511111111102,4.4014079999999991,4.373888]
[null,null,"WEATHER CORRECTED MD 50% POE","MVA","Non-coincident",null,null,null,null,null,null,null,null,null,null,null,6.5997036903316983,6.5589410538392166,6.5009643630734084,6.4298407306800662,6.3435772714627525,6.2933280947239529,6.2539787798758866]
[null,null,null,null,"Coincident",null,null,null,null,null,null,null,null,null,null,null,4.6931226242358735,4.6641358605078871,4.6229079915188676,4.5723311862613798,4.510988281929067,4.4752555340259219,4.4472737990228524]
[null,"Derwent Bridge","CONNECTION POINT RATING","MVA","Non-coincident",null,null,null,null,null,null,null,null,null,null,null,8,8,8,8,8,8,8]
[null,null,null,null,"Coincident",null,null,null,null,null,null,null,null,null,null,null,8,8,8,8,8,8,8]
[null,null,"WINTER/SUMMER PEAKING",null,"Non-coincident",null,null,null,null,null,null,null,null,null,null,null,"Winter","Winter","Winter","Winter","Winter","Winter","Winter"]
[null,null,null,null,"Coincident",null,null,null,null,null,null,null,null,null,null,null,"Winter","Winter","Winter","Winter","Winter","Winter","Winter"]
[null,null,"ADJUSTMENTS - EMBEDDED GENERATION","MW","Non-coincident"]
[null,null,null,null,"Coincident"]
[null,null,"WEATHER CORRECTED MD 10% POE","MW","Non-coincident",null,null,null,null,null,null,null,null,null,null,null,0.33598,0.3357,0.33546999999999999,0.33528999999999998,0.33445999999999998,0.32968999999999998,0.32971]
[null,null,null,null,"Coincident",null,null,null,null,null,null,null,null,null,null,null,0.24148562500000001,0.241284375,0.24111906249999998,0.24098968749999999,0.24039312499999999,0.23696468749999999,0.2369790625]
[null,null,"WEATHER CORRECTED MD 10% POE","MVA","Non-coincident",null,null,null,null,null,null,null,null,null,null,null,0.33859466978416858,0.33831249076297815,0.33808070085271452,0.33789930005337782,0.33706284081199184,0.33225571962956879,0.33227587527393959]
[null,null,null,null,"Coincident",null,null,null,null,null,null,null,null,null,null,null,0.24336491890737116,0.24316210273589053,0.24299550373788856,0.24286512191336532,0.24226391683361911,0.23880879848375258,0.23882328535314407]
[null,null,"WEATHER CORRECTED MD 50% POE","MW","Non-coincident",null,null,null,null,null,null,null,null,null,null,null,0.29820000000000002,0.29819000000000001,0.29819000000000001,0.29818,0.29781999999999997,0.29379,0.29385]
[null,null,null,null,"Coincident",null,null,null,null,null,null,null,null,null,null,null,0.21433125000000003,0.2143240625,0.2143240625,0.21431687499999999,0.21405812499999999,0.21116156250000001,0.21120468749999999]
[null,null,"WEATHER CORRECTED MD 50% POE","MVA","Non-coincident",null,null,null,null,null,null,null,null,null,null,null,0.30052065756782864,0.30051057974564327,0.30051057974564327,0.3005005019234579,0.30013770032478443,0.29607633798407906,0.2961368049171913]
[null,null,null,null,"Coincident",null,null,null,null,null,null,null,null,null,null,null,0.21599922262687687,0.2159919791921811,0.2159919791921811,0.21598473575748536,0.21572397210843883,0.21280486792605685,0.21284832853423125]
[null,"Devonport","CONNECTION POINT RATING","MVA","Non-coincident",null,null,null,null,null,null,null,null,null,null,null,132,132,132,132,132,132,132]
[null,null,null,null,"Coincident",null,null,null,null,null,null,null,null,null,null,null,132,132,132,132,132,132,132]
[null,null,"WINTER/SUMMER PEAKING",null,"Non-coincident",null,null,null,null,null,null,null,null,null,null,null,"Winter","Winter","Winter","Winter","Winter","Winter","Winter"]
[null,null,null,null,"Coincident",null,null,null,null,null,null,null,null,null,null,null,"Winter","Winter","Winter","Winter","Winter","Winter","Winter"]
[null,null,"ADJUSTMENTS - EMBEDDED GENERATION","MW","Non-coincident"]
[null,null,null,null,"Coincident"]
[null,null,"WEATHER CORRECTED MD 10% POE","MW","Non-coincident",null,null,null,null,null,null,null,null,null,null,null,56.577089999999998,56.552750000000003,56.547519999999999,56.530009999999997,56.535170000000001,56.52449,56.537309999999998]
[null,null,null,null,"Coincident",null,null,null,null,null,null,null,null,null,null,null,53.960112157925288,53.936898006580215,53.93190992065027,53.915209847106631,53.920131170892198,53.909945175149986,53.922172185020315]
[null,null,"WEATHER CORRECTED MD 10% POE","MVA","Non-coincident",null,null,null,null,null,null,null,null,null,null,null,56.92754773436608,56.903056964129327,56.897794567730877,56.880176104836636,56.885368067631291,56.874621912079576,56.887521323518989]
[null,null,null,null,"Coincident",null,null,null,null,null,null,null,null,null,null,null,54.294359441640417,54.271001493947992,54.26598251011761,54.249178990639621,54.254130798778199,54.243881707514639,54.256184455641872]
[null,null,"WEATHER CORRECTED MD 50% POE","MW","Non-coincident",null,null,null,null,null,null,null,null,null,null,null,54.465290000000003,54.439250000000001,54.432270000000003,54.41301,54.416420000000002,54.404040000000002,54.415120000000002]
[null,null,null,null,"Coincident",null,null,null,null,null,null,null,null,null,null,null,51.945993636539576,51.921158118831038,51.914500979291653,51.896131852138566,51.899384122314686,51.887576760209015,51.898144253919099]
[null,null,"WEATHER CORRECTED MD 50% POE","MVA","Non-coincident",null,null,null,null,null,null,null,null,null,null,null,54.802666527053475,54.776465226438631,54.769441989945101,54.750062686955779,54.753493809655346,54.741037123725555,54.752185757013287]
[null,null,null,null,"Coincident",null,null,null,null,null,null,null,null,null,null,null,52.267764785236984,52.2427754278865,52.236077051761065,52.217594139988016,52.220866555831527,52.208986054909914,52.219619007269486]
[null,"Electrona","CONNECTION POINT RATING","MVA","Non-coincident",null,null,null,null,null,null,null,null,null,null,null,60,60,60,60,60,60,60]
[null,null,null,null,"Coincident",null,null,null,null,null,null,null,null,null,null,null,60,60,60,60,60,60,60]
[null,null,"WINTER/SUMMER PEAKING",null,"Non-coincident",null,null,null,null,null,null,null,null,null,null,null,"Winter","Winter","Winter","Winter","Winter","Winter","Winter"]
[null,null,null,null,"Coincident",null,null,null,null,null,null,null,null,null,null,null,"Winter","Winter","Winter","Winter","Winter","Winter","Winter"]
[null,null,"ADJUSTMENTS - EMBEDDED GENERATION","MW","Non-coincident"]
[null,null,null,null,"Coincident"]
[null,null,"WEATHER CORRECTED MD 10% POE","MW","Non-coincident",null,null,null,null,null,null,null,null,null,null,null,16.1965,16.2836,16.349720000000001,16.398029999999999,16.451779999999999,16.484349999999999,16.557960000000001]
[null,null,null,null,"Coincident",null,null,null,null,null,null,null,null,null,null,null,14.275729153798626,14.352499814700415,14.410778529956747,14.4533593638048,14.500735058678179,14.529442526250754,14.594322989499675]
[null,null,"WEATHER CORRECTED MD 10% POE","MVA","Non-coincident",null,null,null,null,null,null,null,null,null,null,null,16.226752583119467,16.314015272588776,16.380258774629088,16.428659010315219,16.482509407088763,16.515140242863911,16.588887735077876]
[null,null,null,null,"Coincident",null,null,null,null,null,null,null,null,null,null,null,14.302394030952101,14.379308087698677,14.437695658675528,14.480356027004195,14.52782021242473,14.556581301153042,14.621582951177331]
[null,null,"WEATHER CORRECTED MD 50% POE","MW","Non-coincident",null,null,null,null,null,null,null,null,null,null,null,15.64939,15.733409999999999,15.7965,15.841839999999999,15.89265,15.92235,15.993169999999999]
[null,null,null,null,"Coincident",null,null,null,null,null,null,null,null,null,null,null,13.793501871525617,13.867557794935129,13.923165843113017,13.96312889437923,14.007913248919071,14.034091074737477,14.096512408894363]
[null,null,"WEATHER CORRECTED MD 50% POE","MVA","Non-coincident",null,null,null,null,null,null,null,null,null,null,null,15.678620665374861,15.762797601875567,15.826005444339618,15.871430132520313,15.922335037823824,15.952090512878227,16.023042793799199]
[null,null,null,null,"Coincident",null,null,null,null,null,null,null,null,null,null,null,13.819266021920876,13.893460270461031,13.949172185962082,13.9892098820917,14.034077886951557,14.060304608942067,14.122842536597549]
[null,"Emu Bay","CONNECTION POINT RATING","MVA","Non-coincident",null,null,null,null,null,null,null,null,null,null,null,76.210235533030598,76.210235533030598,76.210235533030598,76.210235533030598,76.210235533030598,76.210235533030598,76.210235533030598]
[null,null,null,null,"Coincident",null,null,null,null,null,null,null,null,null,null,null,76.210235533030598,76.210235533030598,76.210235533030598,76.210235533030598,76.210235533030598,76.210235533030598,76.210235533030598]
[null,null,"WINTER/SUMMER PEAKING",null,"Non-coincident",null,null,null,null,null,null,null,null,null,null,null,"Winter","Winter","Winter","Winter","Winter","Winter","Winter"]
[null,null,null,null,"Coincident",null,null,null,null,null,null,null,null,null,null,null,"Winter","Winter","Winter","Winter","Winter","Winter","Winter"]
[null,null,"ADJUSTMENTS - EMBEDDED GENERATION","MW","Non-coincident"]
[null,null,null,null,"Coincident"]
[null,null,"WEATHER CORRECTED MD 10% POE","MW","Non-coincident",null,null,null,null,null,null,null,null,null,null,null,8.2401099999999996,8.20472,8.1689399999999992,8.1306799999999999,8.0934600000000003,8.0565200000000008,8.0205000000000002]
[null,null,null,null,"Coincident",null,null,null,null,null,null,null,null,null,null,null,7.2826000111731819,7.2513223687150825,7.2197000446927353,7.185885899441339,7.1529909050279317,7.1203433743016751,7.0885089385474842]
[null,null,"WEATHER CORRECTED MD 10% POE","MVA","Non-coincident",null,null,null,null,null,null,null,null,null,null,null,8.4876058115823465,8.4511528552902693,8.4142981851537755,8.374889026980993,8.3365511057266541,8.2985015944118956,8.2613997157557613]
[null,null,null,null,"Coincident",null,null,null,null,null,null,null,null,null,null,null,7.5013365329180264,7.4691194508766507,7.4365473345884201,7.4017175646278925,7.3678345526589739,7.3342064370724112,7.3014158381707324]
[null,null,"WEATHER CORRECTED MD 50% POE","MW","Non-coincident",null,null,null,null,null,null,null,null,null,null,null,8.0237099999999995,7.9912700000000001,7.9580000000000002,7.9227299999999996,7.8867500000000001,7.8504800000000001,7.8152100000000004]
[null,null,null,null,"Coincident",null,null,null,null,null,null,null,null,null,null,null,7.0913459329608921,7.0626754972067021,7.0332715083798867,7.0020999217877078,6.9703008379888249,6.9382454525139652,6.9070738659217863]
[null,null,"WEATHER CORRECTED MD 50% POE","MVA","Non-coincident",null,null,null,null,null,null,null,null,null,null,null,8.2647061297059601,8.231291778134473,8.1970224970992263,8.1606931450669702,8.1236324678307774,8.0862730803000176,8.0499437282677615]
[null,null,null,null,"Coincident",null,null,null,null,null,null,null,null,null,null,null,7.3043380431256013,7.2748064765411922,7.2445193242519403,7.2124114835172879,7.1796572983845177,7.146639113427165,7.1145312726925116]
[null,"George Town","CONNECTION POINT RATING","MVA","Non-coincident",null,null,null,null,null,null,null,null,null,null,null,95.262794416288244,95.262794416288244,95.262794416288244,95.262794416288244,95.262794416288244,95.262794416288244,95.262794416288244]
[null,null,null,null,"Coincident",null,null,null,null,null,null,null,null,null,null,null,95.262794416288244,95.262794416288244,95.262794416288244,95.262794416288244,95.262794416288244,95.262794416288244,95.262794416288244]
[null,null,"WINTER/SUMMER PEAKING",null,"Non-coincident",null,null,null,null,null,null,null,null,null,null,null,"Winter","Winter","Winter","Winter","Winter","Winter","Winter"]
[null,null,null,null,"Coincident",null,null,null,null,null,null,null,null,null,null,null,"Winter","Winter","Winter","Winter","Winter","Winter","Winter"]
[null,null,"ADJUSTMENTS - EMBEDDED GENERATION","MW","Non-coincident"]
[null,null,null,null,"Coincident"]
[null,null,"WEATHER CORRECTED MD 10% POE","MW","Non-coincident",null,null,null,null,null,null,null,null,null,null,null,21.211549999999999,21.221640000000001,21.240469999999998,21.263089999999998,21.257650000000002,21.250620000000001,21.259180000000001]
[null,null,null,null,"Coincident",null,null,null,null,null,null,null,null,null,null,null,16.474701053370786,16.482537808988766,16.497162794943819,16.514731418539327,16.510506250000002,16.505046151685395,16.511694578651685]
[null,null,"WEATHER CORRECTED MD 10% POE","MVA","Non-coincident",null,null,null,null,null,null,null,null,null,null,null,21.22359707445748,21.233692805060915,21.252533499536895,21.275166346538846,21.269723256897354,21.262689264217261,21.271254125859024]
[null,null,null,null,"Coincident",null,null,null,null,null,null,null,null,null,null,null,16.48405784013341,16.49189904662737,16.506532338825707,16.524110940499977,16.519883372281235,16.514420172910317,16.521072375842753]
[null,null,"WEATHER CORRECTED MD 50% POE","MW","Non-coincident",null,null,null,null,null,null,null,null,null,null,null,20.583600000000001,20.591819999999998,20.60894,20.63006,20.623259999999998,20.614999999999998,20.622530000000001]
[null,null,null,null,"Coincident",null,null,null,null,null,null,null,null,null,null,null,15.986981460674158,15.993365814606742,16.006662668539327,16.023066264044946,16.017784803370787,16.011369382022473,16.017217823033711]
[null,null,"WEATHER CORRECTED MD 50% POE","MVA","Non-coincident",null,null,null,null,null,null,null,null,null,null,null,20.595290431005893,20.60351509954506,20.620644822828588,20.641776817907335,20.634972955855464,20.626708264598342,20.634242541252839]
[null,null,null,null,"Coincident",null,null,null,null,null,null,null,null,null,null,null,15.996061247677329,16.002449227596095,16.015753633460971,16.032166545369041,16.026882085095608,16.020463020116409,16.026314782742727]
[null,"George Town (Basslink)","CONNECTION POINT RATING","MVA","Non-coincident",null,null,null,null,null,null,null,null,null,null,null,1905.2558883257648,1905.2558883257648,1905.2558883257648,1905.2558883257648,1905.2558883257648,1905.2558883257648,1905.2558883257648]
[null,null,null,null,"Coincident",null,null,null,null,null,null,null,null,null,null,null,1905.2558883257648,1905.2558883257648,1905.2558883257648,1905.2558883257648,1905.2558883257648,1905.2558883257648,1905.2558883257648]
[null,null,"WINTER/SUMMER PEAKING",null,"Non-coincident",null,null,null,null,null,null,null,null,null,null,null,"Summer","Summer","Summer","Summer","Summer","Summer","Summer"]
[null,null,null,null,"Coincident",null,null,null,null,null,null,null,null,null,null,null,"Winter","Winter","Winter","Winter","Winter","Winter","Winter"]
[null,null,"ADJUSTMENTS - EMBEDDED GENERATION","MW","Non-coincident"]
[null,null,null,null,"Coincident"]
[null,null,"WEATHER CORRECTED MD 10% POE","MW","Non-coincident",null,null,null,null,null,null,null,null,null,null,null,487.71183200000002,487.71183200000002,487.71183200000002,487.71183200000002,487.71183200000002,487.71183200000002,487.71183200000002]
[null,null,null,null,"Coincident",null,null,null,null,null,null,null,null,null,null,null,490.08,490.08,490.08,490.08,490.08,490.08,490.08]
[null,null,"WEATHER CORRECTED MD 10% POE","MVA","Non-coincident",null,null,null,null,null,null,null,null,null,null,null,487.71183200000002,487.71183200000002,487.71183200000002,487.71183200000002,487.71183200000002,487.71183200000002,487.71183200000002]
[null,null,null,null,"Coincident",null,null,null,null,null,null,null,null,null,null,null,504.17,504.17,504.17,504.17,504.17,504.17,504.17]
[null,null,"WEATHER CORRECTED MD 50% POE","MW","Non-coincident",null,null,null,null,null,null,null,null,null,null,null,487.71183200000002,487.71183200000002,487.71183200000002,487.71183200000002,487.71183200000002,487.71183200000002,487.71183200000002]
[null,null,null,null,"Coincident",null,null,null,null,null,null,null,null,null,null,null,490.08,490.08,490.08,490.08,490.08,490.08,490.08]
[null,null,"WEATHER CORRECTED MD 50% POE","MVA","Non-coincident",null,null,null,null,null,null,null,null,null,null,null,487.71183200000002,487.71183200000002,487.71183200000002,487.71183200000002,487.71183200000002,487.71183200000002,487.71183200000002]
[null,null,null,null,"Coincident",null,null,null,null,null,null,null,null,null,null,null,504.17,504.17,504.17,504.17,504.17,504.17,504.17]
[null,"Hadspen","CONNECTION POINT RATING","MVA","Non-coincident",null,null,null,null,null,null,null,null,null,null,null,120,120,120,120,120,120,120]
[null,null,null,null,"Coincident",null,null,null,null,null,null,null,null,null,null,null,120,120,120,120,120,120,120]
[null,null,"WINTER/SUMMER PEAKING",null,"Non-coincident",null,null,null,null,null,null,null,null,null,null,null,"Winter","Winter","Winter","Winter","Winter","Winter","Winter"]
[null,null,null,null,"Coincident",null,null,null,null,null,null,null,null,null,null,null,"Winter","Winter","Winter","Winter","Winter","Winter","Winter"]
[null,null,"ADJUSTMENTS - EMBEDDED GENERATION","MW","Non-coincident"]
[null,null,null,null,"Coincident"]
[null,null,"WEATHER CORRECTED MD 10% POE","MW","Non-coincident",null,null,null,null,null,null,null,null,null,null,null,55.436300000000003,55.372799999999998,55.30997,55.236710000000002,55.142150000000001,55.044910000000002,54.974060000000001]
[null,null,null,null,"Coincident",null,null,null,null,null,null,null,null,null,null,null,51.979914275079089,51.920373422668888,51.861460796575457,51.792768468267248,51.704104168993098,51.61292696445188,51.546494375581602]
[null,null,"WEATHER CORRECTED MD 10% POE","MVA","Non-coincident",null,null,null,null,null,null,null,null,null,null,null,55.4920373572456,55.428473512396913,55.365580341186785,55.292246683334589,55.19759160980874,55.100253841728644,55.029332606964402]
[null,null,null,null,"Coincident",null,null,null,null,null,null,null,null,null,null,null,52.032176476047511,51.972575759437106,51.913603900781496,51.844842507098377,51.756089062016812,51.664820185116113,51.598320802882306]
[null,null,"WEATHER CORRECTED MD 50% POE","MW","Non-coincident",null,null,null,null,null,null,null,null,null,null,null,54.012779999999999,53.948450000000001,53.88496,53.811169999999997,53.716410000000003,53.619149999999998,53.548470000000002]
[null,null,null,null,"Coincident",null,null,null,null,null,null,null,null,null,null,null,50.64514901172528,50.584829908803265,50.525298432905252,50.456109149450945,50.367257319932989,50.276061362367379,50.209788174204341]
[null,null,"WEATHER CORRECTED MD 50% POE","MVA","Non-coincident",null,null,null,null,null,null,null,null,null,null,null,54.067086106552708,54.002691427196552,53.939137592402176,53.865273401671708,53.770418127059727,53.673060338871011,53.602309275029995]
[null,null,null,null,"Coincident",null,null,null,null,null,null,null,null,null,null,null,50.69606919873673,50.635689449137573,50.576098118466788,50.506839269983622,50.41789810610959,50.326610457329629,50.260270636069421]
[null,"Hampshire","CONNECTION POINT RATING","MVA","Non-coincident"]
[null,null,null,null,"Coincident"]
[null,null,"WINTER/SUMMER PEAKING",null,"Non-coincident"]
[null,null,null,null,"Coincident"]
[null,null,"ADJUSTMENTS - EMBEDDED GENERATION","MW","Non-coincident"]
[null,null,null,null,"Coincident"]
[null,null,"WEATHER CORRECTED MD 10% POE","MW","Non-coincident"]
[null,null,null,null,"Coincident"]
[null,null,"WEATHER CORRECTED MD 10% POE","MVA","Non-coincident"]
[null,null,null,null,"Coincident"]
[null,null,"WEATHER CORRECTED MD 50% POE","MW","Non-coincident"]
[null,null,null,null,"Coincident"]
[null,null,"WEATHER CORRECTED MD 50% POE","MVA","Non-coincident"]
[null,null,null,null,"Coincident"]
[null,"Huon River","CONNECTION POINT RATING","MVA","Non-coincident",null,null,null,null,null,null,null,null,null,null,null,30,30,30,30,30,30,30]
[null,null,null,null,"Coincident",null,null,null,null,null,null,null,null,null,null,null,30,30,30,30,30,30,30]
[null,null,"WINTER/SUMMER PEAKING",null,"Non-coincident",null,null,null,null,null,null,null,null,null,null,null,"Winter","Winter","Winter","Winter","Winter","Winter","Winter"]
[null,null,null,null,"Coincident",null,null,null,null,null,null,null,null,null,null,null,"Winter","Winter","Winter","Winter","Winter","Winter","Winter"]
[null,null,"ADJUSTMENTS - EMBEDDED GENERATION","MW","Non-coincident"]
[null,null,null,null,"Coincident"]
[null,null,"WEATHER CORRECTED MD 10% POE","MW","Non-coincident",null,null,null,null,null,null,null,null,null,null,null,0.73421400000000003,0.73421400000000003,0.73421400000000003,0.73421400000000003,0.73421400000000003,0.73421400000000003,0.73421400000000003]
[null,null,null,null,"Coincident",null,null,null,null,null,null,null,null,null,null,null,0.60072054545454534,0.60072054545454534,0.60072054545454534,0.60072054545454534,0.60072054545454534,0.60072054545454534,0.60072054545454534]
[null,null,"WEATHER CORRECTED MD 10% POE","MVA","Non-coincident",null,null,null,null,null,null,null,null,null,null,null,1.1913096832819952,1.1913096832819952,1.1913096832819952,1.1913096832819952,1.1913096832819952,1.1913096832819952,1.1913096832819952]
[null,null,null,null,"Coincident",null,null,null,null,null,null,null,null,null,null,null,0.97470792268526851,0.97470792268526851,0.97470792268526851,0.97470792268526851,0.97470792268526851,0.97470792268526851,0.97470792268526851]
[null,null,"WEATHER CORRECTED MD 50% POE","MW","Non-coincident",null,null,null,null,null,null,null,null,null,null,null,0.73421400000000003,0.73421400000000003,0.73421400000000003,0.73421400000000003,0.73421400000000003,0.73421400000000003,0.73421400000000003]
[null,null,null,null,"Coincident",null,null,null,null,null,null,null,null,null,null,null,0.60072054545454534,0.60072054545454534,0.60072054545454534,0.60072054545454534,0.60072054545454534,0.60072054545454534,0.60072054545454534]
[null,null,"WEATHER CORRECTED MD 50% POE","MVA","Non-coincident",null,null,null,null,null,null,null,null,null,null,null,1.1913096832819952,1.1913096832819952,1.1913096832819952,1.1913096832819952,1.1913096832819952,1.1913096832819952,1.1913096832819952]
[null,null,null,null,"Coincident",null,null,null,null,null,null,null,null,null,null,null,0.97470792268526851,0.97470792268526851,0.97470792268526851,0.97470792268526851,0.97470792268526851,0.97470792268526851,0.97470792268526851]
[null,"Kermandie","CONNECTION POINT RATING","MVA","Non-coincident",null,null,null,null,null,null,null,null,null,null,null,20]
[null,null,null,null,"Coincident",null,null,null,null,null,null,null,null,null,null,null,20]
[null,null,"WINTER/SUMMER PEAKING",null,"Non-coincident",null,null,null,null,null,null,null,null,null,null,null,"Winter","Winter","Winter","Winter","Winter","Winter","Winter"]
[null,null,null,null,"Coincident",null,null,null,null,null,null,null,null,null,null,null,"Winter","Winter","Winter","Winter","Winter","Winter","Winter"]
[null,null,"ADJUSTMENTS - EMBEDDED GENERATION","MW","Non-coincident"]
[null,null,null,null,"Coincident"]
[null,null,"WEATHER CORRECTED MD 10% POE","MW","Non-coincident",null,null,null,null,null,null,null,null,null,null,null,8.0665800000000001,8.1104599999999998,8.1520700000000001,8.1790199999999995,8.2012199999999993,8.2195099999999996,8.2312200000000004]
[null,null,null,null,"Coincident",null,null,null,null,null,null,null,null,null,null,null,7.3686064524103791,7.4086896662546309,7.4466992954264484,7.4713174042027148,7.4915965142150762,7.5083039431396745,7.5190007169344835]
[null,null,"WEATHER CORRECTED MD 10% POE","MVA","Non-coincident",null,null,null,null,null,null,null,null,null,null,null,8.2044040059749186,8.2490337310606652,8.2913546713710105,8.3187651337926329,8.3413444386445832,8.3599469380023379,8.3718570127688405]
[null,null,null,null,"Coincident",null,null,null,null,null,null,null,null,null,null,null,7.4945050190549587,7.5352730868403315,7.5739321410916842,7.5989708700528462,7.6195964649670502,7.6365893537499696,7.6474688905267865]
[null,null,"WEATHER CORRECTED MD 50% POE","MW","Non-coincident",null,null,null,null,null,null,null,null,null,null,null,7.9175000000000004,7.95824,7.9968199999999996,8.0208499999999994,8.0401900000000008,8.0557300000000005,8.0647500000000001]
[null,null,null,null,"Coincident",null,null,null,null,null,null,null,null,null,null,null,7.2324258343634078,7.269640741656362,7.304882546353519,7.3268333127317629,7.3444998887515425,7.3586952657601943,7.3669347960444957]
[null,null,"WEATHER CORRECTED MD 50% POE","MVA","Non-coincident",null,null,null,null,null,null,null,null,null,null,null,8.0527768542934464,8.0942129299541854,8.1334521002779798,8.1578926721515099,8.1775631116036145,8.1933686249999802,8.2025427389533387]
[null,null,null,null,"Coincident",null,null,null,null,null,null,null,null,null,null,null,7.355997645640115,7.3938483995502358,7.4296923388200549,7.4520181516934016,7.4699865753709132,7.4844244918108558,7.4928048010958159]
[null,"Kingston (11 kV)","CONNECTION POINT RATING","MVA","Non-coincident",null,null,null,null,null,null,null,null,null,null,null,84,84,84,84,84,84,84]
[null,null,null,null,"Coincident",null,null,null,null,null,null,null,null,null,null,null,84,84,84,84,84,84,84]
[null,null,"WINTER/SUMMER PEAKING",null,"Non-coincident",null,null,null,null,null,null,null,null,null,null,null,"Winter","Winter","Winter","Winter","Winter","Winter","Winter"]
[null,null,null,null,"Coincident",null,null,null,null,null,null,null,null,null,null,null,"Winter","Winter","Winter","Winter","Winter","Winter","Winter"]
[null,null,"ADJUSTMENTS - EMBEDDED GENERATION","MW","Non-coincident"]
[null,null,null,null,"Coincident"]
[null,null,"WEATHER CORRECTED MD 10% POE","MW","Non-coincident",null,null,null,null,null,null,null,null,null,null,null,25.951419999999999,26.090779999999999,26.219650000000001,26.329080000000001,26.428100000000001,26.521730000000002,26.633140000000001]
[null,null,null,null,"Coincident",null,null,null,null,null,null,null,null,null,null,null,23.509496715867147,23.635743505535043,23.752487361623608,23.851620442804418,23.941323062730618,24.026142859778588,24.127069630996299]
[null,null,"WEATHER CORRECTED MD 10% POE","MVA","Non-coincident",null,null,null,null,null,null,null,null,null,null,null,25.951483605477556,26.090843947041115,26.219714262894275,26.329144531101075,26.428164773793554,26.521795003275443,26.633205276335115]
[null,null,null,null,"Coincident",null,null,null,null,null,null,null,null,null,null,null,23.509554336327444,23.635801435419154,23.752545577640376,23.851678901790816,23.941381741573117,24.02620174650966,24.127128765093236]
[null,null,"WEATHER CORRECTED MD 50% POE","MW","Non-coincident",null,null,null,null,null,null,null,null,null,null,null,25.069669999999999,25.183520000000001,25.29984,25.409230000000001,25.502210000000002,25.598330000000001,25.705760000000001]
[null,null,null,null,"Coincident",null,null,null,null,null,null,null,null,null,null,null,22.710715811808107,22.813852988929881,22.919227749077482,23.018324594095933,23.102555553505528,23.189631051660506,23.286952324723238]
[null,null,"WEATHER CORRECTED MD 50% POE","MVA","Non-coincident",null,null,null,null,null,null,null,null,null,null,null,25.069731444357672,25.183581723397651,25.299902008491458,25.409292276600222,25.502272504489,25.598392740073738,25.705823003378654]
[null,null,null,null,"Coincident",null,null,null,null,null,null,null,null,null,null,null,22.710771474501129,22.813908904406347,22.919283922821588,23.018381010720859,23.102612176575818,23.189687888147969,23.287009399739691]
[null,"Kingston (33 kV)","CONNECTION POINT RATING","MVA","Non-coincident",null,null,null,null,null,null,null,null,null,null,null,144,144,144,144,144,144,144]
[null,null,null,null,"Coincident",null,null,null,null,null,null,null,null,null,null,null,144,144,144,144,144,144,144]
[null,null,"WINTER/SUMMER PEAKING",null,"Non-coincident",null,null,null,null,null,null,null,null,null,null,null,"Winter","Winter","Winter","Winter","Winter","Winter","Winter"]
[null,null,null,null,"Coincident",null,null,null,null,null,null,null,null,null,null,null,"Winter","Winter","Winter","Winter","Winter","Winter","Winter"]
[null,null,"ADJUSTMENTS - EMBEDDED GENERATION","MW","Non-coincident"]
[null,null,null,null,"Coincident"]
[null,null,"WEATHER CORRECTED MD 10% POE","MW","Non-coincident",null,null,null,null,null,null,null,null,null,null,null,11.93817,11.93027,11.925990000000001,11.92446,11.91506,11.911899999999999,11.912890000000001]
[null,null,null,null,"Coincident",null,null,null,null,null,null,null,null,null,null,null,11.262218821917807,11.254766127853882,11.250728465753426,11.249285095890411,11.240417333333335,11.237436255707763,11.238370200913243]
[null,null,"WEATHER CORRECTED MD 10% POE","MVA","Non-coincident",null,null,null,null,null,null,null,null,null,null,null,12.013250339873121,12.005300655986479,12.000993738640299,11.999454116317949,11.989994998781944,11.986815125227286,11.987811351435866]
[null,null,null,null,"Coincident",null,null,null,null,null,null,null,null,null,null,null,11.33304803752414,11.325548472725146,11.321485417365688,11.320032970005881,11.311109437207078,11.308109611287477,11.309049430167352]
[null,null,"WEATHER CORRECTED MD 50% POE","MW","Non-coincident",null,null,null,null,null,null,null,null,null,null,null,11.32823,11.32033,11.316050000000001,11.31453,11.305120000000001,11.301959999999999,11.302960000000001]
[null,null,null,null,"Coincident",null,null,null,null,null,null,null,null,null,null,null,10.686814237442922,10.679361543378997,10.67532388127854,10.673889945205479,10.665012748858448,10.662031671232876,10.662975050228312]
[null,null,"WEATHER CORRECTED MD 50% POE","MVA","Non-coincident",null,null,null,null,null,null,null,null,null,null,null,11.399474366478353,11.391524682591712,11.387217765245531,11.385688205814176,11.376219025387176,11.373039151832518,11.374045440932095]
[null,null,null,null,"Coincident",null,null,null,null,null,null,null,null,null,null,null,10.754024676321588,10.746525111522594,10.742462056163136,10.741019101923328,10.732086076004524,10.729086250084924,10.730035562084799]
[null,"Knights Road","CONNECTION POINT RATING","MVA","Non-coincident",null,null,null,null,null,null,null,null,null,null,null,45.7,45.7,45.7,45.7,45.7,45.7,45.7]
[null,null,null,null,"Coincident",null,null,null,null,null,null,null,null,null,null,null,45.7,45.7,45.7,45.7,45.7,45.7,45.7]
[null,null,"WINTER/SUMMER PEAKING",null,"Non-coincident",null,null,null,null,null,null,null,null,null,null,null,"Winter","Winter","Winter","Winter","Winter","Winter","Winter"]
[null,null,null,null,"Coincident",null,null,null,null,null,null,null,null,null,null,null,"Winter","Winter","Winter","Winter","Winter","Winter","Winter"]
[null,null,"ADJUSTMENTS - EMBEDDED GENERATION","MW","Non-coincident"]
[null,null,null,null,"Coincident"]
[null,null,"WEATHER CORRECTED MD 10% POE","MW","Non-coincident",null,null,null,null,null,null,null,null,null,null,null,20.997129999999999,21.0761,21.16452,21.26118,21.333760000000002,21.421610000000001,21.528729999999999]
[null,null,null,null,"Coincident",null,null,null,null,null,null,null,null,null,null,null,20.199059213062085,20.275027676659519,20.360086959314764,20.453073051391851,20.522894389721618,20.607405337259092,20.71045385974303]
[null,null,"WEATHER CORRECTED MD 10% POE","MVA","Non-coincident",null,null,null,null,null,null,null,null,null,null,null,21.142248694904193,21.221764484892475,21.310795587219477,21.408123639141309,21.481205265548166,21.569662428400772,21.677522773133507]
[null,null,null,null,"Coincident",null,null,null,null,null,null,null,null,null,null,null,20.338662154573242,20.415155663464539,20.500802821324079,20.594431573627897,20.664735472264471,20.749830505265614,20.853591233041165]
[null,null,"WEATHER CORRECTED MD 50% POE","MW","Non-coincident",null,null,null,null,null,null,null,null,null,null,null,20.387879999999999,20.496230000000001,20.591460000000001,20.66516,20.728449999999999,20.796710000000001,20.85718]
[null,null,null,null,"Coincident",null,null,null,null,null,null,null,null,null,null,null,19.612965931477504,19.717197703426116,19.808808147751598,19.879706916488214,19.94059135438971,20.006256889721616,20.06442851177729]
[null,null,"WEATHER CORRECTED MD 50% POE","MVA","Non-coincident",null,null,null,null,null,null,null,null,null,null,null,20.528787949679948,20.637886795383761,20.7337749640628,20.807984331191282,20.871711751076781,20.940443520414505,21.001331450268768]
[null,null,null,null,"Coincident",null,null,null,null,null,null,null,null,null,null,null,19.748518172149275,19.853470327250857,19.945713924208157,20.017102699759484,20.078407931844197,20.144527305238139,20.203100972233916]
[null,"Lindisfarne","CONNECTION POINT RATING","MVA","Non-coincident",null,null,null,null,null,null,null,null,null,null,null,156,156,156,156,156,156,156]
[null,null,null,null,"Coincident",null,null,null,null,null,null,null,null,null,null,null,156,156,156,156,156,156,156]
[null,null,"WINTER/SUMMER PEAKING",null,"Non-coincident",null,null,null,null,null,null,null,null,null,null,null,"Winter","Winter","Winter","Winter","Winter","Winter","Winter"]
[null,null,null,null,"Coincident",null,null,null,null,null,null,null,null,null,null,null,"Winter","Winter","Winter","Winter","Winter","Winter","Winter"]
[null,null,"ADJUSTMENTS - EMBEDDED GENERATION","MW","Non-coincident"]
[null,null,null,null,"Coincident"]
[null,null,"WEATHER CORRECTED MD 10% POE","MW","Non-coincident",null,null,null,null,null,null,null,null,null,null,null,38.840879999999999,39.004040000000003,39.177880000000002,39.339199999999998,39.508330000000001,39.668050000000001,39.839030000000001]
[null,null,null,null,"Coincident",null,null,null,null,null,null,null,null,null,null,null,35.975219901261653,36.126342040592434,36.287356215030172,36.436774108612177,36.593425784421285,36.74136172517828,36.899726908941304]
[null,null,"WEATHER CORRECTED MD 10% POE","MVA","Non-coincident",null,null,null,null,null,null,null,null,null,null,null,38.985570054324192,39.149337857990425,39.323825446794892,39.485746396092729,39.65550643920421,39.815821428181721,39.987438362913586]
[null,null,null,null,"Coincident",null,null,null,null,null,null,null,null,null,null,null,36.109234797984854,36.260919897540774,36.422533882014903,36.572508387165428,36.729743621830124,36.878230653584659,37.037185779363462]
[null,null,"WEATHER CORRECTED MD 50% POE","MW","Non-coincident",null,null,null,null,null,null,null,null,null,null,null,37.93394,38.09234,38.261450000000004,38.418149999999997,38.582689999999999,38.737900000000003,38.904449999999997]
[null,null,null,null,"Coincident",null,null,null,null,null,null,null,null,null,null,null,35.135193466812943,35.281906796489302,35.438539947888096,35.58367870268787,35.736079026330223,35.879837712561717,36.034099739440478]
[null,null,"WEATHER CORRECTED MD 50% POE","MVA","Non-coincident",null,null,null,null,null,null,null,null,null,null,null,38.075251521245931,38.234241592959158,38.403981561566638,38.561265300439509,38.726418244882026,38.882206433206591,39.049376865301525]
[null,null,null,null,"Coincident",null,null,null,null,null,null,null,null,null,null,null,35.266079096886315,35.41333896308916,35.570555604336406,35.716235030056005,35.86920307541596,36.013497291535565,36.168333975349213]
[null,"Meadowbank","CONNECTION POINT RATING","MVA","Non-coincident",null,null,null,null,null,null,null,null,null,null,null,12,12,12,12,12,12,12]
[null,null,null,null,"Coincident",null,null,null,null,null,null,null,null,null,null,null,12,12,12,12,12,12,12]
[null,null,"WINTER/SUMMER PEAKING",null,"Non-coincident",null,null,null,null,null,null,null,null,null,null,null,"Summer","Summer","Summer","Summer","Summer","Summer","Summer"]
[null,null,null,null,"Coincident",null,null,null,null,null,null,null,null,null,null,null,"Winter","Winter","Winter","Winter","Winter","Winter","Winter"]
[null,null,"ADJUSTMENTS - EMBEDDED GENERATION","MW","Non-coincident"]
[null,null,null,null,"Coincident"]
[null,null,"WEATHER CORRECTED MD 10% POE","MW","Non-coincident",null,null,null,null,null,null,null,null,null,null,null,8.2369400000000006,8.2253500000000006,8.2117699999999996,8.1974599999999995,8.1828000000000003,8.1687600000000007,8.1551299999999998]
[null,null,null,null,"Coincident",null,null,null,null,null,null,null,null,null,null,null,5.8882542971887553,5.8799690763052217,5.870261285140562,5.8600316465863447,5.8495518072289157,5.8395151807228922,5.8297716465863454]
[null,null,"WEATHER CORRECTED MD 10% POE","MVA","Non-coincident",null,null,null,null,null,null,null,null,null,null,null,8.5836275028591587,8.571549687219111,8.5573981137599322,8.5424858150706235,8.5272087851065947,8.5125778505435008,8.4983741726165061]
[null,null,null,null,"Coincident",null,null,null,null,null,null,null,null,null,null,null,6.1360871305579527,6.1274531900602476,6.1173368042139282,6.1066766067573131,6.0957556777067223,6.0852966160511768,6.07514298283429]
[null,null,"WEATHER CORRECTED MD 50% POE","MW","Non-coincident",null,null,null,null,null,null,null,null,null,null,null,7.9279700000000002,7.9168900000000004,7.9039000000000001,7.89025,7.8763399999999999,7.8631500000000001,7.8504699999999996]
[null,null,null,null,"Coincident",null,null,null,null,null,null,null,null,null,null,null,5.6673841767068271,5.6594635341365462,5.6501775100401606,5.6404196787148591,5.6304759839357432,5.6210469879518072,5.6119825702811239]
[null,null,"WEATHER CORRECTED MD 50% POE","MVA","Non-coincident",null,null,null,null,null,null,null,null,null,null,null,8.2616531544289895,8.2501068043606782,8.2365700636217447,8.2223455439076254,8.2078500809608546,8.1941049223506539,8.1808912293121878]
[null,null,null,null,"Coincident",null,null,null,null,null,null,null,null,null,null,null,5.9059207288689155,5.8976667115510066,5.8879898446773922,5.8778213125122774,5.8674590940202096,5.8576332376643219,5.8481873044882304]
[null,"Mornington","CONNECTION POINT RATING","MVA","Non-coincident",null,null,null,null,null,null,null,null,null,null,null,144,144,144,144,144,144,144]
[null,null,null,null,"Coincident",null,null,null,null,null,null,null,null,null,null,null,144,144,144,144,144,144,144]
[null,null,"WINTER/SUMMER PEAKING",null,"Non-coincident",null,null,null,null,null,null,null,null,null,null,null,"Winter","Winter","Winter","Winter","Winter","Winter","Winter"]
[null,null,null,null,"Coincident",null,null,null,null,null,null,null,null,null,null,null,"Winter","Winter","Winter","Winter","Winter","Winter","Winter"]
[null,null,"ADJUSTMENTS - EMBEDDED GENERATION","MW","Non-coincident"]
[null,null,null,null,"Coincident"]
[null,null,"WEATHER CORRECTED MD 10% POE","MW","Non-coincident",null,null,null,null,null,null,null,null,null,null,null,40.469889999999999,41.520020000000002,41.705039999999997,41.886270000000003,42.066319999999997,42.243409999999997,42.418230000000001]
[null,null,null,null,"Coincident",null,null,null,null,null,null,null,null,null,null,null,38.3481473166322,39.343221430785093,39.518541260330544,39.690269790805758,39.860880185950379,40.028685767045417,40.194340358987567]
[null,null,"WEATHER CORRECTED MD 10% POE","MVA","Non-coincident",null,null,null,null,null,null,null,null,null,null,null,40.597724298063476,41.651171397057951,41.836775829133934,42.018578289544337,42.199197022628759,42.376846405810774,42.552218618628444]
[null,null,null,null,"Coincident",null,null,null,null,null,null,null,null,null,null,null,38.469279558263111,39.467496863586128,39.643370484786232,39.815641462897226,39.986790773766735,40.155126410877998,40.321304264397632]
[null,null,"WEATHER CORRECTED MD 50% POE","MW","Non-coincident",null,null,null,null,null,null,null,null,null,null,null,39.184310000000004,40.219189999999998,40.356859999999998,40.48321,40.625190000000003,40.795259999999999,40.963149999999999]
[null,null,null,null,"Coincident",null,null,null,null,null,null,null,null,null,null,null,37.129967301136332,38.110590937499964,38.241043217975175,38.360768979855337,38.495305297004101,38.656458920454511,38.815546836260296]
[null,null,"WEATHER CORRECTED MD 50% POE","MVA","Non-coincident",null,null,null,null,null,null,null,null,null,null,null,39.308083471189363,40.346232399233884,40.484337264458738,40.611086372624349,40.753514852065216,40.924122060816501,41.092542383491008]
[null,null,null,null,"Coincident",null,null,null,null,null,null,null,null,null,null,null,37.247251615649184,38.230972797724434,38.361837144447051,38.481941090175255,38.616902374025607,38.7785650416156,38.938155476505258]
[null,"Mowbray","CONNECTION POINT RATING","MVA","Non-coincident",null,null,null,null,null,null,null,null,null,null,null,127.5,127.5,127.5,127.5,127.5,127.5,127.5]
[null,null,null,null,"Coincident",null,null,null,null,null,null,null,null,null,null,null,127.5,127.5,127.5,127.5,127.5,127.5,127.5]
[null,null,"WINTER/SUMMER PEAKING",null,"Non-coincident",null,null,null,null,null,null,null,null,null,null,null,"Winter","Winter","Winter","Winter","Winter","Winter","Winter"]
[null,null,null,null,"Coincident",null,null,null,null,null,null,null,null,null,null,null,"Winter","Winter","Winter","Winter","Winter","Winter","Winter"]
[null,null,"ADJUSTMENTS - EMBEDDED GENERATION","MW","Non-coincident"]
[null,null,null,null,"Coincident"]
[null,null,"WEATHER CORRECTED MD 10% POE","MW","Non-coincident",null,null,null,null,null,null,null,null,null,null,null,39.902070000000002,39.872619999999998,39.83663,39.773290000000003,39.737099999999998,39.647790000000001,39.552259999999997]
[null,null,null,null,"Coincident",null,null,null,null,null,null,null,null,null,null,null,37.474857340425515,37.447198761592993,37.413398006001067,37.353910930169107,37.319922340425514,37.236044999999983,37.146326017457696]
[null,null,"WEATHER CORRECTED MD 10% POE","MVA","Non-coincident",null,null,null,null,null,null,null,null,null,null,null,40.115859226597692,40.086251437973608,40.050068609023498,39.986389242930144,39.950005342410428,39.860216833004095,39.764174997783087]
[null,null,null,null,"Coincident",null,null,null,null,null,null,null,null,null,null,null,37.675641930489846,37.647835161195594,37.61385330629237,37.554047507749161,37.51987681230743,37.435550069839884,37.345350386624958]
[null,null,"WEATHER CORRECTED MD 50% POE","MW","Non-coincident",null,null,null,null,null,null,null,null,null,null,null,38.839399999999998,38.808030000000002,38.770249999999997,38.705190000000002,38.667389999999997,38.576630000000002,38.479730000000004]
[null,null,null,null,"Coincident",null,null,null,null,null,null,null,null,null,null,null,36.476828750681918,36.447366963993439,36.411885092744114,36.350782643207836,36.315281988543347,36.230042850518259,36.139037204037081]
[null,null,"WEATHER CORRECTED MD 50% POE","MVA","Non-coincident",null,null,null,null,null,null,null,null,null,null,null,39.047495602246151,39.015957526553883,38.977975107055826,38.912566525463888,38.87456399880886,38.783317720522902,38.685898545050122]
[null,null,null,null,"Coincident",null,null,null,null,null,null,null,null,null,null,null,36.672266055246432,36.64264641678259,36.606974439059776,36.545544611885454,36.509853750108789,36.424157913737119,36.332664672833467]
[null,"New Norfolk","CONNECTION POINT RATING","MVA","Non-coincident",null,null,null,null,null,null,null,null,null,null,null,60.59,60.59,60.59,60.59,60.59,60.59,60.59]
[null,null,null,null,"Coincident",null,null,null,null,null,null,null,null,null,null,null,60.59,60.59,60.59,60.59,60.59,60.59,60.59]
[null,null,"WINTER/SUMMER PEAKING",null,"Non-coincident",null,null,null,null,null,null,null,null,null,null,null,"Winter","Winter","Winter","Winter","Winter","Winter","Winter"]
[null,null,null,null,"Coincident",null,null,null,null,null,null,null,null,null,null,null,"Winter","Winter","Winter","Winter","Winter","Winter","Winter"]
[null,null,"ADJUSTMENTS - EMBEDDED GENERATION","MW","Non-coincident"]
[null,null,null,null,"Coincident"]
[null,null,"WEATHER CORRECTED MD 10% POE","MW","Non-coincident",null,null,null,null,null,null,null,null,null,null,null,24.291260000000001,24.323399999999999,24.350460000000002,24.373850000000001,24.395140000000001,24.416840000000001,24.44068]
[null,null,null,null,"Coincident",null,null,null,null,null,null,null,null,null,null,null,20.857628458980027,20.885225388026587,20.90846038802659,20.928544151884683,20.946824756097541,20.965457405764948,20.98592756097559]
[null,null,"WEATHER CORRECTED MD 10% POE","MVA","Non-coincident",null,null,null,null,null,null,null,null,null,null,null,24.505282999592595,24.537706175484125,24.565004593020678,24.588600675288969,24.610078255087686,24.631969447273317,24.656019494356517]
[null,null,null,null,"Coincident",null,null,null,null,null,null,null,null,null,null,null,21.041398761845286,21.06923883914904,21.092678555758869,21.112939271631141,21.131380940759861,21.15017775710994,21.170828268712977]
[null,null,"WEATHER CORRECTED MD 50% POE","MW","Non-coincident",null,null,null,null,null,null,null,null,null,null,null,23.804960000000001,23.836089999999999,23.862300000000001,23.884910000000001,23.905550000000002,23.926690000000001,23.950009999999999]
[null,null,null,null,"Coincident",null,null,null,null,null,null,null,null,null,null,null,20.440068203991114,20.466797899113061,20.489303048780471,20.508717067627476,20.526439550997765,20.544591358093108,20.564615016629691]
[null,null,"WEATHER CORRECTED MD 50% POE","MVA","Non-coincident",null,null,null,null,null,null,null,null,null,null,null,24.01469835628048,24.046102633365209,24.072543561806938,24.095352771729385,24.116174624573233,24.137500882766975,24.161026348286281]
[null,null,null,null,"Coincident",null,null,null,null,null,null,null,null,null,null,null,20.620159508801791,20.647124711243166,20.669828147028223,20.689413216967175,20.707291847818126,20.725603585036591,20.745803666017412]
[null,"Newton (11 kV)","CONNECTION POINT RATING","MVA","Non-coincident"]
[null,null,null,null,"Coincident"]
[null,null,"WINTER/SUMMER PEAKING",null,"Non-coincident"]
[null,null,null,null,"Coincident"]
[null,null,"ADJUSTMENTS - EMBEDDED GENERATION","MW","Non-coincident"]
[null,null,null,null,"Coincident"]
[null,null,"WEATHER CORRECTED MD 10% POE","MW","Non-coincident"]
[null,null,null,null,"Coincident"]
[null,null,"WEATHER CORRECTED MD 10% POE","MVA","Non-coincident"]
[null,null,null,null,"Coincident"]
[null,null,"WEATHER CORRECTED MD 50% POE","MW","Non-coincident"]
[null,null,null,null,"Coincident"]
[null,null,"WEATHER CORRECTED MD 50% POE","MVA","Non-coincident"]
[null,null,null,null,"Coincident"]
[null,"Newton (22 kV)","CONNECTION POINT RATING","MVA","Non-coincident",null,null,null,null,null,null,null,null,null,null,null,24,24,24,24,24,24,24]
[null,null,null,null,"Coincident",null,null,null,null,null,null,null,null,null,null,null,24,24,24,24,24,24,24]
[null,null,"WINTER/SUMMER PEAKING",null,"Non-coincident",null,null,null,null,null,null,null,null,null,null,null,"Winter","Winter","Winter","Winter","Winter","Winter","Winter"]
[null,null,null,null,"Coincident",null,null,null,null,null,null,null,null,null,null,null,"Winter","Winter","Winter","Winter","Winter","Winter","Winter"]
[null,null,"ADJUSTMENTS - EMBEDDED GENERATION","MW","Non-coincident"]
[null,null,null,null,"Coincident"]
[null,null,"WEATHER CORRECTED MD 10% POE","MW","Non-coincident",null,null,null,null,null,null,null,null,null,null,null,3.70302,3.70302,3.7030099999999999,3.70302,3.7030099999999999,3.70302,3.7030400000000001]
[null,null,null,null,"Coincident",null,null,null,null,null,null,null,null,null,null,null,3.2714489839572192,3.2714489839572192,3.2714489839572192,3.2714400802139036,3.2714400802139036,3.2714311764705877,3.2714222727272722]
[null,null,"WEATHER CORRECTED MD 10% POE","MVA","Non-coincident",null,null,null,null,null,null,null,null,null,null,null,3.7099415020656559,3.7099415020656559,3.7099314833741501,3.7099415020656559,3.7099314833741501,3.7099415020656559,3.7099615394486682]
[null,null,null,null,"Coincident",null,null,null,null,null,null,null,null,null,null,null,3.2740791001037257,3.2740791001037257,3.2740791001037257,3.2740701892021513,3.2740701892021513,3.274061278300576,3.2740523673990016]
[null,null,"WEATHER CORRECTED MD 50% POE","MW","Non-coincident",null,null,null,null,null,null,null,null,null,null,null,3.6,3.6,3.6,3.59999,3.59999,3.59998,3.59998]
[null,null,null,null,"Coincident",null,null,null,null,null,null,null,null,null,null,null,3.2053475935828875,3.2053475935828875,3.2053475935828875,3.2053386898395719,3.2053386898395719,3.2053297860962564,3.2053208823529409]
[null,null,"WEATHER CORRECTED MD 50% POE","MVA","Non-coincident",null,null,null,null,null,null,null,null,null,null,null,3.6067289421705424,3.6067189234790362,3.6067189234790362,3.6067189234790362,3.6067089047875305,3.6067089047875305,3.6067089047875305]
[null,null,null,null,"Coincident",null,null,null,null,null,null,null,null,null,null,null,3.207924566814746,3.207924566814746,3.207924566814746,3.2079156559131712,3.2079156559131712,3.2079067450115968,3.2078978341100224]
[null,"North Hobart","CONNECTION POINT RATING","MVA","Non-coincident",null,null,null,null,null,null,null,null,null,null,null,100,100,100,100,100,100,100]
[null,null,null,null,"Coincident",null,null,null,null,null,null,null,null,null,null,null,100,100,100,100,100,100,100]
[null,null,"WINTER/SUMMER PEAKING",null,"Non-coincident",null,null,null,null,null,null,null,null,null,null,null,"Winter","Winter","Winter","Winter","Winter","Winter","Winter"]
[null,null,null,null,"Coincident",null,null,null,null,null,null,null,null,null,null,null,"Winter","Winter","Winter","Winter","Winter","Winter","Winter"]
[null,null,"ADJUSTMENTS - EMBEDDED GENERATION","MW","Non-coincident"]
[null,null,null,null,"Coincident"]
[null,null,"WEATHER CORRECTED MD 10% POE","MW","Non-coincident",null,null,null,null,null,null,null,null,null,null,null,36.70879,38.102130000000002,38.221690000000002,38.342759999999998,38.439309999999999,38.548110000000001,38.688369999999999]
[null,null,null,null,"Coincident",null,null,null,null,null,null,null,null,null,null,null,34.823602496433665,36.145387232524968,36.258807203994294,36.373659629101283,36.465251283880171,36.568463837375177,36.701520756062763]
[null,null,"WEATHER CORRECTED MD 10% POE","MVA","Non-coincident",null,null,null,null,null,null,null,null,null,null,null,37.112119649066813,38.520768661791855,38.641642300646261,38.764042530289146,38.861653351896656,38.971648767649079,39.113449843140209]
[null,null,null,null,"Coincident",null,null,null,null,null,null,null,null,null,null,null,35.206219067944978,36.542526619246196,36.657192767374845,36.773307107906255,36.865905105579564,36.970251684003763,37.104770535931863]
[null,null,"WEATHER CORRECTED MD 50% POE","MW","Non-coincident",null,null,null,null,null,null,null,null,null,null,null,35.922919999999998,37.310699999999997,37.424669999999999,37.540100000000002,37.631010000000003,37.734160000000003,37.868740000000003]
[null,null,null,null,"Coincident",null,null,null,null,null,null,null,null,null,null,null,34.078091012838797,35.394601283880171,35.502718330955773,35.61222039942939,35.698461697574892,35.796314407988589,35.923983024251072]
[null,null,"WEATHER CORRECTED MD 50% POE","MVA","Non-coincident",null,null,null,null,null,null,null,null,null,null,null,36.317615077583739,37.720643001047897,37.83586522102312,37.95256348242296,38.044472335787418,38.14875567342402,38.284814341181018]
[null,null,null,null,"Coincident",null,null,null,null,null,null,null,null,null,null,null,34.452516443071588,35.783491577313626,35.892796536348605,36.003501734395535,36.090690589584348,36.189618434845897,36.318689781576857]
[null,"Norwood","CONNECTION POINT RATING","MVA","Non-coincident",null,null,null,null,null,null,null,null,null,null,null,120,120,120,120,120,120,120]
[null,null,null,null,"Coincident",null,null,null,null,null,null,null,null,null,null,null,120,120,120,120,120,120,120]
[null,null,"WINTER/SUMMER PEAKING",null,"Non-coincident",null,null,null,null,null,null,null,null,null,null,null,"Winter","Winter","Winter","Winter","Winter","Winter","Winter"]
[null,null,null,null,"Coincident",null,null,null,null,null,null,null,null,null,null,null,"Winter","Winter","Winter","Winter","Winter","Winter","Winter"]
[null,null,"ADJUSTMENTS - EMBEDDED GENERATION","MW","Non-coincident"]
[null,null,null,null,"Coincident"]
[null,null,"WEATHER CORRECTED MD 10% POE","MW","Non-coincident",null,null,null,null,null,null,null,null,null,null,null,27.733309999999999,27.756779999999999,27.780360000000002,27.805289999999999,27.828399999999998,27.833690000000001,27.84055]
[null,null,null,null,"Coincident",null,null,null,null,null,null,null,null,null,null,null,24.963879606188467,24.985005907172994,25.006231223628692,25.028671729957804,25.049473980309422,25.054235724331928,25.060410689170183]
[null,null,"WEATHER CORRECTED MD 10% POE","MVA","Non-coincident",null,null,null,null,null,null,null,null,null,null,null,27.754425102193043,27.777912971370881,27.801510924298601,27.826459905065686,27.849587500153024,27.854881527760643,27.861746750707383]
[null,null,null,null,"Coincident",null,null,null,null,null,null,null,null,null,null,null,24.98288616793748,25.00402855369531,25.025270030310974,25.047727622000053,25.068545710404972,25.073311079840806,25.079490746065716]
[null,null,"WEATHER CORRECTED MD 50% POE","MW","Non-coincident",null,null,null,null,null,null,null,null,null,null,null,26.723559999999999,26.745200000000001,26.76709,26.79035,26.811959999999999,26.815819999999999,26.821400000000001]
[null,null,null,null,"Coincident",null,null,null,null,null,null,null,null,null,null,null,24.05496258790436,24.074441631504921,24.094145710267227,24.115082981715894,24.134535021097044,24.138009563994373,24.1430323488045]
[null,null,"WEATHER CORRECTED MD 50% POE","MVA","Non-coincident",null,null,null,null,null,null,null,null,null,null,null,26.74390631641019,26.765562792294659,26.787469458519752,26.810747167811467,26.832373620855059,26.836236559714301,26.841820808117046]
[null,null,null,null,"Coincident",null,null,null,null,null,null,null,null,null,null,null,24.073277134321412,24.092771008535276,24.112490089244218,24.133443301546187,24.152910150980642,24.156387339264633,24.161413948234753]
[null,"Palmerston","CONNECTION POINT RATING","MVA","Non-coincident",null,null,null,null,null,null,null,null,null,null,null,60,60,60,60,60,60,60]
[null,null,null,null,"Coincident",null,null,null,null,null,null,null,null,null,null,null,60,60,60,60,60,60,60]
[null,null,"WINTER/SUMMER PEAKING",null,"Non-coincident",null,null,null,null,null,null,null,null,null,null,null,"Winter","Winter","Winter","Winter","Winter","Winter","Winter"]
[null,null,null,null,"Coincident",null,null,null,null,null,null,null,null,null,null,null,"Winter","Winter","Winter","Winter","Winter","Winter","Winter"]
[null,null,"ADJUSTMENTS - EMBEDDED GENERATION","MW","Non-coincident"]
[null,null,null,null,"Coincident"]
[null,null,"WEATHER CORRECTED MD 10% POE","MW","Non-coincident",null,null,null,null,null,null,null,null,null,null,null,11.184570000000001,11.194990000000001,11.199479999999999,11.2034,11.206849999999999,11.209619999999999,11.21454]
[null,null,null,null,"Coincident",null,null,null,null,null,null,null,null,null,null,null,7.7519653964194344,7.7591874424552403,7.7622994373401495,7.7650163682864424,7.7674075447570292,7.7693274168797917,7.7727374424552398]
[null,null,"WEATHER CORRECTED MD 10% POE","MVA","Non-coincident",null,null,null,null,null,null,null,null,null,null,null,11.892821582410344,11.903901418370843,11.908675743079348,11.912843973114393,11.916512440874826,11.919457848323058,11.924689402346633]
[null,null,null,null,"Coincident",null,null,null,null,null,null,null,null,null,null,null,8.2428507642792876,8.2505301390754404,8.2538391978887518,8.2567281757391289,8.2592707710411162,8.2613122171241624,8.2649381791200422]
[null,null,"WEATHER CORRECTED MD 50% POE","MW","Non-coincident",null,null,null,null,null,null,null,null,null,null,null,11.18003,11.19018,11.1945,11.198230000000001,11.201510000000001,11.204179999999999,11.209020000000001]
[null,null,null,null,"Coincident",null,null,null,null,null,null,null,null,null,null,null,7.7488187468030665,7.7558536572889993,7.7588478260869529,7.7614330690537052,7.7637064194373373,7.7655569820971833,7.7689115601022989]
[null,null,"WEATHER CORRECTED MD 50% POE","MVA","Non-coincident",null,null,null,null,null,null,null,null,null,null,null,11.88799409150241,11.898786829986005,11.90338038961646,11.907346588093684,11.910834290776068,11.913673365825446,11.918819853929941]
[null,null,null,null,"Coincident",null,null,null,null,null,null,null,null,null,null,null,8.2395048562587014,8.2469852453355657,8.2501690168441417,8.2529179677068729,8.255335275704125,8.2573030233726215,8.2608700266368604]
[null,"Port Latta","CONNECTION POINT RATING","MVA","Non-coincident"]
[null,null,null,null,"Coincident"]
[null,null,"WINTER/SUMMER PEAKING",null,"Non-coincident"]
[null,null,null,null,"Coincident"]
[null,null,"ADJUSTMENTS - EMBEDDED GENERATION","MW","Non-coincident"]
[null,null,null,null,"Coincident"]
[null,null,"WEATHER CORRECTED MD 10% POE","MW","Non-coincident"]
[null,null,null,null,"Coincident"]
[null,null,"WEATHER CORRECTED MD 10% POE","MVA","Non-coincident"]
[null,null,null,null,"Coincident"]
[null,null,"WEATHER CORRECTED MD 50% POE","MW","Non-coincident"]
[null,null,null,null,"Coincident"]
[null,null,"WEATHER CORRECTED MD 50% POE","MVA","Non-coincident"]
[null,null,null,null,"Coincident"]
[null,"Que","CONNECTION POINT RATING","MVA","Non-coincident"]
[null,null,null,null,"Coincident"]
[null,null,"WINTER/SUMMER PEAKING",null,"Non-coincident"]
[null,null,null,null,"Coincident"]
[null,null,"ADJUSTMENTS - EMBEDDED GENERATION","MW","Non-coincident"]
[null,null,null,null,"Coincident"]
[null,null,"WEATHER CORRECTED MD 10% POE","MW","Non-coincident"]
[null,null,null,null,"Coincident"]
[null,null,"WEATHER CORRECTED MD 10% POE","MVA","Non-coincident"]
[null,null,null,null,"Coincident"]
[null,null,"WEATHER CORRECTED MD 50% POE","MW","Non-coincident"]
[null,null,null,null,"Coincident"]
[null,null,"WEATHER CORRECTED MD 50% POE","MVA","Non-coincident"]
[null,null,null,null,"Coincident"]
[null,"Queenstown (11 kV)","CONNECTION POINT RATING","MVA","Non-coincident"]
[null,null,null,null,"Coincident"]
[null,null,"WINTER/SUMMER PEAKING",null,"Non-coincident"]
[null,null,null,null,"Coincident"]
[null,null,"ADJUSTMENTS - EMBEDDED GENERATION","MW","Non-coincident"]
[null,null,null,null,"Coincident"]
[null,null,"WEATHER CORRECTED MD 10% POE","MW","Non-coincident"]
[null,null,null,null,"Coincident"]
[null,null,"WEATHER CORRECTED MD 10% POE","MVA","Non-coincident"]
[null,null,null,null,"Coincident"]
[null,null,"WEATHER CORRECTED MD 50% POE","MW","Non-coincident"]
[null,null,null,null,"Coincident"]
[null,null,"WEATHER CORRECTED MD 50% POE","MVA","Non-coincident"]
[null,null,null,null,"Coincident"]
[null,"Queenstown (22 kV)","CONNECTION POINT RATING","MVA","Non-coincident",null,null,null,null,null,null,null,null,null,null,null,67.5,67.5,67.5,67.5,67.5,67.5,67.5]
[null,null,null,null,"Coincident",null,null,null,null,null,null,null,null,null,null,null,67.5,67.5,67.5,67.5,67.5,67.5,67.5]
[null,null,"WINTER/SUMMER PEAKING",null,"Non-coincident",null,null,null,null,null,null,null,null,null,null,null,"Winter","Winter","Winter","Winter","Winter","Winter","Winter"]
[null,null,null,null,"Coincident",null,null,null,null,null,null,null,null,null,null,null,"Winter","Winter","Winter","Winter","Winter","Winter","Winter"]
[null,null,"ADJUSTMENTS - EMBEDDED GENERATION","MW","Non-coincident"]
[null,null,null,null,"Coincident"]
[null,null,"WEATHER CORRECTED MD 10% POE","MW","Non-coincident",null,null,null,null,null,null,null,null,null,null,null,5.7691999999999997,5.7240000000000002,5.6795600000000004,5.6410600000000004,5.5907900000000001,5.5491999999999999,5.5127600000000001]
[null,null,null,null,"Coincident",null,null,null,null,null,null,null,null,null,null,null,5.0855964093357269,5.045752244165171,5.0065780251346501,4.9726399640933581,4.9283265529622984,4.8916646319569121,4.8595424775583487]
[null,null,"WEATHER CORRECTED MD 10% POE","MVA","Non-coincident",null,null,null,null,null,null,null,null,null,null,null,5.7703249111995651,5.7251160978482831,5.6806674326860929,5.6421599257386505,5.5918801238101326,5.5502820143570384,5.5138349090800309]
[null,null,null,null,"Coincident",null,null,null,null,null,null,null,null,null,null,null,5.0865880276462949,5.0467360934353804,5.007554235994383,4.9736095575182722,4.929287505908035,4.8926184363542298,4.8604900185965807]
[null,null,"WEATHER CORRECTED MD 50% POE","MW","Non-coincident",null,null,null,null,null,null,null,null,null,null,null,5.5340499999999997,5.4904900000000003,5.4477599999999997,5.4109699999999998,5.3625499999999997,5.3228600000000004,5.2883500000000003]
[null,null,null,null,"Coincident",null,null,null,null,null,null,null,null,null,null,null,4.8783097845601437,4.8399112926391386,4.8022444524236985,4.7698137701974863,4.7271311490125676,4.692144093357272,4.6617232495511676]
[null,null,"WEATHER CORRECTED MD 50% POE","MVA","Non-coincident",null,null,null,null,null,null,null,null,null,null,null,5.5351290603244738,5.4915605667496541,5.448822235012921,5.4120250614909367,5.3635956202858672,5.3238978813055056,5.2893811523507983]
[null,null,null,null,"Coincident",null,null,null,null,null,null,null,null,null,null,null,4.8792609849538904,4.8408550058780611,4.8031808211693789,4.7707438154255835,4.7280528717421211,4.6930589941131116,4.6626322186790699]
[null,"Railton","CONNECTION POINT RATING","MVA","Non-coincident",null,null,null,null,null,null,null,null,null,null,null,114.31535329954589,114.31535329954589,114.31535329954589,114.31535329954589,114.31535329954589,114.31535329954589,114.31535329954589]
[null,null,null,null,"Coincident",null,null,null,null,null,null,null,null,null,null,null,114.31535329954589,114.31535329954589,114.31535329954589,114.31535329954589,114.31535329954589,114.31535329954589,114.31535329954589]
[null,null,"WINTER/SUMMER PEAKING",null,"Non-coincident",null,null,null,null,null,null,null,null,null,null,null,"Winter","Winter","Winter","Winter","Winter","Winter","Winter"]
[null,null,null,null,"Coincident",null,null,null,null,null,null,null,null,null,null,null,"Winter","Winter","Winter","Winter","Winter","Winter","Winter"]
[null,null,"ADJUSTMENTS - EMBEDDED GENERATION","MW","Non-coincident"]
[null,null,null,null,"Coincident"]
[null,null,"WEATHER CORRECTED MD 10% POE","MW","Non-coincident",null,null,null,null,null,null,null,null,null,null,null,50.926720000000003,50.949350000000003,51.005290000000002,51.066189999999999,51.106299999999997,51.147860000000001,51.193480000000001]
[null,null,null,null,"Coincident",null,null,null,null,null,null,null,null,null,null,null,48.881555758209579,48.903276960886842,48.956970468521227,49.015424787701313,49.053924011713022,49.093815005229025,49.137602953357032]
[null,null,"WEATHER CORRECTED MD 10% POE","MVA","Non-coincident",null,null,null,null,null,null,null,null,null,null,null,52.77578166815789,52.799233324560468,52.857204409808389,52.92031558413084,52.961881909288039,53.00495088145292,53.052227265239296]
[null,null,null,null,"Coincident",null,null,null,null,null,null,null,null,null,null,null,50.656361028064538,50.678870890275668,50.734513916881546,50.795090611917253,50.834987676578706,50.876327043502911,50.921704856762837]
[null,null,"WEATHER CORRECTED MD 50% POE","MW","Non-coincident",null,null,null,null,null,null,null,null,null,null,null,49.828600000000002,49.849130000000002,49.903179999999999,49.962389999999999,50.001080000000002,50.041339999999998,50.085909999999998]
[null,null,null,null,"Coincident",null,null,null,null,null,null,null,null,null,null,null,47.827535118176108,47.847240654674749,47.899120062748374,47.955952250575187,47.993088500313739,48.031731700481068,48.074511815519756]
[null,null,"WEATHER CORRECTED MD 50% POE","MVA","Non-coincident",null,null,null,null,null,null,null,null,null,null,null,51.637790818453894,51.659066227466042,51.715078690062569,51.776438503389869,51.816533270787829,51.858255042187203,51.904443302278366]
[null,null,null,null,"Coincident",null,null,null,null,null,null,null,null,null,null,null,49.564070710287574,49.584491720945749,49.638254781153968,49.69715044803516,49.735635051170327,49.775681319514135,49.820014706997569]
[null,"Risdon (11 kV)","CONNECTION POINT RATING","MVA","Non-coincident"]
[null,null,null,null,"Coincident"]
[null,null,"WINTER/SUMMER PEAKING",null,"Non-coincident"]
[null,null,null,null,"Coincident"]
[null,null,"ADJUSTMENTS - EMBEDDED GENERATION","MW","Non-coincident"]
[null,null,null,null,"Coincident"]
[null,null,"WEATHER CORRECTED MD 10% POE","MW","Non-coincident"]
[null,null,null,null,"Coincident"]
[null,null,"WEATHER CORRECTED MD 10% POE","MVA","Non-coincident"]
[null,null,null,null,"Coincident"]
[null,null,"WEATHER CORRECTED MD 50% POE","MW","Non-coincident"]
[null,null,null,null,"Coincident"]
[null,null,"WEATHER CORRECTED MD 50% POE","MVA","Non-coincident"]
[null,null,null,null,"Coincident"]
[null,"Risdon (33 kV)","CONNECTION POINT RATING","MVA","Non-coincident",null,null,null,null,null,null,null,null,null,null,null,180,180,180,180,180,180,180]
[null,null,null,null,"Coincident",null,null,null,null,null,null,null,null,null,null,null,180,180,180,180,180,180,180]
[null,null,"WINTER/SUMMER PEAKING",null,"Non-coincident",null,null,null,null,null,null,null,null,null,null,null,"Winter","Winter","Winter","Winter","Winter","Winter","Winter"]
[null,null,null,null,"Coincident",null,null,null,null,null,null,null,null,null,null,null,"Winter","Winter","Winter","Winter","Winter","Winter","Winter"]
[null,null,"ADJUSTMENTS - EMBEDDED GENERATION","MW","Non-coincident"]
[null,null,null,null,"Coincident"]
[null,null,"WEATHER CORRECTED MD 10% POE","MW","Non-coincident",null,null,null,null,null,null,null,null,null,null,null,69.550489999999996,69.781450000000007,70.052260000000004,70.320580000000007,70.559749999999994,70.819360000000003,71.113370000000003]
[null,null,null,null,"Coincident",null,null,null,null,null,null,null,null,null,null,null,63.071213928892831,63.280657853285277,63.526239378937838,63.769562871287079,63.986451957695706,64.221876867686717,64.48849709720966]
[null,null,"WEATHER CORRECTED MD 10% POE","MVA","Non-coincident",null,null,null,null,null,null,null,null,null,null,null,71.100165929313022,71.336272020341781,71.613116021517286,71.887414542234453,72.131913562806588,72.397308013326054,72.697868940860531]
[null,null,null,null,"Coincident",null,null,null,null,null,null,null,null,null,null,null,64.476523108715398,64.690633717816638,64.94168712122287,65.190432179388964,65.412153838458664,65.652824323515702,65.925385200645295]
[null,null,"WEATHER CORRECTED MD 50% POE","MW","Non-coincident",null,null,null,null,null,null,null,null,null,null,null,67.792190000000005,68.015090000000001,68.277670000000001,68.537689999999998,68.768479999999997,69.019509999999997,69.305000000000007]
[null,null,null,null,"Coincident",null,null,null,null,null,null,null,null,null,null,null,61.476715954095361,61.678850742574198,61.916968969396883,62.152765684068349,62.362055445544492,62.589699662466188,62.848593609360883]
[null,null,"WEATHER CORRECTED MD 50% POE","MVA","Non-coincident",null,null,null,null,null,null,null,null,null,null,null,69.302688704443568,69.530555208125193,69.798985834131116,70.064799419987096,70.30073172319338,70.557355000085252,70.849206090870666]
[null,null,null,null,"Coincident",null,null,null,null,null,null,null,null,null,null,null,62.846497632517405,63.053136248592317,63.296560061104444,63.537610635136751,63.751563646370172,63.984280074334677,64.248942517148635]
[null,"Rokeby","CONNECTION POINT RATING","MVA","Non-coincident",null,null,null,null,null,null,null,null,null,null,null,84,84,84,84,84,84,84]
[null,null,null,null,"Coincident",null,null,null,null,null,null,null,null,null,null,null,84,84,84,84,84,84,84]
[null,null,"WINTER/SUMMER PEAKING",null,"Non-coincident",null,null,null,null,null,null,null,null,null,null,null,"Winter","Winter","Winter","Winter","Winter","Winter","Winter"]
[null,null,null,null,"Coincident",null,null,null,null,null,null,null,null,null,null,null,"Winter","Winter","Winter","Winter","Winter","Winter","Winter"]
[null,null,"ADJUSTMENTS - EMBEDDED GENERATION","MW","Non-coincident"]
[null,null,null,null,"Coincident"]
[null,null,"WEATHER CORRECTED MD 10% POE","MW","Non-coincident",null,null,null,null,null,null,null,null,null,null,null,22.529039999999998,22.64687,22.762709999999998,22.876650000000001,22.989599999999999,23.101389999999999,23.210290000000001]
[null,null,null,null,"Coincident",null,null,null,null,null,null,null,null,null,null,null,19.428981704889651,19.530597970575503,19.630498065772386,19.728759606231062,19.826167373431407,19.922574759844217,20.016489818260485]
[null,null,"WEATHER CORRECTED MD 10% POE","MVA","Non-coincident",null,null,null,null,null,null,null,null,null,null,null,22.544634068003873,22.662545627139679,22.778465808844604,22.892484675414529,23.005512856729887,23.117380235120716,23.226355613121985]
[null,null,null,null,"Coincident",null,null,null,null,null,null,null,null,null,null,null,19.442429985950543,19.544116588009246,19.644085831686407,19.742415386456571,19.83989057700677,19.936364694329544,20.030344758525356]
[null,null,"WEATHER CORRECTED MD 50% POE","MW","Non-coincident",null,null,null,null,null,null,null,null,null,null,null,21.630559999999999,21.743690000000001,21.85491,21.964300000000001,22.072749999999999,22.18008,22.28464]
[null,null,null,null,"Coincident",null,null,null,null,null,null,null,null,null,null,null,18.65413504110774,18.7516980398096,18.847613859800944,18.941951492860227,19.035478472522708,19.128039567286883,19.218211821722193]
[null,null,"WEATHER CORRECTED MD 50% POE","MVA","Non-coincident",null,null,null,null,null,null,null,null,null,null,null,21.645532161423741,21.758740467330842,21.870037451181169,21.979503168348831,22.088028234870752,22.195432526155194,22.300064900111231]
[null,null,null,null,"Coincident",null,null,null,null,null,null,null,null,null,null,null,18.667046991656211,18.764677521155495,18.860659731806166,18.955062663141153,19.048654379964251,19.141279543326391,19.231514212860954]
[null,"Rosebery","CONNECTION POINT RATING","MVA","Non-coincident"]
[null,null,null,null,"Coincident"]
[null,null,"WINTER/SUMMER PEAKING",null,"Non-coincident"]
[null,null,null,null,"Coincident"]
[null,null,"ADJUSTMENTS - EMBEDDED GENERATION","MW","Non-coincident"]
[null,null,null,null,"Coincident"]
[null,null,"WEATHER CORRECTED MD 10% POE","MW","Non-coincident"]
[null,null,null,null,"Coincident"]
[null,null,"WEATHER CORRECTED MD 10% POE","MVA","Non-coincident"]
[null,null,null,null,"Coincident"]
[null,null,"WEATHER CORRECTED MD 50% POE","MW","Non-coincident"]
[null,null,null,null,"Coincident"]
[null,null,"WEATHER CORRECTED MD 50% POE","MVA","Non-coincident"]
[null,null,null,null,"Coincident"]
[null,"Savage River","CONNECTION POINT RATING","MVA","Non-coincident"]
[null,null,null,null,"Coincident"]
[null,null,"WINTER/SUMMER PEAKING",null,"Non-coincident"]
[null,null,null,null,"Coincident"]
[null,null,"ADJUSTMENTS - EMBEDDED GENERATION","MW","Non-coincident"]
[null,null,null,null,"Coincident"]
[null,null,"WEATHER CORRECTED MD 10% POE","MW","Non-coincident"]
[null,null,null,null,"Coincident"]
[null,null,"WEATHER CORRECTED MD 10% POE","MVA","Non-coincident"]
[null,null,null,null,"Coincident"]
[null,null,"WEATHER CORRECTED MD 50% POE","MW","Non-coincident"]
[null,null,null,null,"Coincident"]
[null,null,"WEATHER CORRECTED MD 50% POE","MVA","Non-coincident"]
[null,null,null,null,"Coincident"]
[null,"Scottsdale","CONNECTION POINT RATING","MVA","Non-coincident",null,null,null,null,null,null,null,null,null,null,null,72,72,72,72,72,72,72]
[null,null,null,null,"Coincident",null,null,null,null,null,null,null,null,null,null,null,72,72,72,72,72,72,72]
[null,null,"WINTER/SUMMER PEAKING",null,"Non-coincident",null,null,null,null,null,null,null,null,null,null,null,"Winter","Winter","Winter","Winter","Winter","Winter","Winter"]
[null,null,null,null,"Coincident",null,null,null,null,null,null,null,null,null,null,null,"Winter","Winter","Winter","Winter","Winter","Winter","Winter"]
[null,null,"ADJUSTMENTS - EMBEDDED GENERATION","MW","Non-coincident"]
[null,null,null,null,"Coincident"]
[null,null,"WEATHER CORRECTED MD 10% POE","MW","Non-coincident",null,null,null,null,null,null,null,null,null,null,null,12.9971,12.96428,12.9352,12.909829999999999,12.88598,12.857139999999999,12.82916]
[null,null,null,null,"Coincident",null,null,null,null,null,null,null,null,null,null,null,12.9971,12.96428,12.9352,12.909829999999999,12.88598,12.857139999999999,12.82916]
[null,null,"WEATHER CORRECTED MD 10% POE","MVA","Non-coincident",null,null,null,null,null,null,null,null,null,null,null,13.004603401362116,12.971764453932868,12.942667665656128,12.917283019212492,12.893419250285389,12.86456260056389,12.836566447332006]
[null,null,null,null,"Coincident",null,null,null,null,null,null,null,null,null,null,null,13.004603401362116,12.971764453932868,12.942667665656128,12.917283019212492,12.893419250285389,12.86456260056389,12.836566447332006]
[null,null,"WEATHER CORRECTED MD 50% POE","MW","Non-coincident",null,null,null,null,null,null,null,null,null,null,null,12.57629,12.544230000000001,12.516030000000001,12.49155,12.468669999999999,12.44087,12.41399]
[null,null,null,null,"Coincident",null,null,null,null,null,null,null,null,null,null,null,12.57629,12.544230000000001,12.516030000000001,12.49155,12.468669999999999,12.44087,12.41399]
[null,null,"WEATHER CORRECTED MD 50% POE","MVA","Non-coincident",null,null,null,null,null,null,null,null,null,null,null,12.583550462065874,12.55147195339489,12.523255673154035,12.498761540519419,12.475868331586414,12.448052282270963,12.421156764083936]
[null,null,null,null,"Coincident",null,null,null,null,null,null,null,null,null,null,null,12.583550462065874,12.55147195339489,12.523255673154035,12.498761540519419,12.475868331586414,12.448052282270963,12.421156764083936]
[null,"Smithton","CONNECTION POINT RATING","MVA","Non-coincident",null,null,null,null,null,null,null,null,null,null,null,84,84,84,84,84,84,84]
[null,null,null,null,"Coincident",null,null,null,null,null,null,null,null,null,null,null,84,84,84,84,84,84,84]
[null,null,"WINTER/SUMMER PEAKING",null,"Non-coincident",null,null,null,null,null,null,null,null,null,null,null,"Winter","Winter","Winter","Winter","Winter","Winter","Winter"]
[null,null,null,null,"Coincident",null,null,null,null,null,null,null,null,null,null,null,"Winter","Winter","Winter","Winter","Winter","Winter","Winter"]
[null,null,"ADJUSTMENTS - EMBEDDED GENERATION","MW","Non-coincident"]
[null,null,null,null,"Coincident"]
[null,null,"WEATHER CORRECTED MD 10% POE","MW","Non-coincident",null,null,null,null,null,null,null,null,null,null,null,23.588920000000002,23.552689999999998,23.511790000000001,23.466449999999998,23.414770000000001,23.359210000000001,23.302040000000002]
[null,null,null,null,"Coincident",null,null,null,null,null,null,null,null,null,null,null,19.768720910261905,18.657562465277767,18.62516301091269,18.589246354166658,18.54830738591269,18.504294826388882,18.459006884920626]
[null,null,"WEATHER CORRECTED MD 10% POE","MVA","Non-coincident",null,null,null,null,null,null,null,null,null,null,null,24.151720238739895,24.114625839155277,24.072750019585563,24.026328267524658,23.973415251501116,23.916529663841132,23.857995663723756]
[null,null,null,null,"Coincident",null,null,null,null,null,null,null,null,null,null,null,20.952588248280311,19.102707075957817,19.069534613729228,19.032761033351619,18.990845315797255,18.945782675175728,18.899414223693856]
[null,null,"WEATHER CORRECTED MD 50% POE","MW","Non-coincident",null,null,null,null,null,null,null,null,null,null,null,23.029019999999999,22.993839999999999,22.954129999999999,22.910219999999999,22.860140000000001,22.806370000000001,22.751149999999999]
[null,null,null,null,"Coincident",null,null,null,null,null,null,null,null,null,null,null,19.41267094461141,18.214862341269832,18.183405560515865,18.148621696428563,18.108950188492056,18.066355600198406,18.022612375992054]
[null,null,"WEATHER CORRECTED MD 50% POE","MVA","Non-coincident",null,null,null,null,null,null,null,null,null,null,null,23.578461769862535,23.542442421880565,23.501784994127181,23.456827359963214,23.405552517810371,23.350499637168227,23.293962161455763]
[null,null,null,null,"Coincident",null,null,null,null,null,null,null,null,null,null,null,20.575215915494905,18.649444716142483,18.617237418462842,18.581623657669265,18.541005640348782,18.497394801863912,18.452607922542082]
[null,"Sorell","CONNECTION POINT RATING","MVA","Non-coincident",null,null,null,null,null,null,null,null,null,null,null,121.93637685284897,121.93637685284897,121.93637685284897,121.93637685284897,121.93637685284897,121.93637685284897,121.93637685284897]
[null,null,null,null,"Coincident",null,null,null,null,null,null,null,null,null,null,null,121.93637685284897,121.93637685284897,121.93637685284897,121.93637685284897,121.93637685284897,121.93637685284897,121.93637685284897]
[null,null,"WINTER/SUMMER PEAKING",null,"Non-coincident",null,null,null,null,null,null,null,null,null,null,null,"Winter","Winter","Winter","Winter","Winter","Winter","Winter"]
[null,null,null,null,"Coincident",null,null,null,null,null,null,null,null,null,null,null,"Winter","Winter","Winter","Winter","Winter","Winter","Winter"]
[null,null,"ADJUSTMENTS - EMBEDDED GENERATION","MW","Non-coincident"]
[null,null,null,null,"Coincident"]
[null,null,"WEATHER CORRECTED MD 10% POE","MW","Non-coincident",null,null,null,null,null,null,null,null,null,null,null,35.909750000000003,36.104050000000001,36.269620000000003,36.403779999999998,36.52196,36.636679999999998,36.777540000000002]
[null,null,null,null,"Coincident",null,null,null,null,null,null,null,null,null,null,null,33.137888390044111,33.317190437933206,33.46998014492754,33.593784379332071,33.702842104599874,33.808706906112157,33.938693969754254]
[null,null,"WEATHER CORRECTED MD 10% POE","MVA","Non-coincident",null,null,null,null,null,null,null,null,null,null,null,35.929021641104711,36.123425915845324,36.28908477209238,36.423316771573589,36.541560195087982,36.656341761728449,36.797277356890376]
[null,null,null,null,"Coincident",null,null,null,null,null,null,null,null,null,null,null,33.15567245960797,33.335070733305272,33.487942437762626,33.611813114032465,33.720929367174762,33.826850983019099,33.956907806657817]
[null,null,"WEATHER CORRECTED MD 50% POE","MW","Non-coincident",null,null,null,null,null,null,null,null,null,null,null,35.007159999999999,35.195619999999998,35.355550000000001,35.484279999999998,35.597230000000003,35.70684,35.842860000000002]
[null,null,null,null,"Coincident",null,null,null,null,null,null,null,null,null,null,null,32.304969010712036,32.478881846250786,32.62646690296156,32.745260277252676,32.849491704473849,32.950640945179586,33.076161606805293]
[null,null,"WEATHER CORRECTED MD 50% POE","MVA","Non-coincident",null,null,null,null,null,null,null,null,null,null,null,35.025947249246101,35.214508389841136,35.374524219276374,35.503323304646202,35.616333921382967,35.726002745646049,35.862095743331167]
[null,null,null,null,"Coincident",null,null,null,null,null,null,null,null,null,null,null,32.322306078463086,32.496312247588115,32.643976508588686,32.76283363557301,32.867121000545275,32.968324524888878,33.09391254953276]
[null,"St Leonards","CONNECTION POINT RATING","MVA","Non-coincident"]
[null,null,null,null,"Coincident"]
[null,null,"WINTER/SUMMER PEAKING",null,"Non-coincident",null,null,null,null,null,null,null,null,null,null,null,"Winter","Winter","Winter","Winter","Winter","Winter","Winter"]
[null,null,null,null,"Coincident",null,null,null,null,null,null,null,null,null,null,null,"Winter","Winter","Winter","Winter","Winter","Winter","Winter"]
[null,null,"ADJUSTMENTS - EMBEDDED GENERATION","MW","Non-coincident"]
[null,null,null,null,"Coincident"]
[null,null,"WEATHER CORRECTED MD 10% POE","MW","Non-coincident",null,null,null,null,null,null,null,null,null,null,null,30.392219999999998,30.393979999999999,30.401299999999999,30.393540000000002,30.389220000000002,30.36253,30.34216]
[null,null,null,null,"Coincident",null,null,null,null,null,null,null,null,null,null,null,28.313499769566491,28.315139391798578,28.321958729718389,28.314729486240559,28.310704958943621,28.285840460435459,28.266863696306149]
[null,null,"WEATHER CORRECTED MD 10% POE","MVA","Non-coincident",null,null,null,null,null,null,null,null,null,null,null,30.406372390401522,30.408133209960184,30.415456618579157,30.40769300507052,30.403370993426538,30.376668565005716,30.35628907954554]
[null,null,null,null,"Coincident",null,null,null,null,null,null,null,null,null,null,null,28.326684186577566,28.328324572313402,28.33514708571472,28.327914475879446,28.323888074527851,28.299011997658845,28.280026396841247]
[null,null,"WEATHER CORRECTED MD 50% POE","MW","Non-coincident",null,null,null,null,null,null,null,null,null,null,null,29.522040000000001,29.522220000000001,29.528040000000001,29.518879999999999,29.51324,29.485299999999999,29.463799999999999]
[null,null,null,null,"Coincident",null,null,null,null,null,null,null,null,null,null,null,27.502837000295891,27.503004688933263,27.508426621541638,27.499893133106465,27.494638889135462,27.468609886201104,27.448580410070512]
[null,null,"WEATHER CORRECTED MD 50% POE","MVA","Non-coincident",null,null,null,null,null,null,null,null,null,null,null,29.535787183836174,29.535967267654673,29.541789977786152,29.532625712355852,29.526983086042872,29.49903007554914,29.477520063895049]
[null,null,null,null,"Coincident",null,null,null,null,null,null,null,null,null,null,null,27.515643925435867,27.515811692158849,27.521236149535305,27.512698687410161,27.50744199675669,27.4814008732003,27.461362070177309]
[null,"St Marys","CONNECTION POINT RATING","MVA","Non-coincident",null,null,null,null,null,null,null,null,null,null,null,24]
[null,null,null,null,"Coincident",null,null,null,null,null,null,null,null,null,null,null,24]
[null,null,"WINTER/SUMMER PEAKING",null,"Non-coincident",null,null,null,null,null,null,null,null,null,null,null,"Winter","Winter","Winter","Winter","Winter","Winter","Winter"]
[null,null,null,null,"Coincident",null,null,null,null,null,null,null,null,null,null,null,"Winter","Winter","Winter","Winter","Winter","Winter","Winter"]
[null,null,"ADJUSTMENTS - EMBEDDED GENERATION","MW","Non-coincident"]
[null,null,null,null,"Coincident"]
[null,null,"WEATHER CORRECTED MD 10% POE","MW","Non-coincident",null,null,null,null,null,null,null,null,null,null,null,15.16466,15.147209999999999,15.126239999999999,15.082190000000001,15.032450000000001,14.97404,14.92902]
[null,null,null,null,"Coincident",null,null,null,null,null,null,null,null,null,null,null,11.472740157068062,11.459538455497382,11.443673717277486,11.410347931937173,11.372717408376964,11.328527643979058,11.294468010471205]
[null,null,"WEATHER CORRECTED MD 10% POE","MVA","Non-coincident",null,null,null,null,null,null,null,null,null,null,null,15.200422081247003,15.182930929759415,15.161911477226766,15.117757596250939,15.067900296824428,15.009352551357953,14.964226382878227]
[null,null,null,null,"Coincident",null,null,null,null,null,null,null,null,null,null,null,11.499795763037653,11.486562928535266,11.470660777273654,11.437256401352149,11.399537135555654,11.355243160582326,11.321103205894785]
[null,null,"WEATHER CORRECTED MD 50% POE","MW","Non-coincident",null,null,null,null,null,null,null,null,null,null,null,14.71902,14.702109999999999,14.68182,14.63875,14.590120000000001,14.53309,14.489599999999999]
[null,null,null,null,"Coincident",null,null,null,null,null,null,null,null,null,null,null,11.135593664921466,11.122800497382199,11.107450209424083,11.074865837696334,11.038075078534032,10.994929345549737,10.962027225130889]
[null,null,"WEATHER CORRECTED MD 50% POE","MVA","Non-coincident",null,null,null,null,null,null,null,null,null,null,null,14.753731150076314,14.736781272044501,14.716443423122833,14.673271853233411,14.624527171465997,14.567362680386506,14.523770120031479]
[null,null,null,null,"Coincident",null,null,null,null,null,null,null,null,null,null,null,11.161854194691243,11.149030857646235,11.133644369849472,11.10098315598025,11.06410563495726,11.020858153486124,10.987878441594496]
[null,"Starwood","CONNECTION POINT RATING","MVA","Non-coincident"]
[null,null,null,null,"Coincident"]
[null,null,"WINTER/SUMMER PEAKING",null,"Non-coincident"]
[null,null,null,null,"Coincident"]
[null,null,"ADJUSTMENTS - EMBEDDED GENERATION","MW","Non-coincident"]
[null,null,null,null,"Coincident"]
[null,null,"WEATHER CORRECTED MD 10% POE","MW","Non-coincident"]
[null,null,null,null,"Coincident"]
[null,null,"WEATHER CORRECTED MD 10% POE","MVA","Non-coincident"]
[null,null,null,null,"Coincident"]
[null,null,"WEATHER CORRECTED MD 50% POE","MW","Non-coincident"]
[null,null,null,null,"Coincident"]
[null,null,"WEATHER CORRECTED MD 50% POE","MVA","Non-coincident"]
[null,null,null,null,"Coincident"]
[null,"Temco","CONNECTION POINT RATING","MVA","Non-coincident"]
[null,null,null,null,"Coincident"]
[null,null,"WINTER/SUMMER PEAKING",null,"Non-coincident"]
[null,null,null,null,"Coincident"]
[null,null,"ADJUSTMENTS - EMBEDDED GENERATION","MW","Non-coincident"]
[null,null,null,null,"Coincident"]
[null,null,"WEATHER CORRECTED MD 10% POE","MW","Non-coincident"]
[null,null,null,null,"Coincident"]
[null,null,"WEATHER CORRECTED MD 10% POE","MVA","Non-coincident"]
[null,null,null,null,"Coincident"]
[null,null,"WEATHER CORRECTED MD 50% POE","MW","Non-coincident"]
[null,null,null,null,"Coincident"]
[null,null,"WEATHER CORRECTED MD 50% POE","MVA","Non-coincident"]
[null,null,null,null,"Coincident"]
[null,"Trevallyn","CONNECTION POINT RATING","MVA","Non-coincident",null,null,null,null,null,null,null,null,null,null,null,195,195,195,195,195,195,195]
[null,null,null,null,"Coincident",null,null,null,null,null,null,null,null,null,null,null,195,195,195,195,195,195,195]
[null,null,"WINTER/SUMMER PEAKING",null,"Non-coincident",null,null,null,null,null,null,null,null,null,null,null,"Winter","Winter","Winter","Winter","Winter","Winter","Winter"]
[null,null,null,null,"Coincident",null,null,null,null,null,null,null,null,null,null,null,"Winter","Winter","Winter","Winter","Winter","Winter","Winter"]
[null,null,"ADJUSTMENTS - EMBEDDED GENERATION","MW","Non-coincident"]
[null,null,null,null,"Coincident"]
[null,null,"WEATHER CORRECTED MD 10% POE","MW","Non-coincident",null,null,null,null,null,null,null,null,null,null,null,71.935469999999995,72.057270000000003,72.210729999999998,72.361869999999996,72.507959999999997,72.610140000000001,72.735939999999999]
[null,null,null,null,"Coincident",null,null,null,null,null,null,null,null,null,null,null,66.444867638640389,66.557371037567052,66.699117930828834,66.838721902206288,66.973661323792456,67.068042254025016,67.184240345855656]
[null,null,"WEATHER CORRECTED MD 10% POE","MVA","Non-coincident",null,null,null,null,null,null,null,null,null,null,null,71.993717691391566,72.115616315461338,72.269200575311459,72.420462956607864,72.566671248811076,72.668933986146456,72.794835849101915]
[null,null,null,null,"Coincident",null,null,null,null,null,null,null,null,null,null,null,66.49866947165502,66.611263966994358,66.753125635752767,66.892842647457087,67.027891332384215,67.122348684878247,67.238640864793567]
[null,null,"WEATHER CORRECTED MD 50% POE","MW","Non-coincident",null,null,null,null,null,null,null,null,null,null,null,70.071680000000001,70.187550000000002,70.335170000000005,70.480649999999997,70.621269999999996,70.718109999999996,70.838809999999995]
[null,null,null,null,"Coincident",null,null,null,null,null,null,null,null,null,null,null,64.723334716756085,64.830360733452565,64.966713375074519,65.101089355992812,65.230976285032767,65.320424800238484,65.431912158616541]
[null,null,"WEATHER CORRECTED MD 50% POE","MVA","Non-coincident",null,null,null,null,null,null,null,null,null,null,null,70.128418540693886,70.244382363115591,70.392121894192584,70.537719692465714,70.678453555492723,70.775371968915678,70.896169702291871]
[null,null,null,null,"Coincident",null,null,null,null,null,null,null,null,null,null,null,64.775742587677271,64.882855265632671,65.019318314910123,65.153803102939392,65.283795204208815,65.373316147793872,65.48489377987481]
[null,"Triabunna","CONNECTION POINT RATING","MVA","Non-coincident",null,null,null,null,null,null,null,null,null,null,null,60,60,60,60,60,60,60]
[null,null,null,null,"Coincident",null,null,null,null,null,null,null,null,null,null,null,60,60,60,60,60,60,60]
[null,null,"WINTER/SUMMER PEAKING",null,"Non-coincident",null,null,null,null,null,null,null,null,null,null,null,"Winter","Winter","Winter","Winter","Winter","Winter","Winter"]
[null,null,null,null,"Coincident",null,null,null,null,null,null,null,null,null,null,null,"Winter","Winter","Winter","Winter","Winter","Winter","Winter"]
[null,null,"ADJUSTMENTS - EMBEDDED GENERATION","MW","Non-coincident"]
[null,null,null,null,"Coincident"]
[null,null,"WEATHER CORRECTED MD 10% POE","MW","Non-coincident",null,null,null,null,null,null,null,null,null,null,null,8.0734200000000005,8.08169,8.0859100000000002,8.0794200000000007,8.0716699999999992,8.0588499999999996,8.0544499999999992]
[null,null,null,null,"Coincident",null,null,null,null,null,null,null,null,null,null,null,6.6451388005997005,6.6519457421289356,6.6554191754122947,6.6500773313343338,6.6436983958020983,6.6331464017991006,6.6295248125937025]
[null,null,"WEATHER CORRECTED MD 10% POE","MVA","Non-coincident",null,null,null,null,null,null,null,null,null,null,null,8.0778103907426981,8.0860848880352272,8.0903071829051747,8.0838136535909655,8.0760594390786196,8.0632324674594891,8.058830074704094]
[null,null,null,null,"Coincident",null,null,null,null,null,null,null,null,null,null,null,6.648752480536344,6.6555631237351411,6.659038445899462,6.6536936968837193,6.6473112924350257,6.6367535601728038,6.6331300015180616]
[null,null,"WEATHER CORRECTED MD 50% POE","MW","Non-coincident",null,null,null,null,null,null,null,null,null,null,null,7.5166000000000004,7.5242399999999998,7.5281000000000002,7.5216099999999999,7.51389,7.5014599999999998,7.4974999999999996]
[null,null,null,null,"Coincident",null,null,null,null,null,null,null,null,null,null,null,6.1868266866566719,6.1931150824587711,6.196292203898051,6.1909503598200901,6.1845961169415293,6.1743651274362819,6.1711056971514244]
[null,null,"WEATHER CORRECTED MD 50% POE","MVA","Non-coincident",null,null,null,null,null,null,null,null,null,null,null,7.5206875875473553,7.5283317422408151,7.5321938413398666,7.5257003120256583,7.5179761138275545,7.5055393542935605,7.5015772008137045]
[null,null,null,null,"Coincident",null,null,null,null,null,null,null,null,null,null,null,6.1901911327788577,6.1964829482611812,6.1996617974446577,6.194317048428915,6.1879593500619601,6.1777227968623167,6.1744615940730494]
[null,"Tungatinah","CONNECTION POINT RATING","MVA","Non-coincident",null,null,null,null,null,null,null,null,null,null,null,37.5,37.5,37.5,37.5,37.5,37.5,37.5]
[null,null,null,null,"Coincident",null,null,null,null,null,null,null,null,null,null,null,37.5,37.5,37.5,37.5,37.5,37.5,37.5]
[null,null,"WINTER/SUMMER PEAKING",null,"Non-coincident",null,null,null,null,null,null,null,null,null,null,null,"Winter","Winter","Winter","Winter","Winter","Winter","Winter"]
[null,null,null,null,"Coincident",null,null,null,null,null,null,null,null,null,null,null,"Winter","Winter","Winter","Winter","Winter","Winter","Winter"]
[null,null,"ADJUSTMENTS - EMBEDDED GENERATION","MW","Non-coincident"]
[null,null,null,null,"Coincident"]
[null,null,"WEATHER CORRECTED MD 10% POE","MW","Non-coincident",null,null,null,null,null,null,null,null,null,null,null,0.92022000000000004,0.91864999999999997,0.91707000000000005,0.91532999999999998,0.91246000000000005,0.91120999999999996,0.90883999999999998]
[null,null,null,null,"Coincident",null,null,null,null,null,null,null,null,null,null,null,0.76684999999999981,0.76554166666666634,0.76422499999999982,0.76277499999999976,0.76038333333333308,0.75934166666666636,0.75736666666666641]
[null,null,"WEATHER CORRECTED MD 10% POE","MVA","Non-coincident",null,null,null,null,null,null,null,null,null,null,null,0.93443883354893387,0.93284457460143011,0.93124016113833741,0.92947327542581726,0.92655892945171836,0.92528961500306883,0.9228829948084295]
[null,null,null,null,"Coincident",null,null,null,null,null,null,null,null,null,null,null,0.77869902795744472,0.77737047883452481,0.77603346761528091,0.77456106285484749,0.77213244120976499,0.77107467916922368,0.76906916234035771]
[null,null,"WEATHER CORRECTED MD 50% POE","MW","Non-coincident",null,null,null,null,null,null,null,null,null,null,null,0.88543000000000005,0.88392999999999999,0.88243000000000005,0.88077000000000005,0.87804000000000004,0.87687000000000004,0.87465000000000004]
[null,null,null,null,"Coincident",null,null,null,null,null,null,null,null,null,null,null,0.73785833333333306,0.73660833333333309,0.73535833333333311,0.73397499999999982,0.7316999999999998,0.73072499999999974,0.72887499999999983]
[null,null,"WEATHER CORRECTED MD 50% POE","MVA","Non-coincident",null,null,null,null,null,null,null,null,null,null,null,0.89911127381412326,0.89758809647574389,0.89606491913736475,0.89437926954955826,0.89160708679370793,0.89041900846977207,0.88816470600897068]
[null,null,null,null,"Coincident",null,null,null,null,null,null,null,null,null,null,null,0.7492593948451024,0.74799008039645298,0.74672076594780368,0.74531605795796496,0.74300590566142299,0.74201584039147639,0.7401372550074754]
[null,"Ulverstone","CONNECTION POINT RATING","MVA","Non-coincident",null,null,null,null,null,null,null,null,null,null,null,108,108,108,108,108,108,108]
[null,null,null,null,"Coincident",null,null,null,null,null,null,null,null,null,null,null,108,108,108,108,108,108,108]
[null,null,"WINTER/SUMMER PEAKING",null,"Non-coincident",null,null,null,null,null,null,null,null,null,null,null,"Winter","Winter","Winter","Winter","Winter","Winter","Winter"]
[null,null,null,null,"Coincident",null,null,null,null,null,null,null,null,null,null,null,"Winter","Winter","Winter","Winter","Winter","Winter","Winter"]
[null,null,"ADJUSTMENTS - EMBEDDED GENERATION","MW","Non-coincident"]
[null,null,null,null,"Coincident"]
[null,null,"WEATHER CORRECTED MD 10% POE","MW","Non-coincident",null,null,null,null,null,null,null,null,null,null,null,33.150480000000002,33.124989999999997,33.089799999999997,33.04571,32.99915,32.95082,32.91048]
[null,null,null,null,"Coincident",null,null,null,null,null,null,null,null,null,null,null,28.13058440187929,28.10895428984459,28.079093024936746,28.04167946512468,28.002169931333569,27.961158424286225,27.926927011203464]
[null,null,"WEATHER CORRECTED MD 10% POE","MVA","Non-coincident",null,null,null,null,null,null,null,null,null,null,null,33.226098781161021,33.200550636520823,33.165280365438498,33.121089792775258,33.07442358585304,33.025983341425402,32.985551322799068]
[null,null,null,null,"Coincident",null,null,null,null,null,null,null,null,null,null,null,28.194752417118202,28.173072965143071,28.143143584405344,28.105644681400904,28.066045023340415,28.024939965907784,27.990630468352798]
[null,null,"WEATHER CORRECTED MD 50% POE","MW","Non-coincident",null,null,null,null,null,null,null,null,null,null,null,32.065840000000001,32.041170000000001,32.007040000000003,31.964269999999999,31.919239999999999,31.872689999999999,31.83437]
[null,null,null,null,"Coincident",null,null,null,null,null,null,null,null,null,null,null,27.210188767618355,27.189254485001804,27.16029270690278,27.123999262739424,27.085788044813871,27.046286996747373,27.013769700036136]
[null,null,"WEATHER CORRECTED MD 50% POE","MVA","Non-coincident",null,null,null,null,null,null,null,null,null,null,null,32.138984634337248,32.11425836017979,32.080050507038571,32.037182945396317,31.992050228521155,31.945394044409699,31.90698663355791]
[null,null,null,null,"Coincident",null,null,null,null,null,null,null,null,null,null,null,27.272257289997775,27.251275254680934,27.222247412550253,27.185871180264016,27.147572799626907,27.10798164664762,27.075390175494746]
[null,"Waddamana","CONNECTION POINT RATING","MVA","Non-coincident",null,null,null,null,null,null,null,null,null,null,null,3.8]
[null,null,null,null,"Coincident",null,null,null,null,null,null,null,null,null,null,null,3.8]
[null,null,"WINTER/SUMMER PEAKING",null,"Non-coincident",null,null,null,null,null,null,null,null,null,null,null,"Winter","Winter","Winter","Winter","Winter","Winter","Winter"]
[null,null,null,null,"Coincident",null,null,null,null,null,null,null,null,null,null,null,"Winter","Winter","Winter","Winter","Winter","Winter","Winter"]
[null,null,"ADJUSTMENTS - EMBEDDED GENERATION","MW","Non-coincident"]
[null,null,null,null,"Coincident"]
[null,null,"WEATHER CORRECTED MD 10% POE","MW","Non-coincident",null,null,null,null,null,null,null,null,null,null,null,0.72802,0.72802,0.72802,0.72802,0.72802,0.72802999999999995,0.72804999999999997]
[null,null,null,null,"Coincident",null,null,null,null,null,null,null,null,null,null,null,0,0,0,0,0,0,0]
[null,null,"WEATHER CORRECTED MD 10% POE","MVA","Non-coincident",null,null,null,null,null,null,null,null,null,null,null,0,0,0,0,0,0,0]
[null,null,null,null,"Coincident",null,null,null,null,null,null,null,null,null,null,null,0,0,0,0,0,0,0]
[null,null,"WEATHER CORRECTED MD 50% POE","MW","Non-coincident",null,null,null,null,null,null,null,null,null,null,null,0.68542999999999998,0.68542999999999998,0.68542999999999998,0.68542999999999998,0.68544000000000005,0.68545,0.68545999999999996]
[null,null,null,null,"Coincident",null,null,null,null,null,null,null,null,null,null,null,0,0,0,0,0,0,0]
[null,null,"WEATHER CORRECTED MD 50% POE","MVA","Non-coincident",null,null,null,null,null,null,null,null,null,null,null,0,0,0,0,0,0,0]
[null,null,null,null,"Coincident",null,null,null,null,null,null,null,null,null,null,null,0,0,0,0,0,0,0]
[null,"Wesley Vale","CONNECTION POINT RATING","MVA","Non-coincident",null,null,null,null,null,null,null,null,null,null,null,56,56,56,56,56,56,56]
[null,null,null,null,"Coincident",null,null,null,null,null,null,null,null,null,null,null,56,56,56,56,56,56,56]
[null,null,"WINTER/SUMMER PEAKING",null,"Non-coincident",null,null,null,null,null,null,null,null,null,null,null,"Winter","Winter","Winter","Winter","Winter","Winter","Winter"]
[null,null,null,null,"Coincident",null,null,null,null,null,null,null,null,null,null,null,"Winter","Winter","Winter","Winter","Winter","Winter","Winter"]
[null,null,"ADJUSTMENTS - EMBEDDED GENERATION","MW","Non-coincident"]
[null,null,null,null,"Coincident"]
[null,null,"WEATHER CORRECTED MD 10% POE","MW","Non-coincident",null,null,null,null,null,null,null,null,null,null,null,11.78951,11.86032,11.92723,11.99207,12.056179999999999,12.11895,12.18796]
[null,null,null,null,"Coincident",null,null,null,null,null,null,null,null,null,null,null,10.108315300448425,10.169027730941698,10.226396304932731,10.281990062780263,10.336957919282506,10.390776860986541,10.449945973094165]
[null,null,"WEATHER CORRECTED MD 10% POE","MVA","Non-coincident",null,null,null,null,null,null,null,null,null,null,null,11.789514741501993,11.860324769980339,11.927234796890184,11.992074822967519,12.056184848751261,12.118954873996083,12.187964901750508]
[null,null,null,null,"Coincident",null,null,null,null,null,null,null,null,null,null,null,10.108319365807981,10.169031820718564,10.226400417782074,10.281994197988288,10.336962076597489,10.390781039946413,10.449950175850654]
[null,null,"WEATHER CORRECTED MD 50% POE","MW","Non-coincident",null,null,null,null,null,null,null,null,null,null,null,11.48236,11.551069999999999,11.61595,11.67881,11.741,11.80198,11.86922]
[null,null,null,null,"Coincident",null,null,null,null,null,null,null,null,null,null,null,9.8449651659192767,9.9038770582959579,9.9595051121076175,10.013401219730937,10.066722869955152,10.119007067264569,10.176658582959636]
[null,null,"WEATHER CORRECTED MD 50% POE","MVA","Non-coincident",null,null,null,null,null,null,null,null,null,null,null,11.482364617972488,11.551074645606256,11.615954671699678,11.678814696980696,11.741004721992253,11.801984746517174,11.86922477355974]
[null,null,null,null,"Coincident",null,null,null,null,null,null,null,null,null,null,null,9.8449691253647451,9.9038810414345964,9.9595091176187314,10.013405246917973,10.066726918587076,10.119011136924136,10.176662675805474]
[null,"NSP to enter name","CONNECTION POINT RATING","MVA","Non-coincident"]
[null,null,null,null,"Coincident"]
[null,null,"WINTER/SUMMER PEAKING",null,"Non-coincident"]
[null,null,null,null,"Coincident"]
[null,null,"ADJUSTMENTS - EMBEDDED GENERATION","MW","Non-coincident"]
[null,null,null,null,"Coincident"]
[null,null,"WEATHER CORRECTED MD 10% POE","MW","Non-coincident"]
[null,null,null,null,"Coincident"]
[null,null,"WEATHER CORRECTED MD 10% POE","MVA","Non-coincident"]
[null,null,null,null,"Coincident"]
[null,null,"WEATHER CORRECTED MD 50% POE","MW","Non-coincident"]
[null,null,null,null,"Coincident"]
[null,null,"WEATHER CORRECTED MD 50% POE","MVA","Non-coincident"]
[null,null,null,null,"Coincident"]
[null,"NSP to enter name","CONNECTION POINT RATING","MVA","Non-coincident"]
[null,null,null,null,"Coincident"]
[null,null,"WINTER/SUMMER PEAKING",null,"Non-coincident"]
[null,null,null,null,"Coincident"]
[null,null,"ADJUSTMENTS - EMBEDDED GENERATION","MW","Non-coincident"]
[null,null,null,null,"Coincident"]
[null,null,"WEATHER CORRECTED MD 10% POE","MW","Non-coincident"]
[null,null,null,null,"Coincident"]
[null,null,"WEATHER CORRECTED MD 10% POE","MVA","Non-coincident"]
[null,null,null,null,"Coincident"]
[null,null,"WEATHER CORRECTED MD 50% POE","MW","Non-coincident"]
[null,null,null,null,"Coincident"]
[null,null,"WEATHER CORRECTED MD 50% POE","MVA","Non-coincident"]
[null,null,null,null,"Coincident"]
[null,"NSP to enter name","CONNECTION POINT RATING","MVA","Non-coincident"]
[null,null,null,null,"Coincident"]
[null,null,"WINTER/SUMMER PEAKING",null,"Non-coincident"]
[null,null,null,null,"Coincident"]
[null,null,"ADJUSTMENTS - EMBEDDED GENERATION","MW","Non-coincident"]
[null,null,null,null,"Coincident"]
[null,null,"WEATHER CORRECTED MD 10% POE","MW","Non-coincident"]
[null,null,null,null,"Coincident"]
[null,null,"WEATHER CORRECTED MD 10% POE","MVA","Non-coincident"]
[null,null,null,null,"Coincident"]
[null,null,"WEATHER CORRECTED MD 50% POE","MW","Non-coincident"]
[null,null,null,null,"Coincident"]
[null,null,"WEATHER CORRECTED MD 50% POE","MVA","Non-coincident"]
[null,null,null,null,"Coincident"]
[null,"NSP to enter name","CONNECTION POINT RATING","MVA","Non-coincident"]
[null,null,null,null,"Coincident"]
[null,null,"WINTER/SUMMER PEAKING",null,"Non-coincident"]
[null,null,null,null,"Coincident"]
[null,null,"ADJUSTMENTS - EMBEDDED GENERATION","MW","Non-coincident"]
[null,null,null,null,"Coincident"]
[null,null,"WEATHER CORRECTED MD 10% POE","MW","Non-coincident"]
[null,null,null,null,"Coincident"]
[null,null,"WEATHER CORRECTED MD 10% POE","MVA","Non-coincident"]
[null,null,null,null,"Coincident"]
[null,null,"WEATHER CORRECTED MD 50% POE","MW","Non-coincident"]
[null,null,null,null,"Coincident"]
[null,null,"WEATHER CORRECTED MD 50% POE","MVA","Non-coincident"]
[null,null,null,null,"Coincident"]
[null,"NSP to enter name","CONNECTION POINT RATING","MVA","Non-coincident"]
[null,null,null,null,"Coincident"]
[null,null,"WINTER/SUMMER PEAKING",null,"Non-coincident"]
[null,null,null,null,"Coincident"]
[null,null,"ADJUSTMENTS - EMBEDDED GENERATION","MW","Non-coincident"]
[null,null,null,null,"Coincident"]
[null,null,"WEATHER CORRECTED MD 10% POE","MW","Non-coincident"]
[null,null,null,null,"Coincident"]
[null,null,"WEATHER CORRECTED MD 10% POE","MVA","Non-coincident"]
[null,null,null,null,"Coincident"]
[null,null,"WEATHER CORRECTED MD 50% POE","MW","Non-coincident"]
[null,null,null,null,"Coincident"]
[null,null,"WEATHER CORRECTED MD 50% POE","MVA","Non-coincident"]
[null,null,null,null,"Coincident"]
[null,"NSP to enter name","CONNECTION POINT RATING","MVA","Non-coincident"]
[null,null,null,null,"Coincident"]
[null,null,"WINTER/SUMMER PEAKING",null,"Non-coincident"]
[null,null,null,null,"Coincident"]
[null,null,"ADJUSTMENTS - EMBEDDED GENERATION","MW","Non-coincident"]
[null,null,null,null,"Coincident"]
[null,null,"WEATHER CORRECTED MD 10% POE","MW","Non-coincident"]
[null,null,null,null,"Coincident"]
[null,null,"WEATHER CORRECTED MD 10% POE","MVA","Non-coincident"]
[null,null,null,null,"Coincident"]
[null,null,"WEATHER CORRECTED MD 50% POE","MW","Non-coincident"]
[null,null,null,null,"Coincident"]
[null,null,"WEATHER CORRECTED MD 50% POE","MVA","Non-coincident"]
[null,null,null,null,"Coincident"]
[null,"NSP to enter name","CONNECTION POINT RATING","MVA","Non-coincident"]
[null,null,null,null,"Coincident"]
[null,null,"WINTER/SUMMER PEAKING",null,"Non-coincident"]
[null,null,null,null,"Coincident"]
[null,null,"ADJUSTMENTS - EMBEDDED GENERATION","MW","Non-coincident"]
[null,null,null,null,"Coincident"]
[null,null,"WEATHER CORRECTED MD 10% POE","MW","Non-coincident"]
[null,null,null,null,"Coincident"]
[null,null,"WEATHER CORRECTED MD 10% POE","MVA","Non-coincident"]
[null,null,null,null,"Coincident"]
[null,null,"WEATHER CORRECTED MD 50% POE","MW","Non-coincident"]
[null,null,null,null,"Coincident"]
[null,null,"WEATHER CORRECTED MD 50% POE","MVA","Non-coincident"]
[null,null,null,null,"Coincident"]
[null,"NSP to enter name","CONNECTION POINT RATING","MVA","Non-coincident"]
[null,null,null,null,"Coincident"]
[null,null,"WINTER/SUMMER PEAKING",null,"Non-coincident"]
[null,null,null,null,"Coincident"]
[null,null,"ADJUSTMENTS - EMBEDDED GENERATION","MW","Non-coincident"]
[null,null,null,null,"Coincident"]
[null,null,"WEATHER CORRECTED MD 10% POE","MW","Non-coincident"]
[null,null,null,null,"Coincident"]
[null,null,"WEATHER CORRECTED MD 10% POE","MVA","Non-coincident"]
[null,null,null,null,"Coincident"]
[null,null,"WEATHER CORRECTED MD 50% POE","MW","Non-coincident"]
[null,null,null,null,"Coincident"]
[null,null,"WEATHER CORRECTED MD 50% POE","MVA","Non-coincident"]
[null,null,null,null,"Coincident"]
[null,"NSP to enter name","CONNECTION POINT RATING","MVA","Non-coincident"]
[null,null,null,null,"Coincident"]
[null,null,"WINTER/SUMMER PEAKING",null,"Non-coincident"]
[null,null,null,null,"Coincident"]
[null,null,"ADJUSTMENTS - EMBEDDED GENERATION","MW","Non-coincident"]
[null,null,null,null,"Coincident"]
[null,null,"WEATHER CORRECTED MD 10% POE","MW","Non-coincident"]
[null,null,null,null,"Coincident"]
[null,null,"WEATHER CORRECTED MD 10% POE","MVA","Non-coincident"]
[null,null,null,null,"Coincident"]
[null,null,"WEATHER CORRECTED MD 50% POE","MW","Non-coincident"]
[null,null,null,null,"Coincident"]
[null,null,"WEATHER CORRECTED MD 50% POE","MVA","Non-coincident"]
[null,null,null,null,"Coincident"]
[null,"NSP to enter name","CONNECTION POINT RATING","MVA","Non-coincident"]
[null,null,null,null,"Coincident"]
[null,null,"WINTER/SUMMER PEAKING",null,"Non-coincident"]
[null,null,null,null,"Coincident"]
[null,null,"ADJUSTMENTS - EMBEDDED GENERATION","MW","Non-coincident"]
[null,null,null,null,"Coincident"]
[null,null,"WEATHER CORRECTED MD 10% POE","MW","Non-coincident"]
[null,null,null,null,"Coincident"]
[null,null,"WEATHER CORRECTED MD 10% POE","MVA","Non-coincident"]
[null,null,null,null,"Coincident"]
[null,null,"WEATHER CORRECTED MD 50% POE","MW","Non-coincident"]
[null,null,null,null,"Coincident"]
[null,null,"WEATHER CORRECTED MD 50% POE","MVA","Non-coincident"]
[null,null,null,null,"Coincident"]
[null,"NSP to enter name","CONNECTION POINT RATING","MVA","Non-coincident"]
[null,null,null,null,"Coincident"]
[null,null,"WINTER/SUMMER PEAKING",null,"Non-coincident"]
[null,null,null,null,"Coincident"]
[null,null,"ADJUSTMENTS - EMBEDDED GENERATION","MW","Non-coincident"]
[null,null,null,null,"Coincident"]
[null,null,"WEATHER CORRECTED MD 10% POE","MW","Non-coincident"]
[null,null,null,null,"Coincident"]
[null,null,"WEATHER CORRECTED MD 10% POE","MVA","Non-coincident"]
[null,null,null,null,"Coincident"]
[null,null,"WEATHER CORRECTED MD 50% POE","MW","Non-coincident"]
[null,null,null,null,"Coincident"]
[null,null,"WEATHER CORRECTED MD 50% POE","MVA","Non-coincident"]
[null,null,null,null,"Coincident"]
[null,"NSP to enter name","CONNECTION POINT RATING","MVA","Non-coincident"]
[null,null,null,null,"Coincident"]
[null,null,"WINTER/SUMMER PEAKING",null,"Non-coincident"]
[null,null,null,null,"Coincident"]
[null,null,"ADJUSTMENTS - EMBEDDED GENERATION","MW","Non-coincident"]
[null,null,null,null,"Coincident"]
[null,null,"WEATHER CORRECTED MD 10% POE","MW","Non-coincident"]
[null,null,null,null,"Coincident"]
[null,null,"WEATHER CORRECTED MD 10% POE","MVA","Non-coincident"]
[null,null,null,null,"Coincident"]
[null,null,"WEATHER CORRECTED MD 50% POE","MW","Non-coincident"]
[null,null,null,null,"Coincident"]
[null,null,"WEATHER CORRECTED MD 50% POE","MVA","Non-coincident"]
[null,null,null,null,"Coincident"]
[null,"NSP to enter name","CONNECTION POINT RATING","MVA","Non-coincident"]
[null,null,null,null,"Coincident"]
[null,null,"WINTER/SUMMER PEAKING",null,"Non-coincident"]
[null,null,null,null,"Coincident"]
[null,null,"ADJUSTMENTS - EMBEDDED GENERATION","MW","Non-coincident"]
[null,null,null,null,"Coincident"]
[null,null,"WEATHER CORRECTED MD 10% POE","MW","Non-coincident"]
[null,null,null,null,"Coincident"]
[null,null,"WEATHER CORRECTED MD 10% POE","MVA","Non-coincident"]
[null,null,null,null,"Coincident"]
[null,null,"WEATHER CORRECTED MD 50% POE","MW","Non-coincident"]
[null,null,null,null,"Coincident"]
[null,null,"WEATHER CORRECTED MD 50% POE","MVA","Non-coincident"]
[null,null,null,null,"Coincident"]
[null,"NSP to enter name","CONNECTION POINT RATING","MVA","Non-coincident"]
[null,null,null,null,"Coincident"]
[null,null,"WINTER/SUMMER PEAKING",null,"Non-coincident"]
[null,null,null,null,"Coincident"]
[null,null,"ADJUSTMENTS - EMBEDDED GENERATION","MW","Non-coincident"]
[null,null,null,null,"Coincident"]
[null,null,"WEATHER CORRECTED MD 10% POE","MW","Non-coincident"]
[null,null,null,null,"Coincident"]
[null,null,"WEATHER CORRECTED MD 10% POE","MVA","Non-coincident"]
[null,null,null,null,"Coincident"]
[null,null,"WEATHER CORRECTED MD 50% POE","MW","Non-coincident"]
[null,null,null,null,"Coincident"]
[null,null,"WEATHER CORRECTED MD 50% POE","MVA","Non-coincident"]
[null,null,null,null,"Coincident"]
[null,"NSP to enter name","CONNECTION POINT RATING","MVA","Non-coincident"]
[null,null,null,null,"Coincident"]
[null,null,"WINTER/SUMMER PEAKING",null,"Non-coincident"]
[null,null,null,null,"Coincident"]
[null,null,"ADJUSTMENTS - EMBEDDED GENERATION","MW","Non-coincident"]
[null,null,null,null,"Coincident"]
[null,null,"WEATHER CORRECTED MD 10% POE","MW","Non-coincident"]
[null,null,null,null,"Coincident"]
[null,null,"WEATHER CORRECTED MD 10% POE","MVA","Non-coincident"]
[null,null,null,null,"Coincident"]
[null,null,"WEATHER CORRECTED MD 50% POE","MW","Non-coincident"]
[null,null,null,null,"Coincident"]
[null,null,"WEATHER CORRECTED MD 50% POE","MVA","Non-coincident"]
[null,null,null,null,"Coincident"]
[null,"NSP to enter name","CONNECTION POINT RATING","MVA","Non-coincident"]
[null,null,null,null,"Coincident"]
[null,null,"WINTER/SUMMER PEAKING",null,"Non-coincident"]
[null,null,null,null,"Coincident"]
[null,null,"ADJUSTMENTS - EMBEDDED GENERATION","MW","Non-coincident"]
[null,null,null,null,"Coincident"]
[null,null,"WEATHER CORRECTED MD 10% POE","MW","Non-coincident"]
[null,null,null,null,"Coincident"]
[null,null,"WEATHER CORRECTED MD 10% POE","MVA","Non-coincident"]
[null,null,null,null,"Coincident"]
[null,null,"WEATHER CORRECTED MD 50% POE","MW","Non-coincident"]
[null,null,null,null,"Coincident"]
[null,null,"WEATHER CORRECTED MD 50% POE","MVA","Non-coincident"]
[null,null,null,null,"Coincident"]
[null,"NSP to enter name","CONNECTION POINT RATING","MVA","Non-coincident"]
[null,null,null,null,"Coincident"]
[null,null,"WINTER/SUMMER PEAKING",null,"Non-coincident"]
[null,null,null,null,"Coincident"]
[null,null,"ADJUSTMENTS - EMBEDDED GENERATION","MW","Non-coincident"]
[null,null,null,null,"Coincident"]
[null,null,"WEATHER CORRECTED MD 10% POE","MW","Non-coincident"]
[null,null,null,null,"Coincident"]
[null,null,"WEATHER CORRECTED MD 10% POE","MVA","Non-coincident"]
[null,null,null,null,"Coincident"]
[null,null,"WEATHER CORRECTED MD 50% POE","MW","Non-coincident"]
[null,null,null,null,"Coincident"]
[null,null,"WEATHER CORRECTED MD 50% POE","MVA","Non-coincident"]
[null,null,null,null,"Coincident"]
[null,"NSP to enter name","CONNECTION POINT RATING","MVA","Non-coincident"]
[null,null,null,null,"Coincident"]
[null,null,"WINTER/SUMMER PEAKING",null,"Non-coincident"]
[null,null,null,null,"Coincident"]
[null,null,"ADJUSTMENTS - EMBEDDED GENERATION","MW","Non-coincident"]
[null,null,null,null,"Coincident"]
[null,null,"WEATHER CORRECTED MD 10% POE","MW","Non-coincident"]
[null,null,null,null,"Coincident"]
[null,null,"WEATHER CORRECTED MD 10% POE","MVA","Non-coincident"]
[null,null,null,null,"Coincident"]
[null,null,"WEATHER CORRECTED MD 50% POE","MW","Non-coincident"]
[null,null,null,null,"Coincident"]
[null,null,"WEATHER CORRECTED MD 50% POE","MVA","Non-coincident"]
[null,null,null,null,"Coincident"]
[null,"NSP to enter name","CONNECTION POINT RATING","MVA","Non-coincident"]
[null,null,null,null,"Coincident"]
[null,null,"WINTER/SUMMER PEAKING",null,"Non-coincident"]
[null,null,null,null,"Coincident"]
[null,null,"ADJUSTMENTS - EMBEDDED GENERATION","MW","Non-coincident"]
[null,null,null,null,"Coincident"]
[null,null,"WEATHER CORRECTED MD 10% POE","MW","Non-coincident"]
[null,null,null,null,"Coincident"]
[null,null,"WEATHER CORRECTED MD 10% POE","MVA","Non-coincident"]
[null,null,null,null,"Coincident"]
[null,null,"WEATHER CORRECTED MD 50% POE","MW","Non-coincident"]
[null,null,null,null,"Coincident"]
[null,null,"WEATHER CORRECTED MD 50% POE","MVA","Non-coincident"]
[null,null,null,null,"Coincident"]
[null,"NSP to enter name","CONNECTION POINT RATING","MVA","Non-coincident"]
[null,null,null,null,"Coincident"]
[null,null,"WINTER/SUMMER PEAKING",null,"Non-coincident"]
[null,null,null,null,"Coincident"]
[null,null,"ADJUSTMENTS - EMBEDDED GENERATION","MW","Non-coincident"]
[null,null,null,null,"Coincident"]
[null,null,"WEATHER CORRECTED MD 10% POE","MW","Non-coincident"]
[null,null,null,null,"Coincident"]
[null,null,"WEATHER CORRECTED MD 10% POE","MVA","Non-coincident"]
[null,null,null,null,"Coincident"]
[null,null,"WEATHER CORRECTED MD 50% POE","MW","Non-coincident"]
[null,null,null,null,"Coincident"]
[null,null,"WEATHER CORRECTED MD 50% POE","MVA","Non-coincident"]
[null,null,null,null,"Coincident"]
[null,"NSP to enter name","CONNECTION POINT RATING","MVA","Non-coincident"]
[null,null,null,null,"Coincident"]
[null,null,"WINTER/SUMMER PEAKING",null,"Non-coincident"]
[null,null,null,null,"Coincident"]
[null,null,"ADJUSTMENTS - EMBEDDED GENERATION","MW","Non-coincident"]
[null,null,null,null,"Coincident"]
[null,null,"WEATHER CORRECTED MD 10% POE","MW","Non-coincident"]
[null,null,null,null,"Coincident"]
[null,null,"WEATHER CORRECTED MD 10% POE","MVA","Non-coincident"]
[null,null,null,null,"Coincident"]
[null,null,"WEATHER CORRECTED MD 50% POE","MW","Non-coincident"]
[null,null,null,null,"Coincident"]
[null,null,"WEATHER CORRECTED MD 50% POE","MVA","Non-coincident"]
[null,null,null,null,"Coincident"]
[null,"NSP to enter name","CONNECTION POINT RATING","MVA","Non-coincident"]
[null,null,null,null,"Coincident"]
[null,null,"WINTER/SUMMER PEAKING",null,"Non-coincident"]
[null,null,null,null,"Coincident"]
[null,null,"ADJUSTMENTS - EMBEDDED GENERATION","MW","Non-coincident"]
[null,null,null,null,"Coincident"]
[null,null,"WEATHER CORRECTED MD 10% POE","MW","Non-coincident"]
[null,null,null,null,"Coincident"]
[null,null,"WEATHER CORRECTED MD 10% POE","MVA","Non-coincident"]
[null,null,null,null,"Coincident"]
[null,null,"WEATHER CORRECTED MD 50% POE","MW","Non-coincident"]
[null,null,null,null,"Coincident"]
[null,null,"WEATHER CORRECTED MD 50% POE","MVA","Non-coincident"]
[null,null,null,null,"Coincident"]
[null,"NSP to enter name","CONNECTION POINT RATING","MVA","Non-coincident"]
[null,null,null,null,"Coincident"]
[null,null,"WINTER/SUMMER PEAKING",null,"Non-coincident"]
[null,null,null,null,"Coincident"]
[null,null,"ADJUSTMENTS - EMBEDDED GENERATION","MW","Non-coincident"]
[null,null,null,null,"Coincident"]
[null,null,"WEATHER CORRECTED MD 10% POE","MW","Non-coincident"]
[null,null,null,null,"Coincident"]
[null,null,"WEATHER CORRECTED MD 10% POE","MVA","Non-coincident"]
[null,null,null,null,"Coincident"]
[null,null,"WEATHER CORRECTED MD 50% POE","MW","Non-coincident"]
[null,null,null,null,"Coincident"]
[null,null,"WEATHER CORRECTED MD 50% POE","MVA","Non-coincident"]
[null,null,null,null,"Coincident"]
[null,"NSP to enter name","CONNECTION POINT RATING","MVA","Non-coincident"]
[null,null,null,null,"Coincident"]
[null,null,"WINTER/SUMMER PEAKING",null,"Non-coincident"]
[null,null,null,null,"Coincident"]
[null,null,"ADJUSTMENTS - EMBEDDED GENERATION","MW","Non-coincident"]
[null,null,null,null,"Coincident"]
[null,null,"WEATHER CORRECTED MD 10% POE","MW","Non-coincident"]
[null,null,null,null,"Coincident"]
[null,null,"WEATHER CORRECTED MD 10% POE","MVA","Non-coincident"]
[null,null,null,null,"Coincident"]
[null,null,"WEATHER CORRECTED MD 50% POE","MW","Non-coincident"]
[null,null,null,null,"Coincident"]
[null,null,"WEATHER CORRECTED MD 50% POE","MVA","Non-coincident"]
[null,null,null,null,"Coincident"]
[null,"NSP to enter name","CONNECTION POINT RATING","MVA","Non-coincident"]
[null,null,null,null,"Coincident"]
[null,null,"WINTER/SUMMER PEAKING",null,"Non-coincident"]
[null,null,null,null,"Coincident"]
[null,null,"ADJUSTMENTS - EMBEDDED GENERATION","MW","Non-coincident"]
[null,null,null,null,"Coincident"]
[null,null,"WEATHER CORRECTED MD 10% POE","MW","Non-coincident"]
[null,null,null,null,"Coincident"]
[null,null,"WEATHER CORRECTED MD 10% POE","MVA","Non-coincident"]
[null,null,null,null,"Coincident"]
[null,null,"WEATHER CORRECTED MD 50% POE","MW","Non-coincident"]
[null,null,null,null,"Coincident"]
[null,null,"WEATHER CORRECTED MD 50% POE","MVA","Non-coincident"]
[null,null,null,null,"Coincident"]
[null,"NSP to enter name","CONNECTION POINT RATING","MVA","Non-coincident"]
[null,null,null,null,"Coincident"]
[null,null,"WINTER/SUMMER PEAKING",null,"Non-coincident"]
[null,null,null,null,"Coincident"]
[null,null,"ADJUSTMENTS - EMBEDDED GENERATION","MW","Non-coincident"]
[null,null,null,null,"Coincident"]
[null,null,"WEATHER CORRECTED MD 10% POE","MW","Non-coincident"]
[null,null,null,null,"Coincident"]
[null,null,"WEATHER CORRECTED MD 10% POE","MVA","Non-coincident"]
[null,null,null,null,"Coincident"]
[null,null,"WEATHER CORRECTED MD 50% POE","MW","Non-coincident"]
[null,null,null,null,"Coincident"]
[null,null,"WEATHER CORRECTED MD 50% POE","MVA","Non-coincident"]
[null,null,null,null,"Coincident"]
[null,"NSP to enter name","CONNECTION POINT RATING","MVA","Non-coincident"]
[null,null,null,null,"Coincident"]
[null,null,"WINTER/SUMMER PEAKING",null,"Non-coincident"]
[null,null,null,null,"Coincident"]
[null,null,"ADJUSTMENTS - EMBEDDED GENERATION","MW","Non-coincident"]
[null,null,null,null,"Coincident"]
[null,null,"WEATHER CORRECTED MD 10% POE","MW","Non-coincident"]
[null,null,null,null,"Coincident"]
[null,null,"WEATHER CORRECTED MD 10% POE","MVA","Non-coincident"]
[null,null,null,null,"Coincident"]
[null,null,"WEATHER CORRECTED MD 50% POE","MW","Non-coincident"]
[null,null,null,null,"Coincident"]
[null,null,"WEATHER CORRECTED MD 50% POE","MVA","Non-coincident"]
[null,null,null,null,"Coincident"]
[null,"NSP to enter name","CONNECTION POINT RATING","MVA","Non-coincident"]
[null,null,null,null,"Coincident"]
[null,null,"WINTER/SUMMER PEAKING",null,"Non-coincident"]
[null,null,null,null,"Coincident"]
[null,null,"ADJUSTMENTS - EMBEDDED GENERATION","MW","Non-coincident"]
[null,null,null,null,"Coincident"]
[null,null,"WEATHER CORRECTED MD 10% POE","MW","Non-coincident"]
[null,null,null,null,"Coincident"]
[null,null,"WEATHER CORRECTED MD 10% POE","MVA","Non-coincident"]
[null,null,null,null,"Coincident"]
[null,null,"WEATHER CORRECTED MD 50% POE","MW","Non-coincident"]
[null,null,null,null,"Coincident"]
[null,null,"WEATHER CORRECTED MD 50% POE","MVA","Non-coincident"]
[null,null,null,null,"Coincident"]
[null,"NSP to enter name","CONNECTION POINT RATING","MVA","Non-coincident"]
[null,null,null,null,"Coincident"]
[null,null,"WINTER/SUMMER PEAKING",null,"Non-coincident"]
[null,null,null,null,"Coincident"]
[null,null,"ADJUSTMENTS - EMBEDDED GENERATION","MW","Non-coincident"]
[null,null,null,null,"Coincident"]
[null,null,"WEATHER CORRECTED MD 10% POE","MW","Non-coincident"]
[null,null,null,null,"Coincident"]
[null,null,"WEATHER CORRECTED MD 10% POE","MVA","Non-coincident"]
[null,null,null,null,"Coincident"]
[null,null,"WEATHER CORRECTED MD 50% POE","MW","Non-coincident"]
[null,null,null,null,"Coincident"]
[null,null,"WEATHER CORRECTED MD 50% POE","MVA","Non-coincident"]
[null,null,null,null,"Coincident"]
[null,"NSP to enter name","CONNECTION POINT RATING","MVA","Non-coincident"]
[null,null,null,null,"Coincident"]
[null,null,"WINTER/SUMMER PEAKING",null,"Non-coincident"]
[null,null,null,null,"Coincident"]
[null,null,"ADJUSTMENTS - EMBEDDED GENERATION","MW","Non-coincident"]
[null,null,null,null,"Coincident"]
[null,null,"WEATHER CORRECTED MD 10% POE","MW","Non-coincident"]
[null,null,null,null,"Coincident"]
[null,null,"WEATHER CORRECTED MD 10% POE","MVA","Non-coincident"]
[null,null,null,null,"Coincident"]
[null,null,"WEATHER CORRECTED MD 50% POE","MW","Non-coincident"]
[null,null,null,null,"Coincident"]
[null,null,"WEATHER CORRECTED MD 50% POE","MVA","Non-coincident"]
[null,null,null,null,"Coincident"]
[null,"NSP to enter name","CONNECTION POINT RATING","MVA","Non-coincident"]
[null,null,null,null,"Coincident"]
[null,null,"WINTER/SUMMER PEAKING",null,"Non-coincident"]
[null,null,null,null,"Coincident"]
[null,null,"ADJUSTMENTS - EMBEDDED GENERATION","MW","Non-coincident"]
[null,null,null,null,"Coincident"]
[null,null,"WEATHER CORRECTED MD 10% POE","MW","Non-coincident"]
[null,null,null,null,"Coincident"]
[null,null,"WEATHER CORRECTED MD 10% POE","MVA","Non-coincident"]
[null,null,null,null,"Coincident"]
[null,null,"WEATHER CORRECTED MD 50% POE","MW","Non-coincident"]
[null,null,null,null,"Coincident"]
[null,null,"WEATHER CORRECTED MD 50% POE","MVA","Non-coincident"]
[null,null,null,null,"Coincident"]
[null,"NSP to enter name","CONNECTION POINT RATING","MVA","Non-coincident"]
[null,null,null,null,"Coincident"]
[null,null,"WINTER/SUMMER PEAKING",null,"Non-coincident"]
[null,null,null,null,"Coincident"]
[null,null,"ADJUSTMENTS - EMBEDDED GENERATION","MW","Non-coincident"]
[null,null,null,null,"Coincident"]
[null,null,"WEATHER CORRECTED MD 10% POE","MW","Non-coincident"]
[null,null,null,null,"Coincident"]
[null,null,"WEATHER CORRECTED MD 10% POE","MVA","Non-coincident"]
[null,null,null,null,"Coincident"]
[null,null,"WEATHER CORRECTED MD 50% POE","MW","Non-coincident"]
[null,null,null,null,"Coincident"]
[null,null,"WEATHER CORRECTED MD 50% POE","MVA","Non-coincident"]
[null,null,null,null,"Coincident"]
[null,"NSP to enter name","CONNECTION POINT RATING","MVA","Non-coincident"]
[null,null,null,null,"Coincident"]
[null,null,"WINTER/SUMMER PEAKING",null,"Non-coincident"]
[null,null,null,null,"Coincident"]
[null,null,"ADJUSTMENTS - EMBEDDED GENERATION","MW","Non-coincident"]
[null,null,null,null,"Coincident"]
[null,null,"WEATHER CORRECTED MD 10% POE","MW","Non-coincident"]
[null,null,null,null,"Coincident"]
[null,null,"WEATHER CORRECTED MD 10% POE","MVA","Non-coincident"]
[null,null,null,null,"Coincident"]
[null,null,"WEATHER CORRECTED MD 50% POE","MW","Non-coincident"]
[null,null,null,null,"Coincident"]
[null,null,"WEATHER CORRECTED MD 50% POE","MVA","Non-coincident"]
[null,null,null,null,"Coincident"]
[null,"NSP to enter name","CONNECTION POINT RATING","MVA","Non-coincident"]
[null,null,null,null,"Coincident"]
[null,null,"WINTER/SUMMER PEAKING",null,"Non-coincident"]
[null,null,null,null,"Coincident"]
[null,null,"ADJUSTMENTS - EMBEDDED GENERATION","MW","Non-coincident"]
[null,null,null,null,"Coincident"]
[null,null,"WEATHER CORRECTED MD 10% POE","MW","Non-coincident"]
[null,null,null,null,"Coincident"]
[null,null,"WEATHER CORRECTED MD 10% POE","MVA","Non-coincident"]
[null,null,null,null,"Coincident"]
[null,null,"WEATHER CORRECTED MD 50% POE","MW","Non-coincident"]
[null,null,null,null,"Coincident"]
[null,null,"WEATHER CORRECTED MD 50% POE","MVA","Non-coincident"]
[null,null,null,null,"Coincident"]
[null,"NSP to enter name","CONNECTION POINT RATING","MVA","Non-coincident"]
[null,null,null,null,"Coincident"]
[null,null,"WINTER/SUMMER PEAKING",null,"Non-coincident"]
[null,null,null,null,"Coincident"]
[null,null,"ADJUSTMENTS - EMBEDDED GENERATION","MW","Non-coincident"]
[null,null,null,null,"Coincident"]
[null,null,"WEATHER CORRECTED MD 10% POE","MW","Non-coincident"]
[null,null,null,null,"Coincident"]
[null,null,"WEATHER CORRECTED MD 10% POE","MVA","Non-coincident"]
[null,null,null,null,"Coincident"]
[null,null,"WEATHER CORRECTED MD 50% POE","MW","Non-coincident"]
[null,null,null,null,"Coincident"]
[null,null,"WEATHER CORRECTED MD 50% POE","MVA","Non-coincident"]
[null,null,null,null,"Coincident"]
[null,"NSP to enter name","CONNECTION POINT RATING","MVA","Non-coincident"]
[null,null,null,null,"Coincident"]
[null,null,"WINTER/SUMMER PEAKING",null,"Non-coincident"]
[null,null,null,null,"Coincident"]
[null,null,"ADJUSTMENTS - EMBEDDED GENERATION","MW","Non-coincident"]
[null,null,null,null,"Coincident"]
[null,null,"WEATHER CORRECTED MD 10% POE","MW","Non-coincident"]
[null,null,null,null,"Coincident"]
[null,null,"WEATHER CORRECTED MD 10% POE","MVA","Non-coincident"]
[null,null,null,null,"Coincident"]
[null,null,"WEATHER CORRECTED MD 50% POE","MW","Non-coincident"]
[null,null,null,null,"Coincident"]
[null,null,"WEATHER CORRECTED MD 50% POE","MVA","Non-coincident"]
[null,null,null,null,"Coincident"]
[null,"NSP to enter name","CONNECTION POINT RATING","MVA","Non-coincident"]
[null,null,null,null,"Coincident"]
[null,null,"WINTER/SUMMER PEAKING",null,"Non-coincident"]
[null,null,null,null,"Coincident"]
[null,null,"ADJUSTMENTS - EMBEDDED GENERATION","MW","Non-coincident"]
[null,null,null,null,"Coincident"]
[null,null,"WEATHER CORRECTED MD 10% POE","MW","Non-coincident"]
[null,null,null,null,"Coincident"]
[null,null,"WEATHER CORRECTED MD 10% POE","MVA","Non-coincident"]
[null,null,null,null,"Coincident"]
[null,null,"WEATHER CORRECTED MD 50% POE","MW","Non-coincident"]
[null,null,null,null,"Coincident"]
[null,null,"WEATHER CORRECTED MD 50% POE","MVA","Non-coincident"]
[null,null,null,null,"Coincident"]
[null,"NSP to enter name","CONNECTION POINT RATING","MVA","Non-coincident"]
[null,null,null,null,"Coincident"]
[null,null,"WINTER/SUMMER PEAKING",null,"Non-coincident"]
[null,null,null,null,"Coincident"]
[null,null,"ADJUSTMENTS - EMBEDDED GENERATION","MW","Non-coincident"]
[null,null,null,null,"Coincident"]
[null,null,"WEATHER CORRECTED MD 10% POE","MW","Non-coincident"]
[null,null,null,null,"Coincident"]
[null,null,"WEATHER CORRECTED MD 10% POE","MVA","Non-coincident"]
[null,null,null,null,"Coincident"]
[null,null,"WEATHER CORRECTED MD 50% POE","MW","Non-coincident"]
[null,null,null,null,"Coincident"]
[null,null,"WEATHER CORRECTED MD 50% POE","MVA","Non-coincident"]
[null,null,null,null,"Coincident"]
[null,"NSP to enter name","CONNECTION POINT RATING","MVA","Non-coincident"]
[null,null,null,null,"Coincident"]
[null,null,"WINTER/SUMMER PEAKING",null,"Non-coincident"]
[null,null,null,null,"Coincident"]
[null,null,"ADJUSTMENTS - EMBEDDED GENERATION","MW","Non-coincident"]
[null,null,null,null,"Coincident"]
[null,null,"WEATHER CORRECTED MD 10% POE","MW","Non-coincident"]
[null,null,null,null,"Coincident"]
[null,null,"WEATHER CORRECTED MD 10% POE","MVA","Non-coincident"]
[null,null,null,null,"Coincident"]
[null,null,"WEATHER CORRECTED MD 50% POE","MW","Non-coincident"]
[null,null,null,null,"Coincident"]
[null,null,"WEATHER CORRECTED MD 50% POE","MVA","Non-coincident"]
[null,null,null,null,"Coincident"]
[null,"NSP to enter name","CONNECTION POINT RATING","MVA","Non-coincident"]
[null,null,null,null,"Coincident"]
[null,null,"WINTER/SUMMER PEAKING",null,"Non-coincident"]
[null,null,null,null,"Coincident"]
[null,null,"ADJUSTMENTS - EMBEDDED GENERATION","MW","Non-coincident"]
[null,null,null,null,"Coincident"]
[null,null,"WEATHER CORRECTED MD 10% POE","MW","Non-coincident"]
[null,null,null,null,"Coincident"]
[null,null,"WEATHER CORRECTED MD 10% POE","MVA","Non-coincident"]
[null,null,null,null,"Coincident"]
[null,null,"WEATHER CORRECTED MD 50% POE","MW","Non-coincident"]
[null,null,null,null,"Coincident"]
[null,null,"WEATHER CORRECTED MD 50% POE","MVA","Non-coincident"]
[null,null,null,null,"Coincident"]
[null,"NSP to enter name","CONNECTION POINT RATING","MVA","Non-coincident"]
[null,null,null,null,"Coincident"]
[null,null,"WINTER/SUMMER PEAKING",null,"Non-coincident"]
[null,null,null,null,"Coincident"]
[null,null,"ADJUSTMENTS - EMBEDDED GENERATION","MW","Non-coincident"]
[null,null,null,null,"Coincident"]
[null,null,"WEATHER CORRECTED MD 10% POE","MW","Non-coincident"]
[null,null,null,null,"Coincident"]
[null,null,"WEATHER CORRECTED MD 10% POE","MVA","Non-coincident"]
[null,null,null,null,"Coincident"]
[null,null,"WEATHER CORRECTED MD 50% POE","MW","Non-coincident"]
[null,null,null,null,"Coincident"]
[null,null,"WEATHER CORRECTED MD 50% POE","MVA","Non-coincident"]
[null,null,null,null,"Coincident"]
[null,"NSP to enter name","CONNECTION POINT RATING","MVA","Non-coincident"]
[null,null,null,null,"Coincident"]
[null,null,"WINTER/SUMMER PEAKING",null,"Non-coincident"]
[null,null,null,null,"Coincident"]
[null,null,"ADJUSTMENTS - EMBEDDED GENERATION","MW","Non-coincident"]
[null,null,null,null,"Coincident"]
[null,null,"WEATHER CORRECTED MD 10% POE","MW","Non-coincident"]
[null,null,null,null,"Coincident"]
[null,null,"WEATHER CORRECTED MD 10% POE","MVA","Non-coincident"]
[null,null,null,null,"Coincident"]
[null,null,"WEATHER CORRECTED MD 50% POE","MW","Non-coincident"]
[null,null,null,null,"Coincident"]
[null,null,"WEATHER CORRECTED MD 50% POE","MVA","Non-coincident"]
[null,null,null,null,"Coincident"]
[null,"NSP to enter name","CONNECTION POINT RATING","MVA","Non-coincident"]
[null,null,null,null,"Coincident"]
[null,null,"WINTER/SUMMER PEAKING",null,"Non-coincident"]
[null,null,null,null,"Coincident"]
[null,null,"ADJUSTMENTS - EMBEDDED GENERATION","MW","Non-coincident"]
[null,null,null,null,"Coincident"]
[null,null,"WEATHER CORRECTED MD 10% POE","MW","Non-coincident"]
[null,null,null,null,"Coincident"]
[null,null,"WEATHER CORRECTED MD 10% POE","MVA","Non-coincident"]
[null,null,null,null,"Coincident"]
[null,null,"WEATHER CORRECTED MD 50% POE","MW","Non-coincident"]
[null,null,null,null,"Coincident"]
[null,null,"WEATHER CORRECTED MD 50% POE","MVA","Non-coincident"]
[null,null,null,null,"Coincident"]
[null,"NSP to enter name","CONNECTION POINT RATING","MVA","Non-coincident"]
[null,null,null,null,"Coincident"]
[null,null,"WINTER/SUMMER PEAKING",null,"Non-coincident"]
[null,null,null,null,"Coincident"]
[null,null,"ADJUSTMENTS - EMBEDDED GENERATION","MW","Non-coincident"]
[null,null,null,null,"Coincident"]
[null,null,"WEATHER CORRECTED MD 10% POE","MW","Non-coincident"]
[null,null,null,null,"Coincident"]
[null,null,"WEATHER CORRECTED MD 10% POE","MVA","Non-coincident"]
[null,null,null,null,"Coincident"]
[null,null,"WEATHER CORRECTED MD 50% POE","MW","Non-coincident"]
[null,null,null,null,"Coincident"]
[null,null,"WEATHER CORRECTED MD 50% POE","MVA","Non-coincident"]
[null,null,null,null,"Coincident"]
[null,"NSP to enter name","CONNECTION POINT RATING","MVA","Non-coincident"]
[null,null,null,null,"Coincident"]
[null,null,"WINTER/SUMMER PEAKING",null,"Non-coincident"]
[null,null,null,null,"Coincident"]
[null,null,"ADJUSTMENTS - EMBEDDED GENERATION","MW","Non-coincident"]
[null,null,null,null,"Coincident"]
[null,null,"WEATHER CORRECTED MD 10% POE","MW","Non-coincident"]
[null,null,null,null,"Coincident"]
[null,null,"WEATHER CORRECTED MD 10% POE","MVA","Non-coincident"]
[null,null,null,null,"Coincident"]
[null,null,"WEATHER CORRECTED MD 50% POE","MW","Non-coincident"]
[null,null,null,null,"Coincident"]
[null,null,"WEATHER CORRECTED MD 50% POE","MVA","Non-coincident"]
[null,null,null,null,"Coincident"]
[null,"NSP to enter name","CONNECTION POINT RATING","MVA","Non-coincident"]
[null,null,null,null,"Coincident"]
[null,null,"WINTER/SUMMER PEAKING",null,"Non-coincident"]
[null,null,null,null,"Coincident"]
[null,null,"ADJUSTMENTS - EMBEDDED GENERATION","MW","Non-coincident"]
[null,null,null,null,"Coincident"]
[null,null,"WEATHER CORRECTED MD 10% POE","MW","Non-coincident"]
[null,null,null,null,"Coincident"]
[null,null,"WEATHER CORRECTED MD 10% POE","MVA","Non-coincident"]
[null,null,null,null,"Coincident"]
[null,null,"WEATHER CORRECTED MD 50% POE","MW","Non-coincident"]
[null,null,null,null,"Coincident"]
[null,null,"WEATHER CORRECTED MD 50% POE","MVA","Non-coincident"]
[null,null,null,null,"Coincident"]
[null,"NSP to enter name","CONNECTION POINT RATING","MVA","Non-coincident"]
[null,null,null,null,"Coincident"]
[null,null,"WINTER/SUMMER PEAKING",null,"Non-coincident"]
[null,null,null,null,"Coincident"]
[null,null,"ADJUSTMENTS - EMBEDDED GENERATION","MW","Non-coincident"]
[null,null,null,null,"Coincident"]
[null,null,"WEATHER CORRECTED MD 10% POE","MW","Non-coincident"]
[null,null,null,null,"Coincident"]
[null,null,"WEATHER CORRECTED MD 10% POE","MVA","Non-coincident"]
[null,null,null,null,"Coincident"]
[null,null,"WEATHER CORRECTED MD 50% POE","MW","Non-coincident"]
[null,null,null,null,"Coincident"]
[null,null,"WEATHER CORRECTED MD 50% POE","MVA","Non-coincident"]
[null,null,null,null,"Coincident"]
[null,"NSP to enter name","CONNECTION POINT RATING","MVA","Non-coincident"]
[null,null,null,null,"Coincident"]
[null,null,"WINTER/SUMMER PEAKING",null,"Non-coincident"]
[null,null,null,null,"Coincident"]
[null,null,"ADJUSTMENTS - EMBEDDED GENERATION","MW","Non-coincident"]
[null,null,null,null,"Coincident"]
[null,null,"WEATHER CORRECTED MD 10% POE","MW","Non-coincident"]
[null,null,null,null,"Coincident"]
[null,null,"WEATHER CORRECTED MD 10% POE","MVA","Non-coincident"]
[null,null,null,null,"Coincident"]
[null,null,"WEATHER CORRECTED MD 50% POE","MW","Non-coincident"]
[null,null,null,null,"Coincident"]
[null,null,"WEATHER CORRECTED MD 50% POE","MVA","Non-coincident"]
[null,null,null,null,"Coincident"]
[null,"NSP to enter name","CONNECTION POINT RATING","MVA","Non-coincident"]
[null,null,null,null,"Coincident"]
[null,null,"WINTER/SUMMER PEAKING",null,"Non-coincident"]
[null,null,null,null,"Coincident"]
[null,null,"ADJUSTMENTS - EMBEDDED GENERATION","MW","Non-coincident"]
[null,null,null,null,"Coincident"]
[null,null,"WEATHER CORRECTED MD 10% POE","MW","Non-coincident"]
[null,null,null,null,"Coincident"]
[null,null,"WEATHER CORRECTED MD 10% POE","MVA","Non-coincident"]
[null,null,null,null,"Coincident"]
[null,null,"WEATHER CORRECTED MD 50% POE","MW","Non-coincident"]
[null,null,null,null,"Coincident"]
[null,null,"WEATHER CORRECTED MD 50% POE","MVA","Non-coincident"]
[null,null,null,null,"Coincident"]
[null,"NSP to enter name","CONNECTION POINT RATING","MVA","Non-coincident"]
[null,null,null,null,"Coincident"]
[null,null,"WINTER/SUMMER PEAKING",null,"Non-coincident"]
[null,null,null,null,"Coincident"]
[null,null,"ADJUSTMENTS - EMBEDDED GENERATION","MW","Non-coincident"]
[null,null,null,null,"Coincident"]
[null,null,"WEATHER CORRECTED MD 10% POE","MW","Non-coincident"]
[null,null,null,null,"Coincident"]
[null,null,"WEATHER CORRECTED MD 10% POE","MVA","Non-coincident"]
[null,null,null,null,"Coincident"]
[null,null,"WEATHER CORRECTED MD 50% POE","MW","Non-coincident"]
[null,null,null,null,"Coincident"]
[null,null,"WEATHER CORRECTED MD 50% POE","MVA","Non-coincident"]
[null,null,null,null,"Coincident"]
[null,"NSP to enter name","CONNECTION POINT RATING","MVA","Non-coincident"]
[null,null,null,null,"Coincident"]
[null,null,"WINTER/SUMMER PEAKING",null,"Non-coincident"]
[null,null,null,null,"Coincident"]
[null,null,"ADJUSTMENTS - EMBEDDED GENERATION","MW","Non-coincident"]
[null,null,null,null,"Coincident"]
[null,null,"WEATHER CORRECTED MD 10% POE","MW","Non-coincident"]
[null,null,null,null,"Coincident"]
[null,null,"WEATHER CORRECTED MD 10% POE","MVA","Non-coincident"]
[null,null,null,null,"Coincident"]
[null,null,"WEATHER CORRECTED MD 50% POE","MW","Non-coincident"]
[null,null,null,null,"Coincident"]
[null,null,"WEATHER CORRECTED MD 50% POE","MVA","Non-coincident"]
[null,null,null,null,"Coincident"]
[null,"NSP to enter name","CONNECTION POINT RATING","MVA","Non-coincident"]
[null,null,null,null,"Coincident"]
[null,null,"WINTER/SUMMER PEAKING",null,"Non-coincident"]
[null,null,null,null,"Coincident"]
[null,null,"ADJUSTMENTS - EMBEDDED GENERATION","MW","Non-coincident"]
[null,null,null,null,"Coincident"]
[null,null,"WEATHER CORRECTED MD 10% POE","MW","Non-coincident"]
[null,null,null,null,"Coincident"]
[null,null,"WEATHER CORRECTED MD 10% POE","MVA","Non-coincident"]
[null,null,null,null,"Coincident"]
[null,null,"WEATHER CORRECTED MD 50% POE","MW","Non-coincident"]
[null,null,null,null,"Coincident"]
[null,null,"WEATHER CORRECTED MD 50% POE","MVA","Non-coincident"]
[null,null,null,null,"Coincident"]
[null,"NSP to enter name","CONNECTION POINT RATING","MVA","Non-coincident"]
[null,null,null,null,"Coincident"]
[null,null,"WINTER/SUMMER PEAKING",null,"Non-coincident"]
[null,null,null,null,"Coincident"]
[null,null,"ADJUSTMENTS - EMBEDDED GENERATION","MW","Non-coincident"]
[null,null,null,null,"Coincident"]
[null,null,"WEATHER CORRECTED MD 10% POE","MW","Non-coincident"]
[null,null,null,null,"Coincident"]
[null,null,"WEATHER CORRECTED MD 10% POE","MVA","Non-coincident"]
[null,null,null,null,"Coincident"]
[null,null,"WEATHER CORRECTED MD 50% POE","MW","Non-coincident"]
[null,null,null,null,"Coincident"]
[null,null,"WEATHER CORRECTED MD 50% POE","MVA","Non-coincident"]
[null,null,null,null,"Coincident"]
[null,"NSP to enter name","CONNECTION POINT RATING","MVA","Non-coincident"]
[null,null,null,null,"Coincident"]
[null,null,"WINTER/SUMMER PEAKING",null,"Non-coincident"]
[null,null,null,null,"Coincident"]
[null,null,"ADJUSTMENTS - EMBEDDED GENERATION","MW","Non-coincident"]
[null,null,null,null,"Coincident"]
[null,null,"WEATHER CORRECTED MD 10% POE","MW","Non-coincident"]
[null,null,null,null,"Coincident"]
[null,null,"WEATHER CORRECTED MD 10% POE","MVA","Non-coincident"]
[null,null,null,null,"Coincident"]
[null,null,"WEATHER CORRECTED MD 50% POE","MW","Non-coincident"]
[null,null,null,null,"Coincident"]
[null,null,"WEATHER CORRECTED MD 50% POE","MVA","Non-coincident"]
[null,null,null,null,"Coincident"]
[null,"NSP to enter name","CONNECTION POINT RATING","MVA","Non-coincident"]
[null,null,null,null,"Coincident"]
[null,null,"WINTER/SUMMER PEAKING",null,"Non-coincident"]
[null,null,null,null,"Coincident"]
[null,null,"ADJUSTMENTS - EMBEDDED GENERATION","MW","Non-coincident"]
[null,null,null,null,"Coincident"]
[null,null,"WEATHER CORRECTED MD 10% POE","MW","Non-coincident"]
[null,null,null,null,"Coincident"]
[null,null,"WEATHER CORRECTED MD 10% POE","MVA","Non-coincident"]
[null,null,null,null,"Coincident"]
[null,null,"WEATHER CORRECTED MD 50% POE","MW","Non-coincident"]
[null,null,null,null,"Coincident"]
[null,null,"WEATHER CORRECTED MD 50% POE","MVA","Non-coincident"]
[null,null,null,null,"Coincident"]
[null,"NSP to enter name","CONNECTION POINT RATING","MVA","Non-coincident"]
[null,null,null,null,"Coincident"]
[null,null,"WINTER/SUMMER PEAKING",null,"Non-coincident"]
[null,null,null,null,"Coincident"]
[null,null,"ADJUSTMENTS - EMBEDDED GENERATION","MW","Non-coincident"]
[null,null,null,null,"Coincident"]
[null,null,"WEATHER CORRECTED MD 10% POE","MW","Non-coincident"]
[null,null,null,null,"Coincident"]
[null,null,"WEATHER CORRECTED MD 10% POE","MVA","Non-coincident"]
[null,null,null,null,"Coincident"]
[null,null,"WEATHER CORRECTED MD 50% POE","MW","Non-coincident"]
[null,null,null,null,"Coincident"]
[null,null,"WEATHER CORRECTED MD 50% POE","MVA","Non-coincident"]
[null,null,null,null,"Coincident"]
[null,"NSP to enter name","CONNECTION POINT RATING","MVA","Non-coincident"]
[null,null,null,null,"Coincident"]
[null,null,"WINTER/SUMMER PEAKING",null,"Non-coincident"]
[null,null,null,null,"Coincident"]
[null,null,"ADJUSTMENTS - EMBEDDED GENERATION","MW","Non-coincident"]
[null,null,null,null,"Coincident"]
[null,null,"WEATHER CORRECTED MD 10% POE","MW","Non-coincident"]
[null,null,null,null,"Coincident"]
[null,null,"WEATHER CORRECTED MD 10% POE","MVA","Non-coincident"]
[null,null,null,null,"Coincident"]
[null,null,"WEATHER CORRECTED MD 50% POE","MW","Non-coincident"]
[null,null,null,null,"Coincident"]
[null,null,"WEATHER CORRECTED MD 50% POE","MVA","Non-coincident"]
[null,null,null,null,"Coincident"]
[null,"NSP to enter name","CONNECTION POINT RATING","MVA","Non-coincident"]
[null,null,null,null,"Coincident"]
[null,null,"WINTER/SUMMER PEAKING",null,"Non-coincident"]
[null,null,null,null,"Coincident"]
[null,null,"ADJUSTMENTS - EMBEDDED GENERATION","MW","Non-coincident"]
[null,null,null,null,"Coincident"]
[null,null,"WEATHER CORRECTED MD 10% POE","MW","Non-coincident"]
[null,null,null,null,"Coincident"]
[null,null,"WEATHER CORRECTED MD 10% POE","MVA","Non-coincident"]
[null,null,null,null,"Coincident"]
[null,null,"WEATHER CORRECTED MD 50% POE","MW","Non-coincident"]
[null,null,null,null,"Coincident"]
[null,null,"WEATHER CORRECTED MD 50% POE","MVA","Non-coincident"]
[null,null,null,null,"Coincident"]
[null,"NSP to enter name","CONNECTION POINT RATING","MVA","Non-coincident"]
[null,null,null,null,"Coincident"]
[null,null,"WINTER/SUMMER PEAKING",null,"Non-coincident"]
[null,null,null,null,"Coincident"]
[null,null,"ADJUSTMENTS - EMBEDDED GENERATION","MW","Non-coincident"]
[null,null,null,null,"Coincident"]
[null,null,"WEATHER CORRECTED MD 10% POE","MW","Non-coincident"]
[null,null,null,null,"Coincident"]
[null,null,"WEATHER CORRECTED MD 10% POE","MVA","Non-coincident"]
[null,null,null,null,"Coincident"]
[null,null,"WEATHER CORRECTED MD 50% POE","MW","Non-coincident"]
[null,null,null,null,"Coincident"]
[null,null,"WEATHER CORRECTED MD 50% POE","MVA","Non-coincident"]
[null,null,null,null,"Coincident"]
[null,"NSP to enter name","CONNECTION POINT RATING","MVA","Non-coincident"]
[null,null,null,null,"Coincident"]
[null,null,"WINTER/SUMMER PEAKING",null,"Non-coincident"]
[null,null,null,null,"Coincident"]
[null,null,"ADJUSTMENTS - EMBEDDED GENERATION","MW","Non-coincident"]
[null,null,null,null,"Coincident"]
[null,null,"WEATHER CORRECTED MD 10% POE","MW","Non-coincident"]
[null,null,null,null,"Coincident"]
[null,null,"WEATHER CORRECTED MD 10% POE","MVA","Non-coincident"]
[null,null,null,null,"Coincident"]
[null,null,"WEATHER CORRECTED MD 50% POE","MW","Non-coincident"]
[null,null,null,null,"Coincident"]
[null,null,"WEATHER CORRECTED MD 50% POE","MVA","Non-coincident"]
[null,null,null,null,"Coincident"]
[null,"NSP to enter name","CONNECTION POINT RATING","MVA","Non-coincident"]
[null,null,null,null,"Coincident"]
[null,null,"WINTER/SUMMER PEAKING",null,"Non-coincident"]
[null,null,null,null,"Coincident"]
[null,null,"ADJUSTMENTS - EMBEDDED GENERATION","MW","Non-coincident"]
[null,null,null,null,"Coincident"]
[null,null,"WEATHER CORRECTED MD 10% POE","MW","Non-coincident"]
[null,null,null,null,"Coincident"]
[null,null,"WEATHER CORRECTED MD 10% POE","MVA","Non-coincident"]
[null,null,null,null,"Coincident"]
[null,null,"WEATHER CORRECTED MD 50% POE","MW","Non-coincident"]
[null,null,null,null,"Coincident"]
[null,null,"WEATHER CORRECTED MD 50% POE","MVA","Non-coincident"]
[null,null,null,null,"Coincident"]
[null,"NSP to enter name","CONNECTION POINT RATING","MVA","Non-coincident"]
[null,null,null,null,"Coincident"]
[null,null,"WINTER/SUMMER PEAKING",null,"Non-coincident"]
[null,null,null,null,"Coincident"]
[null,null,"ADJUSTMENTS - EMBEDDED GENERATION","MW","Non-coincident"]
[null,null,null,null,"Coincident"]
[null,null,"WEATHER CORRECTED MD 10% POE","MW","Non-coincident"]
[null,null,null,null,"Coincident"]
[null,null,"WEATHER CORRECTED MD 10% POE","MVA","Non-coincident"]
[null,null,null,null,"Coincident"]
[null,null,"WEATHER CORRECTED MD 50% POE","MW","Non-coincident"]
[null,null,null,null,"Coincident"]
[null,null,"WEATHER CORRECTED MD 50% POE","MVA","Non-coincident"]
[null,null,null,null,"Coincident"]
[null,"NSP to enter name","CONNECTION POINT RATING","MVA","Non-coincident"]
[null,null,null,null,"Coincident"]
[null,null,"WINTER/SUMMER PEAKING",null,"Non-coincident"]
[null,null,null,null,"Coincident"]
[null,null,"ADJUSTMENTS - EMBEDDED GENERATION","MW","Non-coincident"]
[null,null,null,null,"Coincident"]
[null,null,"WEATHER CORRECTED MD 10% POE","MW","Non-coincident"]
[null,null,null,null,"Coincident"]
[null,null,"WEATHER CORRECTED MD 10% POE","MVA","Non-coincident"]
[null,null,null,null,"Coincident"]
[null,null,"WEATHER CORRECTED MD 50% POE","MW","Non-coincident"]
[null,null,null,null,"Coincident"]
[null,null,"WEATHER CORRECTED MD 50% POE","MVA","Non-coincident"]
[null,null,null,null,"Coincident"]
[null,"NSP to enter name","CONNECTION POINT RATING","MVA","Non-coincident"]
[null,null,null,null,"Coincident"]
[null,null,"WINTER/SUMMER PEAKING",null,"Non-coincident"]
[null,null,null,null,"Coincident"]
[null,null,"ADJUSTMENTS - EMBEDDED GENERATION","MW","Non-coincident"]
[null,null,null,null,"Coincident"]
[null,null,"WEATHER CORRECTED MD 10% POE","MW","Non-coincident"]
[null,null,null,null,"Coincident"]
[null,null,"WEATHER CORRECTED MD 10% POE","MVA","Non-coincident"]
[null,null,null,null,"Coincident"]
[null,null,"WEATHER CORRECTED MD 50% POE","MW","Non-coincident"]
[null,null,null,null,"Coincident"]
[null,null,"WEATHER CORRECTED MD 50% POE","MVA","Non-coincident"]
[null,null,null,null,"Coincident"]
[null,"NSP to enter name","CONNECTION POINT RATING","MVA","Non-coincident"]
[null,null,null,null,"Coincident"]
[null,null,"WINTER/SUMMER PEAKING",null,"Non-coincident"]
[null,null,null,null,"Coincident"]
[null,null,"ADJUSTMENTS - EMBEDDED GENERATION","MW","Non-coincident"]
[null,null,null,null,"Coincident"]
[null,null,"WEATHER CORRECTED MD 10% POE","MW","Non-coincident"]
[null,null,null,null,"Coincident"]
[null,null,"WEATHER CORRECTED MD 10% POE","MVA","Non-coincident"]
[null,null,null,null,"Coincident"]
[null,null,"WEATHER CORRECTED MD 50% POE","MW","Non-coincident"]
[null,null,null,null,"Coincident"]
[null,null,"WEATHER CORRECTED MD 50% POE","MVA","Non-coincident"]
[null,null,null,null,"Coincident"]
[null,"NSP to enter name","CONNECTION POINT RATING","MVA","Non-coincident"]
[null,null,null,null,"Coincident"]
[null,null,"WINTER/SUMMER PEAKING",null,"Non-coincident"]
[null,null,null,null,"Coincident"]
[null,null,"ADJUSTMENTS - EMBEDDED GENERATION","MW","Non-coincident"]
[null,null,null,null,"Coincident"]
[null,null,"WEATHER CORRECTED MD 10% POE","MW","Non-coincident"]
[null,null,null,null,"Coincident"]
[null,null,"WEATHER CORRECTED MD 10% POE","MVA","Non-coincident"]
[null,null,null,null,"Coincident"]
[null,null,"WEATHER CORRECTED MD 50% POE","MW","Non-coincident"]
[null,null,null,null,"Coincident"]
[null,null,"WEATHER CORRECTED MD 50% POE","MVA","Non-coincident"]
[null,null,null,null,"Coincident"]
[null,"NSP to enter name","CONNECTION POINT RATING","MVA","Non-coincident"]
[null,null,null,null,"Coincident"]
[null,null,"WINTER/SUMMER PEAKING",null,"Non-coincident"]
[null,null,null,null,"Coincident"]
[null,null,"ADJUSTMENTS - EMBEDDED GENERATION","MW","Non-coincident"]
[null,null,null,null,"Coincident"]
[null,null,"WEATHER CORRECTED MD 10% POE","MW","Non-coincident"]
[null,null,null,null,"Coincident"]
[null,null,"WEATHER CORRECTED MD 10% POE","MVA","Non-coincident"]
[null,null,null,null,"Coincident"]
[null,null,"WEATHER CORRECTED MD 50% POE","MW","Non-coincident"]
[null,null,null,null,"Coincident"]
[null,null,"WEATHER CORRECTED MD 50% POE","MVA","Non-coincident"]
[null,null,null,null,"Coincident"]
[null,"NSP to enter name","CONNECTION POINT RATING","MVA","Non-coincident"]
[null,null,null,null,"Coincident"]
[null,null,"WINTER/SUMMER PEAKING",null,"Non-coincident"]
[null,null,null,null,"Coincident"]
[null,null,"ADJUSTMENTS - EMBEDDED GENERATION","MW","Non-coincident"]
[null,null,null,null,"Coincident"]
[null,null,"WEATHER CORRECTED MD 10% POE","MW","Non-coincident"]
[null,null,null,null,"Coincident"]
[null,null,"WEATHER CORRECTED MD 10% POE","MVA","Non-coincident"]
[null,null,null,null,"Coincident"]
[null,null,"WEATHER CORRECTED MD 50% POE","MW","Non-coincident"]
[null,null,null,null,"Coincident"]
[null,null,"WEATHER CORRECTED MD 50% POE","MVA","Non-coincident"]
[null,null,null,null,"Coincident"]
[null,"NSP to enter name","CONNECTION POINT RATING","MVA","Non-coincident"]
[null,null,null,null,"Coincident"]
[null,null,"WINTER/SUMMER PEAKING",null,"Non-coincident"]
[null,null,null,null,"Coincident"]
[null,null,"ADJUSTMENTS - EMBEDDED GENERATION","MW","Non-coincident"]
[null,null,null,null,"Coincident"]
[null,null,"WEATHER CORRECTED MD 10% POE","MW","Non-coincident"]
[null,null,null,null,"Coincident"]
[null,null,"WEATHER CORRECTED MD 10% POE","MVA","Non-coincident"]
[null,null,null,null,"Coincident"]
[null,null,"WEATHER CORRECTED MD 50% POE","MW","Non-coincident"]
[null,null,null,null,"Coincident"]
[null,null,"WEATHER CORRECTED MD 50% POE","MVA","Non-coincident"]
[null,null,null,null,"Coincident"]
[null,"NSP to enter name","CONNECTION POINT RATING","MVA","Non-coincident"]
[null,null,null,null,"Coincident"]
[null,null,"WINTER/SUMMER PEAKING",null,"Non-coincident"]
[null,null,null,null,"Coincident"]
[null,null,"ADJUSTMENTS - EMBEDDED GENERATION","MW","Non-coincident"]
[null,null,null,null,"Coincident"]
[null,null,"WEATHER CORRECTED MD 10% POE","MW","Non-coincident"]
[null,null,null,null,"Coincident"]
[null,null,"WEATHER CORRECTED MD 10% POE","MVA","Non-coincident"]
[null,null,null,null,"Coincident"]
[null,null,"WEATHER CORRECTED MD 50% POE","MW","Non-coincident"]
[null,null,null,null,"Coincident"]
[null,null,"WEATHER CORRECTED MD 50% POE","MVA","Non-coincident"]
[null,null,null,null,"Coincident"]
[null,"NSP to enter name","CONNECTION POINT RATING","MVA","Non-coincident"]
[null,null,null,null,"Coincident"]
[null,null,"WINTER/SUMMER PEAKING",null,"Non-coincident"]
[null,null,null,null,"Coincident"]
[null,null,"ADJUSTMENTS - EMBEDDED GENERATION","MW","Non-coincident"]
[null,null,null,null,"Coincident"]
[null,null,"WEATHER CORRECTED MD 10% POE","MW","Non-coincident"]
[null,null,null,null,"Coincident"]
[null,null,"WEATHER CORRECTED MD 10% POE","MVA","Non-coincident"]
[null,null,null,null,"Coincident"]
[null,null,"WEATHER CORRECTED MD 50% POE","MW","Non-coincident"]
[null,null,null,null,"Coincident"]
[null,null,"WEATHER CORRECTED MD 50% POE","MVA","Non-coincident"]
[null,null,null,null,"Coincident"]
[null,"NSP to enter name","CONNECTION POINT RATING","MVA","Non-coincident"]
[null,null,null,null,"Coincident"]
[null,null,"WINTER/SUMMER PEAKING",null,"Non-coincident"]
[null,null,null,null,"Coincident"]
[null,null,"ADJUSTMENTS - EMBEDDED GENERATION","MW","Non-coincident"]
[null,null,null,null,"Coincident"]
[null,null,"WEATHER CORRECTED MD 10% POE","MW","Non-coincident"]
[null,null,null,null,"Coincident"]
[null,null,"WEATHER CORRECTED MD 10% POE","MVA","Non-coincident"]
[null,null,null,null,"Coincident"]
[null,null,"WEATHER CORRECTED MD 50% POE","MW","Non-coincident"]
[null,null,null,null,"Coincident"]
[null,null,"WEATHER CORRECTED MD 50% POE","MVA","Non-coincident"]
[null,null,null,null,"Coincident"]
[null,"NSP to enter name","CONNECTION POINT RATING","MVA","Non-coincident"]
[null,null,null,null,"Coincident"]
[null,null,"WINTER/SUMMER PEAKING",null,"Non-coincident"]
[null,null,null,null,"Coincident"]
[null,null,"ADJUSTMENTS - EMBEDDED GENERATION","MW","Non-coincident"]
[null,null,null,null,"Coincident"]
[null,null,"WEATHER CORRECTED MD 10% POE","MW","Non-coincident"]
[null,null,null,null,"Coincident"]
[null,null,"WEATHER CORRECTED MD 10% POE","MVA","Non-coincident"]
[null,null,null,null,"Coincident"]
[null,null,"WEATHER CORRECTED MD 50% POE","MW","Non-coincident"]
[null,null,null,null,"Coincident"]
[null,null,"WEATHER CORRECTED MD 50% POE","MVA","Non-coincident"]
[null,null,null,null,"Coincident"]
[null,"NSP to enter name","CONNECTION POINT RATING","MVA","Non-coincident"]
[null,null,null,null,"Coincident"]
[null,null,"WINTER/SUMMER PEAKING",null,"Non-coincident"]
[null,null,null,null,"Coincident"]
[null,null,"ADJUSTMENTS - EMBEDDED GENERATION","MW","Non-coincident"]
[null,null,null,null,"Coincident"]
[null,null,"WEATHER CORRECTED MD 10% POE","MW","Non-coincident"]
[null,null,null,null,"Coincident"]
[null,null,"WEATHER CORRECTED MD 10% POE","MVA","Non-coincident"]
[null,null,null,null,"Coincident"]
[null,null,"WEATHER CORRECTED MD 50% POE","MW","Non-coincident"]
[null,null,null,null,"Coincident"]
[null,null,"WEATHER CORRECTED MD 50% POE","MVA","Non-coincident"]
[null,null,null,null,"Coincident"]
[null,"NSP to enter name","CONNECTION POINT RATING","MVA","Non-coincident"]
[null,null,null,null,"Coincident"]
[null,null,"WINTER/SUMMER PEAKING",null,"Non-coincident"]
[null,null,null,null,"Coincident"]
[null,null,"ADJUSTMENTS - EMBEDDED GENERATION","MW","Non-coincident"]
[null,null,null,null,"Coincident"]
[null,null,"WEATHER CORRECTED MD 10% POE","MW","Non-coincident"]
[null,null,null,null,"Coincident"]
[null,null,"WEATHER CORRECTED MD 10% POE","MVA","Non-coincident"]
[null,null,null,null,"Coincident"]
[null,null,"WEATHER CORRECTED MD 50% POE","MW","Non-coincident"]
[null,null,null,null,"Coincident"]
[null,null,"WEATHER CORRECTED MD 50% POE","MVA","Non-coincident"]
[null,null,null,null,"Coincident"]
[null,"NSP to enter name","CONNECTION POINT RATING","MVA","Non-coincident"]
[null,null,null,null,"Coincident"]
[null,null,"WINTER/SUMMER PEAKING",null,"Non-coincident"]
[null,null,null,null,"Coincident"]
[null,null,"ADJUSTMENTS - EMBEDDED GENERATION","MW","Non-coincident"]
[null,null,null,null,"Coincident"]
[null,null,"WEATHER CORRECTED MD 10% POE","MW","Non-coincident"]
[null,null,null,null,"Coincident"]
[null,null,"WEATHER CORRECTED MD 10% POE","MVA","Non-coincident"]
[null,null,null,null,"Coincident"]
[null,null,"WEATHER CORRECTED MD 50% POE","MW","Non-coincident"]
[null,null,null,null,"Coincident"]
[null,null,"WEATHER CORRECTED MD 50% POE","MVA","Non-coincident"]
[null,null,null,null,"Coincident"]
[null,"NSP to enter name","CONNECTION POINT RATING","MVA","Non-coincident"]
[null,null,null,null,"Coincident"]
[null,null,"WINTER/SUMMER PEAKING",null,"Non-coincident"]
[null,null,null,null,"Coincident"]
[null,null,"ADJUSTMENTS - EMBEDDED GENERATION","MW","Non-coincident"]
[null,null,null,null,"Coincident"]
[null,null,"WEATHER CORRECTED MD 10% POE","MW","Non-coincident"]
[null,null,null,null,"Coincident"]
[null,null,"WEATHER CORRECTED MD 10% POE","MVA","Non-coincident"]
[null,null,null,null,"Coincident"]
[null,null,"WEATHER CORRECTED MD 50% POE","MW","Non-coincident"]
[null,null,null,null,"Coincident"]
[null,null,"WEATHER CORRECTED MD 50% POE","MVA","Non-coincident"]
[null,null,null,null,"Coincident"]
[null,"NSP to enter name","CONNECTION POINT RATING","MVA","Non-coincident"]
[null,null,null,null,"Coincident"]
[null,null,"WINTER/SUMMER PEAKING",null,"Non-coincident"]
[null,null,null,null,"Coincident"]
[null,null,"ADJUSTMENTS - EMBEDDED GENERATION","MW","Non-coincident"]
[null,null,null,null,"Coincident"]
[null,null,"WEATHER CORRECTED MD 10% POE","MW","Non-coincident"]
[null,null,null,null,"Coincident"]
[null,null,"WEATHER CORRECTED MD 10% POE","MVA","Non-coincident"]
[null,null,null,null,"Coincident"]
[null,null,"WEATHER CORRECTED MD 50% POE","MW","Non-coincident"]
[null,null,null,null,"Coincident"]
[null,null,"WEATHER CORRECTED MD 50% POE","MVA","Non-coincident"]
[null,null,null,null,"Coincident"]
[null,"NSP to enter name","CONNECTION POINT RATING","MVA","Non-coincident"]
[null,null,null,null,"Coincident"]
[null,null,"WINTER/SUMMER PEAKING",null,"Non-coincident"]
[null,null,null,null,"Coincident"]
[null,null,"ADJUSTMENTS - EMBEDDED GENERATION","MW","Non-coincident"]
[null,null,null,null,"Coincident"]
[null,null,"WEATHER CORRECTED MD 10% POE","MW","Non-coincident"]
[null,null,null,null,"Coincident"]
[null,null,"WEATHER CORRECTED MD 10% POE","MVA","Non-coincident"]
[null,null,null,null,"Coincident"]
[null,null,"WEATHER CORRECTED MD 50% POE","MW","Non-coincident"]
[null,null,null,null,"Coincident"]
[null,null,"WEATHER CORRECTED MD 50% POE","MVA","Non-coincident"]
[null,null,null,null,"Coincident"]
[null,"NSP to enter name","CONNECTION POINT RATING","MVA","Non-coincident"]
[null,null,null,null,"Coincident"]
[null,null,"WINTER/SUMMER PEAKING",null,"Non-coincident"]
[null,null,null,null,"Coincident"]
[null,null,"ADJUSTMENTS - EMBEDDED GENERATION","MW","Non-coincident"]
[null,null,null,null,"Coincident"]
[null,null,"WEATHER CORRECTED MD 10% POE","MW","Non-coincident"]
[null,null,null,null,"Coincident"]
[null,null,"WEATHER CORRECTED MD 10% POE","MVA","Non-coincident"]
[null,null,null,null,"Coincident"]
[null,null,"WEATHER CORRECTED MD 50% POE","MW","Non-coincident"]
[null,null,null,null,"Coincident"]
[null,null,"WEATHER CORRECTED MD 50% POE","MVA","Non-coincident"]
[null,null,null,null,"Coincident"]
[null,"NSP to enter name","CONNECTION POINT RATING","MVA","Non-coincident"]
[null,null,null,null,"Coincident"]
[null,null,"WINTER/SUMMER PEAKING",null,"Non-coincident"]
[null,null,null,null,"Coincident"]
[null,null,"ADJUSTMENTS - EMBEDDED GENERATION","MW","Non-coincident"]
[null,null,null,null,"Coincident"]
[null,null,"WEATHER CORRECTED MD 10% POE","MW","Non-coincident"]
[null,null,null,null,"Coincident"]
[null,null,"WEATHER CORRECTED MD 10% POE","MVA","Non-coincident"]
[null,null,null,null,"Coincident"]
[null,null,"WEATHER CORRECTED MD 50% POE","MW","Non-coincident"]
[null,null,null,null,"Coincident"]
[null,null,"WEATHER CORRECTED MD 50% POE","MVA","Non-coincident"]
[null,null,null,null,"Coincident"]
[null,"NSP to enter name","CONNECTION POINT RATING","MVA","Non-coincident"]
[null,null,null,null,"Coincident"]
[null,null,"WINTER/SUMMER PEAKING",null,"Non-coincident"]
[null,null,null,null,"Coincident"]
[null,null,"ADJUSTMENTS - EMBEDDED GENERATION","MW","Non-coincident"]
[null,null,null,null,"Coincident"]
[null,null,"WEATHER CORRECTED MD 10% POE","MW","Non-coincident"]
[null,null,null,null,"Coincident"]
[null,null,"WEATHER CORRECTED MD 10% POE","MVA","Non-coincident"]
[null,null,null,null,"Coincident"]
[null,null,"WEATHER CORRECTED MD 50% POE","MW","Non-coincident"]
[null,null,null,null,"Coincident"]
[null,null,"WEATHER CORRECTED MD 50% POE","MVA","Non-coincident"]
[null,null,null,null,"Coincident"]
[null,"NSP to enter name","CONNECTION POINT RATING","MVA","Non-coincident"]
[null,null,null,null,"Coincident"]
[null,null,"WINTER/SUMMER PEAKING",null,"Non-coincident"]
[null,null,null,null,"Coincident"]
[null,null,"ADJUSTMENTS - EMBEDDED GENERATION","MW","Non-coincident"]
[null,null,null,null,"Coincident"]
[null,null,"WEATHER CORRECTED MD 10% POE","MW","Non-coincident"]
[null,null,null,null,"Coincident"]
[null,null,"WEATHER CORRECTED MD 10% POE","MVA","Non-coincident"]
[null,null,null,null,"Coincident"]
[null,null,"WEATHER CORRECTED MD 50% POE","MW","Non-coincident"]
[null,null,null,null,"Coincident"]
[null,null,"WEATHER CORRECTED MD 50% POE","MVA","Non-coincident"]
[null,null,null,null,"Coincident"]
[null,"NSP to enter name","CONNECTION POINT RATING","MVA","Non-coincident"]
[null,null,null,null,"Coincident"]
[null,null,"WINTER/SUMMER PEAKING",null,"Non-coincident"]
[null,null,null,null,"Coincident"]
[null,null,"ADJUSTMENTS - EMBEDDED GENERATION","MW","Non-coincident"]
[null,null,null,null,"Coincident"]
[null,null,"WEATHER CORRECTED MD 10% POE","MW","Non-coincident"]
[null,null,null,null,"Coincident"]
[null,null,"WEATHER CORRECTED MD 10% POE","MVA","Non-coincident"]
[null,null,null,null,"Coincident"]
[null,null,"WEATHER CORRECTED MD 50% POE","MW","Non-coincident"]
[null,null,null,null,"Coincident"]
[null,null,"WEATHER CORRECTED MD 50% POE","MVA","Non-coincident"]
[null,null,null,null,"Coincident"]
[null,"NSP to enter name","CONNECTION POINT RATING","MVA","Non-coincident"]
[null,null,null,null,"Coincident"]
[null,null,"WINTER/SUMMER PEAKING",null,"Non-coincident"]
[null,null,null,null,"Coincident"]
[null,null,"ADJUSTMENTS - EMBEDDED GENERATION","MW","Non-coincident"]
[null,null,null,null,"Coincident"]
[null,null,"WEATHER CORRECTED MD 10% POE","MW","Non-coincident"]
[null,null,null,null,"Coincident"]
[null,null,"WEATHER CORRECTED MD 10% POE","MVA","Non-coincident"]
[null,null,null,null,"Coincident"]
[null,null,"WEATHER CORRECTED MD 50% POE","MW","Non-coincident"]
[null,null,null,null,"Coincident"]
[null,null,"WEATHER CORRECTED MD 50% POE","MVA","Non-coincident"]
[null,null,null,null,"Coincident"]
[null,"NSP to enter name","CONNECTION POINT RATING","MVA","Non-coincident"]
[null,null,null,null,"Coincident"]
[null,null,"WINTER/SUMMER PEAKING",null,"Non-coincident"]
[null,null,null,null,"Coincident"]
[null,null,"ADJUSTMENTS - EMBEDDED GENERATION","MW","Non-coincident"]
[null,null,null,null,"Coincident"]
[null,null,"WEATHER CORRECTED MD 10% POE","MW","Non-coincident"]
[null,null,null,null,"Coincident"]
[null,null,"WEATHER CORRECTED MD 10% POE","MVA","Non-coincident"]
[null,null,null,null,"Coincident"]
[null,null,"WEATHER CORRECTED MD 50% POE","MW","Non-coincident"]
[null,null,null,null,"Coincident"]
[null,null,"WEATHER CORRECTED MD 50% POE","MVA","Non-coincident"]
[null,null,null,null,"Coincident"]
[null,"NSP to enter name","CONNECTION POINT RATING","MVA","Non-coincident"]
[null,null,null,null,"Coincident"]
[null,null,"WINTER/SUMMER PEAKING",null,"Non-coincident"]
[null,null,null,null,"Coincident"]
[null,null,"ADJUSTMENTS - EMBEDDED GENERATION","MW","Non-coincident"]
[null,null,null,null,"Coincident"]
[null,null,"WEATHER CORRECTED MD 10% POE","MW","Non-coincident"]
[null,null,null,null,"Coincident"]
[null,null,"WEATHER CORRECTED MD 10% POE","MVA","Non-coincident"]
[null,null,null,null,"Coincident"]
[null,null,"WEATHER CORRECTED MD 50% POE","MW","Non-coincident"]
[null,null,null,null,"Coincident"]
[null,null,"WEATHER CORRECTED MD 50% POE","MVA","Non-coincident"]
[null,null,null,null,"Coincident"]
[null,"NSP to enter name","CONNECTION POINT RATING","MVA","Non-coincident"]
[null,null,null,null,"Coincident"]
[null,null,"WINTER/SUMMER PEAKING",null,"Non-coincident"]
[null,null,null,null,"Coincident"]
[null,null,"ADJUSTMENTS - EMBEDDED GENERATION","MW","Non-coincident"]
[null,null,null,null,"Coincident"]
[null,null,"WEATHER CORRECTED MD 10% POE","MW","Non-coincident"]
[null,null,null,null,"Coincident"]
[null,null,"WEATHER CORRECTED MD 10% POE","MVA","Non-coincident"]
[null,null,null,null,"Coincident"]
[null,null,"WEATHER CORRECTED MD 50% POE","MW","Non-coincident"]
[null,null,null,null,"Coincident"]
[null,null,"WEATHER CORRECTED MD 50% POE","MVA","Non-coincident"]
[null,null,null,null,"Coincident"]
[null,"NSP to enter name","CONNECTION POINT RATING","MVA","Non-coincident"]
[null,null,null,null,"Coincident"]
[null,null,"WINTER/SUMMER PEAKING",null,"Non-coincident"]
[null,null,null,null,"Coincident"]
[null,null,"ADJUSTMENTS - EMBEDDED GENERATION","MW","Non-coincident"]
[null,null,null,null,"Coincident"]
[null,null,"WEATHER CORRECTED MD 10% POE","MW","Non-coincident"]
[null,null,null,null,"Coincident"]
[null,null,"WEATHER CORRECTED MD 10% POE","MVA","Non-coincident"]
[null,null,null,null,"Coincident"]
[null,null,"WEATHER CORRECTED MD 50% POE","MW","Non-coincident"]
[null,null,null,null,"Coincident"]
[null,null,"WEATHER CORRECTED MD 50% POE","MVA","Non-coincident"]
[null,null,null,null,"Coincident"]
[null,"NSP to enter name","CONNECTION POINT RATING","MVA","Non-coincident"]
[null,null,null,null,"Coincident"]
[null,null,"WINTER/SUMMER PEAKING",null,"Non-coincident"]
[null,null,null,null,"Coincident"]
[null,null,"ADJUSTMENTS - EMBEDDED GENERATION","MW","Non-coincident"]
[null,null,null,null,"Coincident"]
[null,null,"WEATHER CORRECTED MD 10% POE","MW","Non-coincident"]
[null,null,null,null,"Coincident"]
[null,null,"WEATHER CORRECTED MD 10% POE","MVA","Non-coincident"]
[null,null,null,null,"Coincident"]
[null,null,"WEATHER CORRECTED MD 50% POE","MW","Non-coincident"]
[null,null,null,null,"Coincident"]
[null,null,"WEATHER CORRECTED MD 50% POE","MVA","Non-coincident"]
[null,null,null,null,"Coincident"]
[null,"NSP to enter name","CONNECTION POINT RATING","MVA","Non-coincident"]
[null,null,null,null,"Coincident"]
[null,null,"WINTER/SUMMER PEAKING",null,"Non-coincident"]
[null,null,null,null,"Coincident"]
[null,null,"ADJUSTMENTS - EMBEDDED GENERATION","MW","Non-coincident"]
[null,null,null,null,"Coincident"]
[null,null,"WEATHER CORRECTED MD 10% POE","MW","Non-coincident"]
[null,null,null,null,"Coincident"]
[null,null,"WEATHER CORRECTED MD 10% POE","MVA","Non-coincident"]
[null,null,null,null,"Coincident"]
[null,null,"WEATHER CORRECTED MD 50% POE","MW","Non-coincident"]
[null,null,null,null,"Coincident"]
[null,null,"WEATHER CORRECTED MD 50% POE","MVA","Non-coincident"]
[null,null,null,null,"Coincident"]
[null,"NSP to enter name","CONNECTION POINT RATING","MVA","Non-coincident"]
[null,null,null,null,"Coincident"]
[null,null,"WINTER/SUMMER PEAKING",null,"Non-coincident"]
[null,null,null,null,"Coincident"]
[null,null,"ADJUSTMENTS - EMBEDDED GENERATION","MW","Non-coincident"]
[null,null,null,null,"Coincident"]
[null,null,"WEATHER CORRECTED MD 10% POE","MW","Non-coincident"]
[null,null,null,null,"Coincident"]
[null,null,"WEATHER CORRECTED MD 10% POE","MVA","Non-coincident"]
[null,null,null,null,"Coincident"]
[null,null,"WEATHER CORRECTED MD 50% POE","MW","Non-coincident"]
[null,null,null,null,"Coincident"]
[null,null,"WEATHER CORRECTED MD 50% POE","MVA","Non-coincident"]
[null,null,null,null,"Coincident"]
[null,"NSP to enter name","CONNECTION POINT RATING","MVA","Non-coincident"]
[null,null,null,null,"Coincident"]
[null,null,"WINTER/SUMMER PEAKING",null,"Non-coincident"]
[null,null,null,null,"Coincident"]
[null,null,"ADJUSTMENTS - EMBEDDED GENERATION","MW","Non-coincident"]
[null,null,null,null,"Coincident"]
[null,null,"WEATHER CORRECTED MD 10% POE","MW","Non-coincident"]
[null,null,null,null,"Coincident"]
[null,null,"WEATHER CORRECTED MD 10% POE","MVA","Non-coincident"]
[null,null,null,null,"Coincident"]
[null,null,"WEATHER CORRECTED MD 50% POE","MW","Non-coincident"]
[null,null,null,null,"Coincident"]
[null,null,"WEATHER CORRECTED MD 50% POE","MVA","Non-coincident"]
[null,null,null,null,"Coincident"]
[null,"NSP to enter name","CONNECTION POINT RATING","MVA","Non-coincident"]
[null,null,null,null,"Coincident"]
[null,null,"WINTER/SUMMER PEAKING",null,"Non-coincident"]
[null,null,null,null,"Coincident"]
[null,null,"ADJUSTMENTS - EMBEDDED GENERATION","MW","Non-coincident"]
[null,null,null,null,"Coincident"]
[null,null,"WEATHER CORRECTED MD 10% POE","MW","Non-coincident"]
[null,null,null,null,"Coincident"]
[null,null,"WEATHER CORRECTED MD 10% POE","MVA","Non-coincident"]
[null,null,null,null,"Coincident"]
[null,null,"WEATHER CORRECTED MD 50% POE","MW","Non-coincident"]
[null,null,null,null,"Coincident"]
[null,null,"WEATHER CORRECTED MD 50% POE","MVA","Non-coincident"]
[null,null,null,null,"Coincident"]
[null,"NSP to enter name","CONNECTION POINT RATING","MVA","Non-coincident"]
[null,null,null,null,"Coincident"]
[null,null,"WINTER/SUMMER PEAKING",null,"Non-coincident"]
[null,null,null,null,"Coincident"]
[null,null,"ADJUSTMENTS - EMBEDDED GENERATION","MW","Non-coincident"]
[null,null,null,null,"Coincident"]
[null,null,"WEATHER CORRECTED MD 10% POE","MW","Non-coincident"]
[null,null,null,null,"Coincident"]
[null,null,"WEATHER CORRECTED MD 10% POE","MVA","Non-coincident"]
[null,null,null,null,"Coincident"]
[null,null,"WEATHER CORRECTED MD 50% POE","MW","Non-coincident"]
[null,null,null,null,"Coincident"]
[null,null,"WEATHER CORRECTED MD 50% POE","MVA","Non-coincident"]
[null,null,null,null,"Coincident"]
[null,"NSP to enter name","CONNECTION POINT RATING","MVA","Non-coincident"]
[null,null,null,null,"Coincident"]
[null,null,"WINTER/SUMMER PEAKING",null,"Non-coincident"]
[null,null,null,null,"Coincident"]
[null,null,"ADJUSTMENTS - EMBEDDED GENERATION","MW","Non-coincident"]
[null,null,null,null,"Coincident"]
[null,null,"WEATHER CORRECTED MD 10% POE","MW","Non-coincident"]
[null,null,null,null,"Coincident"]
[null,null,"WEATHER CORRECTED MD 10% POE","MVA","Non-coincident"]
[null,null,null,null,"Coincident"]
[null,null,"WEATHER CORRECTED MD 50% POE","MW","Non-coincident"]
[null,null,null,null,"Coincident"]
[null,null,"WEATHER CORRECTED MD 50% POE","MVA","Non-coincident"]
[null,null,null,null,"Coincident"]
[null,"NSP to enter name","CONNECTION POINT RATING","MVA","Non-coincident"]
[null,null,null,null,"Coincident"]
[null,null,"WINTER/SUMMER PEAKING",null,"Non-coincident"]
[null,null,null,null,"Coincident"]
[null,null,"ADJUSTMENTS - EMBEDDED GENERATION","MW","Non-coincident"]
[null,null,null,null,"Coincident"]
[null,null,"WEATHER CORRECTED MD 10% POE","MW","Non-coincident"]
[null,null,null,null,"Coincident"]
[null,null,"WEATHER CORRECTED MD 10% POE","MVA","Non-coincident"]
[null,null,null,null,"Coincident"]
[null,null,"WEATHER CORRECTED MD 50% POE","MW","Non-coincident"]
[null,null,null,null,"Coincident"]
[null,null,"WEATHER CORRECTED MD 50% POE","MVA","Non-coincident"]
[null,null,null,null,"Coincident"]
[null,"NSP to enter name","CONNECTION POINT RATING","MVA","Non-coincident"]
[null,null,null,null,"Coincident"]
[null,null,"WINTER/SUMMER PEAKING",null,"Non-coincident"]
[null,null,null,null,"Coincident"]
[null,null,"ADJUSTMENTS - EMBEDDED GENERATION","MW","Non-coincident"]
[null,null,null,null,"Coincident"]
[null,null,"WEATHER CORRECTED MD 10% POE","MW","Non-coincident"]
[null,null,null,null,"Coincident"]
[null,null,"WEATHER CORRECTED MD 10% POE","MVA","Non-coincident"]
[null,null,null,null,"Coincident"]
[null,null,"WEATHER CORRECTED MD 50% POE","MW","Non-coincident"]
[null,null,null,null,"Coincident"]
[null,null,"WEATHER CORRECTED MD 50% POE","MVA","Non-coincident"]
[null,null,null,null,"Coincident"]
[null,"NSP to enter name","CONNECTION POINT RATING","MVA","Non-coincident"]
[null,null,null,null,"Coincident"]
[null,null,"WINTER/SUMMER PEAKING",null,"Non-coincident"]
[null,null,null,null,"Coincident"]
[null,null,"ADJUSTMENTS - EMBEDDED GENERATION","MW","Non-coincident"]
[null,null,null,null,"Coincident"]
[null,null,"WEATHER CORRECTED MD 10% POE","MW","Non-coincident"]
[null,null,null,null,"Coincident"]
[null,null,"WEATHER CORRECTED MD 10% POE","MVA","Non-coincident"]
[null,null,null,null,"Coincident"]
[null,null,"WEATHER CORRECTED MD 50% POE","MW","Non-coincident"]
[null,null,null,null,"Coincident"]
[null,null,"WEATHER CORRECTED MD 50% POE","MVA","Non-coincident"]
[null,null,null,null,"Coincident"]
[null,"NSP to enter name","CONNECTION POINT RATING","MVA","Non-coincident"]
[null,null,null,null,"Coincident"]
[null,null,"WINTER/SUMMER PEAKING",null,"Non-coincident"]
[null,null,null,null,"Coincident"]
[null,null,"ADJUSTMENTS - EMBEDDED GENERATION","MW","Non-coincident"]
[null,null,null,null,"Coincident"]
[null,null,"WEATHER CORRECTED MD 10% POE","MW","Non-coincident"]
[null,null,null,null,"Coincident"]
[null,null,"WEATHER CORRECTED MD 10% POE","MVA","Non-coincident"]
[null,null,null,null,"Coincident"]
[null,null,"WEATHER CORRECTED MD 50% POE","MW","Non-coincident"]
[null,null,null,null,"Coincident"]
[null,null,"WEATHER CORRECTED MD 50% POE","MVA","Non-coincident"]
[null,null,null,null,"Coincident"]
[null,"NSP to enter name","CONNECTION POINT RATING","MVA","Non-coincident"]
[null,null,null,null,"Coincident"]
[null,null,"WINTER/SUMMER PEAKING",null,"Non-coincident"]
[null,null,null,null,"Coincident"]
[null,null,"ADJUSTMENTS - EMBEDDED GENERATION","MW","Non-coincident"]
[null,null,null,null,"Coincident"]
[null,null,"WEATHER CORRECTED MD 10% POE","MW","Non-coincident"]
[null,null,null,null,"Coincident"]
[null,null,"WEATHER CORRECTED MD 10% POE","MVA","Non-coincident"]
[null,null,null,null,"Coincident"]
[null,null,"WEATHER CORRECTED MD 50% POE","MW","Non-coincident"]
[null,null,null,null,"Coincident"]
[null,null,"WEATHER CORRECTED MD 50% POE","MVA","Non-coincident"]
[null,null,null,null,"Coincident"]
[null,"NSP to enter name","CONNECTION POINT RATING","MVA","Non-coincident"]
[null,null,null,null,"Coincident"]
[null,null,"WINTER/SUMMER PEAKING",null,"Non-coincident"]
[null,null,null,null,"Coincident"]
[null,null,"ADJUSTMENTS - EMBEDDED GENERATION","MW","Non-coincident"]
[null,null,null,null,"Coincident"]
[null,null,"WEATHER CORRECTED MD 10% POE","MW","Non-coincident"]
[null,null,null,null,"Coincident"]
[null,null,"WEATHER CORRECTED MD 10% POE","MVA","Non-coincident"]
[null,null,null,null,"Coincident"]
[null,null,"WEATHER CORRECTED MD 50% POE","MW","Non-coincident"]
[null,null,null,null,"Coincident"]
[null,null,"WEATHER CORRECTED MD 50% POE","MVA","Non-coincident"]
[null,null,null,null,"Coincident"]
[null,"NSP to enter name","CONNECTION POINT RATING","MVA","Non-coincident"]
[null,null,null,null,"Coincident"]
[null,null,"WINTER/SUMMER PEAKING",null,"Non-coincident"]
[null,null,null,null,"Coincident"]
[null,null,"ADJUSTMENTS - EMBEDDED GENERATION","MW","Non-coincident"]
[null,null,null,null,"Coincident"]
[null,null,"WEATHER CORRECTED MD 10% POE","MW","Non-coincident"]
[null,null,null,null,"Coincident"]
[null,null,"WEATHER CORRECTED MD 10% POE","MVA","Non-coincident"]
[null,null,null,null,"Coincident"]
[null,null,"WEATHER CORRECTED MD 50% POE","MW","Non-coincident"]
[null,null,null,null,"Coincident"]
[null,null,"WEATHER CORRECTED MD 50% POE","MVA","Non-coincident"]
[null,null,null,null,"Coincident"]
[null,"NSP to enter name","CONNECTION POINT RATING","MVA","Non-coincident"]
[null,null,null,null,"Coincident"]
[null,null,"WINTER/SUMMER PEAKING",null,"Non-coincident"]
[null,null,null,null,"Coincident"]
[null,null,"ADJUSTMENTS - EMBEDDED GENERATION","MW","Non-coincident"]
[null,null,null,null,"Coincident"]
[null,null,"WEATHER CORRECTED MD 10% POE","MW","Non-coincident"]
[null,null,null,null,"Coincident"]
[null,null,"WEATHER CORRECTED MD 10% POE","MVA","Non-coincident"]
[null,null,null,null,"Coincident"]
[null,null,"WEATHER CORRECTED MD 50% POE","MW","Non-coincident"]
[null,null,null,null,"Coincident"]
[null,null,"WEATHER CORRECTED MD 50% POE","MVA","Non-coincident"]
[null,null,null,null,"Coincident"]
[null,"NSP to enter name","CONNECTION POINT RATING","MVA","Non-coincident"]
[null,null,null,null,"Coincident"]
[null,null,"WINTER/SUMMER PEAKING",null,"Non-coincident"]
[null,null,null,null,"Coincident"]
[null,null,"ADJUSTMENTS - EMBEDDED GENERATION","MW","Non-coincident"]
[null,null,null,null,"Coincident"]
[null,null,"WEATHER CORRECTED MD 10% POE","MW","Non-coincident"]
[null,null,null,null,"Coincident"]
[null,null,"WEATHER CORRECTED MD 10% POE","MVA","Non-coincident"]
[null,null,null,null,"Coincident"]
[null,null,"WEATHER CORRECTED MD 50% POE","MW","Non-coincident"]
[null,null,null,null,"Coincident"]
[null,null,"WEATHER CORRECTED MD 50% POE","MVA","Non-coincident"]
[null,null,null,null,"Coincident"]
[null,"NSP to enter name","CONNECTION POINT RATING","MVA","Non-coincident"]
[null,null,null,null,"Coincident"]
[null,null,"WINTER/SUMMER PEAKING",null,"Non-coincident"]
[null,null,null,null,"Coincident"]
[null,null,"ADJUSTMENTS - EMBEDDED GENERATION","MW","Non-coincident"]
[null,null,null,null,"Coincident"]
[null,null,"WEATHER CORRECTED MD 10% POE","MW","Non-coincident"]
[null,null,null,null,"Coincident"]
[null,null,"WEATHER CORRECTED MD 10% POE","MVA","Non-coincident"]
[null,null,null,null,"Coincident"]
[null,null,"WEATHER CORRECTED MD 50% POE","MW","Non-coincident"]
[null,null,null,null,"Coincident"]
[null,null,"WEATHER CORRECTED MD 50% POE","MVA","Non-coincident"]
[null,null,null,null,"Coincident"]
[null,"NSP to enter name","CONNECTION POINT RATING","MVA","Non-coincident"]
[null,null,null,null,"Coincident"]
[null,null,"WINTER/SUMMER PEAKING",null,"Non-coincident"]
[null,null,null,null,"Coincident"]
[null,null,"ADJUSTMENTS - EMBEDDED GENERATION","MW","Non-coincident"]
[null,null,null,null,"Coincident"]
[null,null,"WEATHER CORRECTED MD 10% POE","MW","Non-coincident"]
[null,null,null,null,"Coincident"]
[null,null,"WEATHER CORRECTED MD 10% POE","MVA","Non-coincident"]
[null,null,null,null,"Coincident"]
[null,null,"WEATHER CORRECTED MD 50% POE","MW","Non-coincident"]
[null,null,null,null,"Coincident"]
[null,null,"WEATHER CORRECTED MD 50% POE","MVA","Non-coincident"]
[null,null,null,null,"Coincident"]
[null,"NSP to enter name","CONNECTION POINT RATING","MVA","Non-coincident"]
[null,null,null,null,"Coincident"]
[null,null,"WINTER/SUMMER PEAKING",null,"Non-coincident"]
[null,null,null,null,"Coincident"]
[null,null,"ADJUSTMENTS - EMBEDDED GENERATION","MW","Non-coincident"]
[null,null,null,null,"Coincident"]
[null,null,"WEATHER CORRECTED MD 10% POE","MW","Non-coincident"]
[null,null,null,null,"Coincident"]
[null,null,"WEATHER CORRECTED MD 10% POE","MVA","Non-coincident"]
[null,null,null,null,"Coincident"]
[null,null,"WEATHER CORRECTED MD 50% POE","MW","Non-coincident"]
[null,null,null,null,"Coincident"]
[null,null,"WEATHER CORRECTED MD 50% POE","MVA","Non-coincident"]
[null,null,null,null,"Coincident"]
[null,"NSP to enter name","CONNECTION POINT RATING","MVA","Non-coincident"]
[null,null,null,null,"Coincident"]
[null,null,"WINTER/SUMMER PEAKING",null,"Non-coincident"]
[null,null,null,null,"Coincident"]
[null,null,"ADJUSTMENTS - EMBEDDED GENERATION","MW","Non-coincident"]
[null,null,null,null,"Coincident"]
[null,null,"WEATHER CORRECTED MD 10% POE","MW","Non-coincident"]
[null,null,null,null,"Coincident"]
[null,null,"WEATHER CORRECTED MD 10% POE","MVA","Non-coincident"]
[null,null,null,null,"Coincident"]
[null,null,"WEATHER CORRECTED MD 50% POE","MW","Non-coincident"]
[null,null,null,null,"Coincident"]
[null,null,"WEATHER CORRECTED MD 50% POE","MVA","Non-coincident"]
[null,null,null,null,"Coincident"]
[null,"NSP to enter name","CONNECTION POINT RATING","MVA","Non-coincident"]
[null,null,null,null,"Coincident"]
[null,null,"WINTER/SUMMER PEAKING",null,"Non-coincident"]
[null,null,null,null,"Coincident"]
[null,null,"ADJUSTMENTS - EMBEDDED GENERATION","MW","Non-coincident"]
[null,null,null,null,"Coincident"]
[null,null,"WEATHER CORRECTED MD 10% POE","MW","Non-coincident"]
[null,null,null,null,"Coincident"]
[null,null,"WEATHER CORRECTED MD 10% POE","MVA","Non-coincident"]
[null,null,null,null,"Coincident"]
[null,null,"WEATHER CORRECTED MD 50% POE","MW","Non-coincident"]
[null,null,null,null,"Coincident"]
[null,null,"WEATHER CORRECTED MD 50% POE","MVA","Non-coincident"]
[null,null,null,null,"Coincident"]
[null,"NSP to enter name","CONNECTION POINT RATING","MVA","Non-coincident"]
[null,null,null,null,"Coincident"]
[null,null,"WINTER/SUMMER PEAKING",null,"Non-coincident"]
[null,null,null,null,"Coincident"]
[null,null,"ADJUSTMENTS - EMBEDDED GENERATION","MW","Non-coincident"]
[null,null,null,null,"Coincident"]
[null,null,"WEATHER CORRECTED MD 10% POE","MW","Non-coincident"]
[null,null,null,null,"Coincident"]
[null,null,"WEATHER CORRECTED MD 10% POE","MVA","Non-coincident"]
[null,null,null,null,"Coincident"]
[null,null,"WEATHER CORRECTED MD 50% POE","MW","Non-coincident"]
[null,null,null,null,"Coincident"]
[null,null,"WEATHER CORRECTED MD 50% POE","MVA","Non-coincident"]
[null,null,null,null,"Coincident"]
[null,"NSP to enter name","CONNECTION POINT RATING","MVA","Non-coincident"]
[null,null,null,null,"Coincident"]
[null,null,"WINTER/SUMMER PEAKING",null,"Non-coincident"]
[null,null,null,null,"Coincident"]
[null,null,"ADJUSTMENTS - EMBEDDED GENERATION","MW","Non-coincident"]
[null,null,null,null,"Coincident"]
[null,null,"WEATHER CORRECTED MD 10% POE","MW","Non-coincident"]
[null,null,null,null,"Coincident"]
[null,null,"WEATHER CORRECTED MD 10% POE","MVA","Non-coincident"]
[null,null,null,null,"Coincident"]
[null,null,"WEATHER CORRECTED MD 50% POE","MW","Non-coincident"]
[null,null,null,null,"Coincident"]
[null,null,"WEATHER CORRECTED MD 50% POE","MVA","Non-coincident"]
[null,null,null,null,"Coincident"]
[null,"NSP to enter name","CONNECTION POINT RATING","MVA","Non-coincident"]
[null,null,null,null,"Coincident"]
[null,null,"WINTER/SUMMER PEAKING",null,"Non-coincident"]
[null,null,null,null,"Coincident"]
[null,null,"ADJUSTMENTS - EMBEDDED GENERATION","MW","Non-coincident"]
[null,null,null,null,"Coincident"]
[null,null,"WEATHER CORRECTED MD 10% POE","MW","Non-coincident"]
[null,null,null,null,"Coincident"]
[null,null,"WEATHER CORRECTED MD 10% POE","MVA","Non-coincident"]
[null,null,null,null,"Coincident"]
[null,null,"WEATHER CORRECTED MD 50% POE","MW","Non-coincident"]
[null,null,null,null,"Coincident"]
[null,null,"WEATHER CORRECTED MD 50% POE","MVA","Non-coincident"]
[null,null,null,null,"Coincident"]
[null,"NSP to enter name","CONNECTION POINT RATING","MVA","Non-coincident"]
[null,null,null,null,"Coincident"]
[null,null,"WINTER/SUMMER PEAKING",null,"Non-coincident"]
[null,null,null,null,"Coincident"]
[null,null,"ADJUSTMENTS - EMBEDDED GENERATION","MW","Non-coincident"]
[null,null,null,null,"Coincident"]
[null,null,"WEATHER CORRECTED MD 10% POE","MW","Non-coincident"]
[null,null,null,null,"Coincident"]
[null,null,"WEATHER CORRECTED MD 10% POE","MVA","Non-coincident"]
[null,null,null,null,"Coincident"]
[null,null,"WEATHER CORRECTED MD 50% POE","MW","Non-coincident"]
[null,null,null,null,"Coincident"]
[null,null,"WEATHER CORRECTED MD 50% POE","MVA","Non-coincident"]
[null,null,null,null,"Coincident"]
[null,"NSP to enter name","CONNECTION POINT RATING","MVA","Non-coincident"]
[null,null,null,null,"Coincident"]
[null,null,"WINTER/SUMMER PEAKING",null,"Non-coincident"]
[null,null,null,null,"Coincident"]
[null,null,"ADJUSTMENTS - EMBEDDED GENERATION","MW","Non-coincident"]
[null,null,null,null,"Coincident"]
[null,null,"WEATHER CORRECTED MD 10% POE","MW","Non-coincident"]
[null,null,null,null,"Coincident"]
[null,null,"WEATHER CORRECTED MD 10% POE","MVA","Non-coincident"]
[null,null,null,null,"Coincident"]
[null,null,"WEATHER CORRECTED MD 50% POE","MW","Non-coincident"]
[null,null,null,null,"Coincident"]
[null,null,"WEATHER CORRECTED MD 50% POE","MVA","Non-coincident"]
[null,null,null,null,"Coincident"]
[null,"NSP to enter name","CONNECTION POINT RATING","MVA","Non-coincident"]
[null,null,null,null,"Coincident"]
[null,null,"WINTER/SUMMER PEAKING",null,"Non-coincident"]
[null,null,null,null,"Coincident"]
[null,null,"ADJUSTMENTS - EMBEDDED GENERATION","MW","Non-coincident"]
[null,null,null,null,"Coincident"]
[null,null,"WEATHER CORRECTED MD 10% POE","MW","Non-coincident"]
[null,null,null,null,"Coincident"]
[null,null,"WEATHER CORRECTED MD 10% POE","MVA","Non-coincident"]
[null,null,null,null,"Coincident"]
[null,null,"WEATHER CORRECTED MD 50% POE","MW","Non-coincident"]
[null,null,null,null,"Coincident"]
[null,null,"WEATHER CORRECTED MD 50% POE","MVA","Non-coincident"]
[null,null,null,null,"Coincident"]
[null,"NSP to enter name","CONNECTION POINT RATING","MVA","Non-coincident"]
[null,null,null,null,"Coincident"]
[null,null,"WINTER/SUMMER PEAKING",null,"Non-coincident"]
[null,null,null,null,"Coincident"]
[null,null,"ADJUSTMENTS - EMBEDDED GENERATION","MW","Non-coincident"]
[null,null,null,null,"Coincident"]
[null,null,"WEATHER CORRECTED MD 10% POE","MW","Non-coincident"]
[null,null,null,null,"Coincident"]
[null,null,"WEATHER CORRECTED MD 10% POE","MVA","Non-coincident"]
[null,null,null,null,"Coincident"]
[null,null,"WEATHER CORRECTED MD 50% POE","MW","Non-coincident"]
[null,null,null,null,"Coincident"]
[null,null,"WEATHER CORRECTED MD 50% POE","MVA","Non-coincident"]
[null,null,null,null,"Coincident"]
[null,"NSP to enter name","CONNECTION POINT RATING","MVA","Non-coincident"]
[null,null,null,null,"Coincident"]
[null,null,"WINTER/SUMMER PEAKING",null,"Non-coincident"]
[null,null,null,null,"Coincident"]
[null,null,"ADJUSTMENTS - EMBEDDED GENERATION","MW","Non-coincident"]
[null,null,null,null,"Coincident"]
[null,null,"WEATHER CORRECTED MD 10% POE","MW","Non-coincident"]
[null,null,null,null,"Coincident"]
[null,null,"WEATHER CORRECTED MD 10% POE","MVA","Non-coincident"]
[null,null,null,null,"Coincident"]
[null,null,"WEATHER CORRECTED MD 50% POE","MW","Non-coincident"]
[null,null,null,null,"Coincident"]
[null,null,"WEATHER CORRECTED MD 50% POE","MVA","Non-coincident"]
[null,null,null,null,"Coincident"]
[null,"NSP to enter name","CONNECTION POINT RATING","MVA","Non-coincident"]
[null,null,null,null,"Coincident"]
[null,null,"WINTER/SUMMER PEAKING",null,"Non-coincident"]
[null,null,null,null,"Coincident"]
[null,null,"ADJUSTMENTS - EMBEDDED GENERATION","MW","Non-coincident"]
[null,null,null,null,"Coincident"]
[null,null,"WEATHER CORRECTED MD 10% POE","MW","Non-coincident"]
[null,null,null,null,"Coincident"]
[null,null,"WEATHER CORRECTED MD 10% POE","MVA","Non-coincident"]
[null,null,null,null,"Coincident"]
[null,null,"WEATHER CORRECTED MD 50% POE","MW","Non-coincident"]
[null,null,null,null,"Coincident"]
[null,null,"WEATHER CORRECTED MD 50% POE","MVA","Non-coincident"]
[null,null,null,null,"Coincident"]
[null,"NSP to enter name","CONNECTION POINT RATING","MVA","Non-coincident"]
[null,null,null,null,"Coincident"]
[null,null,"WINTER/SUMMER PEAKING",null,"Non-coincident"]
[null,null,null,null,"Coincident"]
[null,null,"ADJUSTMENTS - EMBEDDED GENERATION","MW","Non-coincident"]
[null,null,null,null,"Coincident"]
[null,null,"WEATHER CORRECTED MD 10% POE","MW","Non-coincident"]
[null,null,null,null,"Coincident"]
[null,null,"WEATHER CORRECTED MD 10% POE","MVA","Non-coincident"]
[null,null,null,null,"Coincident"]
[null,null,"WEATHER CORRECTED MD 50% POE","MW","Non-coincident"]
[null,null,null,null,"Coincident"]
[null,null,"WEATHER CORRECTED MD 50% POE","MVA","Non-coincident"]
[null,null,null,null,"Coincident"]
[null,"NSP to enter name","CONNECTION POINT RATING","MVA","Non-coincident"]
[null,null,null,null,"Coincident"]
[null,null,"WINTER/SUMMER PEAKING",null,"Non-coincident"]
[null,null,null,null,"Coincident"]
[null,null,"ADJUSTMENTS - EMBEDDED GENERATION","MW","Non-coincident"]
[null,null,null,null,"Coincident"]
[null,null,"WEATHER CORRECTED MD 10% POE","MW","Non-coincident"]
[null,null,null,null,"Coincident"]
[null,null,"WEATHER CORRECTED MD 10% POE","MVA","Non-coincident"]
[null,null,null,null,"Coincident"]
[null,null,"WEATHER CORRECTED MD 50% POE","MW","Non-coincident"]
[null,null,null,null,"Coincident"]
[null,null,"WEATHER CORRECTED MD 50% POE","MVA","Non-coincident"]
[null,null,null,null,"Coincident"]
[null,"NSP to enter name","CONNECTION POINT RATING","MVA","Non-coincident"]
[null,null,null,null,"Coincident"]
[null,null,"WINTER/SUMMER PEAKING",null,"Non-coincident"]
[null,null,null,null,"Coincident"]
[null,null,"ADJUSTMENTS - EMBEDDED GENERATION","MW","Non-coincident"]
[null,null,null,null,"Coincident"]
[null,null,"WEATHER CORRECTED MD 10% POE","MW","Non-coincident"]
[null,null,null,null,"Coincident"]
[null,null,"WEATHER CORRECTED MD 10% POE","MVA","Non-coincident"]
[null,null,null,null,"Coincident"]
[null,null,"WEATHER CORRECTED MD 50% POE","MW","Non-coincident"]
[null,null,null,null,"Coincident"]
[null,null,"WEATHER CORRECTED MD 50% POE","MVA","Non-coincident"]
[null,null,null,null,"Coincident"]
[null,"NSP to enter name","CONNECTION POINT RATING","MVA","Non-coincident"]
[null,null,null,null,"Coincident"]
[null,null,"WINTER/SUMMER PEAKING",null,"Non-coincident"]
[null,null,null,null,"Coincident"]
[null,null,"ADJUSTMENTS - EMBEDDED GENERATION","MW","Non-coincident"]
[null,null,null,null,"Coincident"]
[null,null,"WEATHER CORRECTED MD 10% POE","MW","Non-coincident"]
[null,null,null,null,"Coincident"]
[null,null,"WEATHER CORRECTED MD 10% POE","MVA","Non-coincident"]
[null,null,null,null,"Coincident"]
[null,null,"WEATHER CORRECTED MD 50% POE","MW","Non-coincident"]
[null,null,null,null,"Coincident"]
[null,null,"WEATHER CORRECTED MD 50% POE","MVA","Non-coincident"]
[null,null,null,null,"Coincident"]
[null,"NSP to enter name","CONNECTION POINT RATING","MVA","Non-coincident"]
[null,null,null,null,"Coincident"]
[null,null,"WINTER/SUMMER PEAKING",null,"Non-coincident"]
[null,null,null,null,"Coincident"]
[null,null,"ADJUSTMENTS - EMBEDDED GENERATION","MW","Non-coincident"]
[null,null,null,null,"Coincident"]
[null,null,"WEATHER CORRECTED MD 10% POE","MW","Non-coincident"]
[null,null,null,null,"Coincident"]
[null,null,"WEATHER CORRECTED MD 10% POE","MVA","Non-coincident"]
[null,null,null,null,"Coincident"]
[null,null,"WEATHER CORRECTED MD 50% POE","MW","Non-coincident"]
[null,null,null,null,"Coincident"]
[null,null,"WEATHER CORRECTED MD 50% POE","MVA","Non-coincident"]
[null,null,null,null,"Coincident"]
[null,"NSP to enter name","CONNECTION POINT RATING","MVA","Non-coincident"]
[null,null,null,null,"Coincident"]
[null,null,"WINTER/SUMMER PEAKING",null,"Non-coincident"]
[null,null,null,null,"Coincident"]
[null,null,"ADJUSTMENTS - EMBEDDED GENERATION","MW","Non-coincident"]
[null,null,null,null,"Coincident"]
[null,null,"WEATHER CORRECTED MD 10% POE","MW","Non-coincident"]
[null,null,null,null,"Coincident"]
[null,null,"WEATHER CORRECTED MD 10% POE","MVA","Non-coincident"]
[null,null,null,null,"Coincident"]
[null,null,"WEATHER CORRECTED MD 50% POE","MW","Non-coincident"]
[null,null,null,null,"Coincident"]
[null,null,"WEATHER CORRECTED MD 50% POE","MVA","Non-coincident"]
[null,null,null,null,"Coincident"]
[null,"NSP to enter name","CONNECTION POINT RATING","MVA","Non-coincident"]
[null,null,null,null,"Coincident"]
[null,null,"WINTER/SUMMER PEAKING",null,"Non-coincident"]
[null,null,null,null,"Coincident"]
[null,null,"ADJUSTMENTS - EMBEDDED GENERATION","MW","Non-coincident"]
[null,null,null,null,"Coincident"]
[null,null,"WEATHER CORRECTED MD 10% POE","MW","Non-coincident"]
[null,null,null,null,"Coincident"]
[null,null,"WEATHER CORRECTED MD 10% POE","MVA","Non-coincident"]
[null,null,null,null,"Coincident"]
[null,null,"WEATHER CORRECTED MD 50% POE","MW","Non-coincident"]
[null,null,null,null,"Coincident"]
[null,null,"WEATHER CORRECTED MD 50% POE","MVA","Non-coincident"]
[null,null,null,null,"Coincident"]
[null,"NSP to enter name","CONNECTION POINT RATING","MVA","Non-coincident"]
[null,null,null,null,"Coincident"]
[null,null,"WINTER/SUMMER PEAKING",null,"Non-coincident"]
[null,null,null,null,"Coincident"]
[null,null,"ADJUSTMENTS - EMBEDDED GENERATION","MW","Non-coincident"]
[null,null,null,null,"Coincident"]
[null,null,"WEATHER CORRECTED MD 10% POE","MW","Non-coincident"]
[null,null,null,null,"Coincident"]
[null,null,"WEATHER CORRECTED MD 10% POE","MVA","Non-coincident"]
[null,null,null,null,"Coincident"]
[null,null,"WEATHER CORRECTED MD 50% POE","MW","Non-coincident"]
[null,null,null,null,"Coincident"]
[null,null,"WEATHER CORRECTED MD 50% POE","MVA","Non-coincident"]
[null,null,null,null,"Coincident"]
[null,"NSP to enter name","CONNECTION POINT RATING","MVA","Non-coincident"]
[null,null,null,null,"Coincident"]
[null,null,"WINTER/SUMMER PEAKING",null,"Non-coincident"]
[null,null,null,null,"Coincident"]
[null,null,"ADJUSTMENTS - EMBEDDED GENERATION","MW","Non-coincident"]
[null,null,null,null,"Coincident"]
[null,null,"WEATHER CORRECTED MD 10% POE","MW","Non-coincident"]
[null,null,null,null,"Coincident"]
[null,null,"WEATHER CORRECTED MD 10% POE","MVA","Non-coincident"]
[null,null,null,null,"Coincident"]
[null,null,"WEATHER CORRECTED MD 50% POE","MW","Non-coincident"]
[null,null,null,null,"Coincident"]
[null,null,"WEATHER CORRECTED MD 50% POE","MVA","Non-coincident"]
[null,null,null,null,"Coincident"]
[null,"NSP to enter name","CONNECTION POINT RATING","MVA","Non-coincident"]
[null,null,null,null,"Coincident"]
[null,null,"WINTER/SUMMER PEAKING",null,"Non-coincident"]
[null,null,null,null,"Coincident"]
[null,null,"ADJUSTMENTS - EMBEDDED GENERATION","MW","Non-coincident"]
[null,null,null,null,"Coincident"]
[null,null,"WEATHER CORRECTED MD 10% POE","MW","Non-coincident"]
[null,null,null,null,"Coincident"]
[null,null,"WEATHER CORRECTED MD 10% POE","MVA","Non-coincident"]
[null,null,null,null,"Coincident"]
[null,null,"WEATHER CORRECTED MD 50% POE","MW","Non-coincident"]
[null,null,null,null,"Coincident"]
[null,null,"WEATHER CORRECTED MD 50% POE","MVA","Non-coincident"]
[null,null,null,null,"Coincident"]
[null,"NSP to enter name","CONNECTION POINT RATING","MVA","Non-coincident"]
[null,null,null,null,"Coincident"]
[null,null,"WINTER/SUMMER PEAKING",null,"Non-coincident"]
[null,null,null,null,"Coincident"]
[null,null,"ADJUSTMENTS - EMBEDDED GENERATION","MW","Non-coincident"]
[null,null,null,null,"Coincident"]
[null,null,"WEATHER CORRECTED MD 10% POE","MW","Non-coincident"]
[null,null,null,null,"Coincident"]
[null,null,"WEATHER CORRECTED MD 10% POE","MVA","Non-coincident"]
[null,null,null,null,"Coincident"]
[null,null,"WEATHER CORRECTED MD 50% POE","MW","Non-coincident"]
[null,null,null,null,"Coincident"]
[null,null,"WEATHER CORRECTED MD 50% POE","MVA","Non-coincident"]
[null,null,null,null,"Coincident"]
[null,"NSP to enter name","CONNECTION POINT RATING","MVA","Non-coincident"]
[null,null,null,null,"Coincident"]
[null,null,"WINTER/SUMMER PEAKING",null,"Non-coincident"]
[null,null,null,null,"Coincident"]
[null,null,"ADJUSTMENTS - EMBEDDED GENERATION","MW","Non-coincident"]
[null,null,null,null,"Coincident"]
[null,null,"WEATHER CORRECTED MD 10% POE","MW","Non-coincident"]
[null,null,null,null,"Coincident"]
[null,null,"WEATHER CORRECTED MD 10% POE","MVA","Non-coincident"]
[null,null,null,null,"Coincident"]
[null,null,"WEATHER CORRECTED MD 50% POE","MW","Non-coincident"]
[null,null,null,null,"Coincident"]
[null,null,"WEATHER CORRECTED MD 50% POE","MVA","Non-coincident"]
[null,null,null,null,"Coincident"]
[null,"NSP to enter name","CONNECTION POINT RATING","MVA","Non-coincident"]
[null,null,null,null,"Coincident"]
[null,null,"WINTER/SUMMER PEAKING",null,"Non-coincident"]
[null,null,null,null,"Coincident"]
[null,null,"ADJUSTMENTS - EMBEDDED GENERATION","MW","Non-coincident"]
[null,null,null,null,"Coincident"]
[null,null,"WEATHER CORRECTED MD 10% POE","MW","Non-coincident"]
[null,null,null,null,"Coincident"]
[null,null,"WEATHER CORRECTED MD 10% POE","MVA","Non-coincident"]
[null,null,null,null,"Coincident"]
[null,null,"WEATHER CORRECTED MD 50% POE","MW","Non-coincident"]
[null,null,null,null,"Coincident"]
[null,null,"WEATHER CORRECTED MD 50% POE","MVA","Non-coincident"]
[null,null,null,null,"Coincident"]
[null,"NSP to enter name","CONNECTION POINT RATING","MVA","Non-coincident"]
[null,null,null,null,"Coincident"]
[null,null,"WINTER/SUMMER PEAKING",null,"Non-coincident"]
[null,null,null,null,"Coincident"]
[null,null,"ADJUSTMENTS - EMBEDDED GENERATION","MW","Non-coincident"]
[null,null,null,null,"Coincident"]
[null,null,"WEATHER CORRECTED MD 10% POE","MW","Non-coincident"]
[null,null,null,null,"Coincident"]
[null,null,"WEATHER CORRECTED MD 10% POE","MVA","Non-coincident"]
[null,null,null,null,"Coincident"]
[null,null,"WEATHER CORRECTED MD 50% POE","MW","Non-coincident"]
[null,null,null,null,"Coincident"]
[null,null,"WEATHER CORRECTED MD 50% POE","MVA","Non-coincident"]
[null,null,null,null,"Coincident"]
[null,"NSP to enter name","CONNECTION POINT RATING","MVA","Non-coincident"]
[null,null,null,null,"Coincident"]
[null,null,"WINTER/SUMMER PEAKING",null,"Non-coincident"]
[null,null,null,null,"Coincident"]
[null,null,"ADJUSTMENTS - EMBEDDED GENERATION","MW","Non-coincident"]
[null,null,null,null,"Coincident"]
[null,null,"WEATHER CORRECTED MD 10% POE","MW","Non-coincident"]
[null,null,null,null,"Coincident"]
[null,null,"WEATHER CORRECTED MD 10% POE","MVA","Non-coincident"]
[null,null,null,null,"Coincident"]
[null,null,"WEATHER CORRECTED MD 50% POE","MW","Non-coincident"]
[null,null,null,null,"Coincident"]
[null,null,"WEATHER CORRECTED MD 50% POE","MVA","Non-coincident"]
[null,null,null,null,"Coincident"]
[null,"NSP to enter name","CONNECTION POINT RATING","MVA","Non-coincident"]
[null,null,null,null,"Coincident"]
[null,null,"WINTER/SUMMER PEAKING",null,"Non-coincident"]
[null,null,null,null,"Coincident"]
[null,null,"ADJUSTMENTS - EMBEDDED GENERATION","MW","Non-coincident"]
[null,null,null,null,"Coincident"]
[null,null,"WEATHER CORRECTED MD 10% POE","MW","Non-coincident"]
[null,null,null,null,"Coincident"]
[null,null,"WEATHER CORRECTED MD 10% POE","MVA","Non-coincident"]
[null,null,null,null,"Coincident"]
[null,null,"WEATHER CORRECTED MD 50% POE","MW","Non-coincident"]
[null,null,null,null,"Coincident"]
[null,null,"WEATHER CORRECTED MD 50% POE","MVA","Non-coincident"]
[null,null,null,null,"Coincident"]
[null,"NSP to enter name","CONNECTION POINT RATING","MVA","Non-coincident"]
[null,null,null,null,"Coincident"]
[null,null,"WINTER/SUMMER PEAKING",null,"Non-coincident"]
[null,null,null,null,"Coincident"]
[null,null,"ADJUSTMENTS - EMBEDDED GENERATION","MW","Non-coincident"]
[null,null,null,null,"Coincident"]
[null,null,"WEATHER CORRECTED MD 10% POE","MW","Non-coincident"]
[null,null,null,null,"Coincident"]
[null,null,"WEATHER CORRECTED MD 10% POE","MVA","Non-coincident"]
[null,null,null,null,"Coincident"]
[null,null,"WEATHER CORRECTED MD 50% POE","MW","Non-coincident"]
[null,null,null,null,"Coincident"]
[null,null,"WEATHER CORRECTED MD 50% POE","MVA","Non-coincident"]
[null,null,null,null,"Coincident"]
[null,"NSP to enter name","CONNECTION POINT RATING","MVA","Non-coincident"]
[null,null,null,null,"Coincident"]
[null,null,"WINTER/SUMMER PEAKING",null,"Non-coincident"]
[null,null,null,null,"Coincident"]
[null,null,"ADJUSTMENTS - EMBEDDED GENERATION","MW","Non-coincident"]
[null,null,null,null,"Coincident"]
[null,null,"WEATHER CORRECTED MD 10% POE","MW","Non-coincident"]
[null,null,null,null,"Coincident"]
[null,null,"WEATHER CORRECTED MD 10% POE","MVA","Non-coincident"]
[null,null,null,null,"Coincident"]
[null,null,"WEATHER CORRECTED MD 50% POE","MW","Non-coincident"]
[null,null,null,null,"Coincident"]
[null,null,"WEATHER CORRECTED MD 50% POE","MVA","Non-coincident"]
[null,null,null,null,"Coincident"]
[null,"NSP to enter name","CONNECTION POINT RATING","MVA","Non-coincident"]
[null,null,null,null,"Coincident"]
[null,null,"WINTER/SUMMER PEAKING",null,"Non-coincident"]
[null,null,null,null,"Coincident"]
[null,null,"ADJUSTMENTS - EMBEDDED GENERATION","MW","Non-coincident"]
[null,null,null,null,"Coincident"]
[null,null,"WEATHER CORRECTED MD 10% POE","MW","Non-coincident"]
[null,null,null,null,"Coincident"]
[null,null,"WEATHER CORRECTED MD 10% POE","MVA","Non-coincident"]
[null,null,null,null,"Coincident"]
[null,null,"WEATHER CORRECTED MD 50% POE","MW","Non-coincident"]
[null,null,null,null,"Coincident"]
[null,null,"WEATHER CORRECTED MD 50% POE","MVA","Non-coincident"]
[null,null,null,null,"Coincident"]
[null,"NSP to enter name","CONNECTION POINT RATING","MVA","Non-coincident"]
[null,null,null,null,"Coincident"]
[null,null,"WINTER/SUMMER PEAKING",null,"Non-coincident"]
[null,null,null,null,"Coincident"]
[null,null,"ADJUSTMENTS - EMBEDDED GENERATION","MW","Non-coincident"]
[null,null,null,null,"Coincident"]
[null,null,"WEATHER CORRECTED MD 10% POE","MW","Non-coincident"]
[null,null,null,null,"Coincident"]
[null,null,"WEATHER CORRECTED MD 10% POE","MVA","Non-coincident"]
[null,null,null,null,"Coincident"]
[null,null,"WEATHER CORRECTED MD 50% POE","MW","Non-coincident"]
[null,null,null,null,"Coincident"]
[null,null,"WEATHER CORRECTED MD 50% POE","MVA","Non-coincident"]
[null,null,null,null,"Coincident"]
[null,"NSP to enter name","CONNECTION POINT RATING","MVA","Non-coincident"]
[null,null,null,null,"Coincident"]
[null,null,"WINTER/SUMMER PEAKING",null,"Non-coincident"]
[null,null,null,null,"Coincident"]
[null,null,"ADJUSTMENTS - EMBEDDED GENERATION","MW","Non-coincident"]
[null,null,null,null,"Coincident"]
[null,null,"WEATHER CORRECTED MD 10% POE","MW","Non-coincident"]
[null,null,null,null,"Coincident"]
[null,null,"WEATHER CORRECTED MD 10% POE","MVA","Non-coincident"]
[null,null,null,null,"Coincident"]
[null,null,"WEATHER CORRECTED MD 50% POE","MW","Non-coincident"]
[null,null,null,null,"Coincident"]
[null,null,"WEATHER CORRECTED MD 50% POE","MVA","Non-coincident"]
[null,null,null,null,"Coincident"]
[null,"NSP to enter name","CONNECTION POINT RATING","MVA","Non-coincident"]
[null,null,null,null,"Coincident"]
[null,null,"WINTER/SUMMER PEAKING",null,"Non-coincident"]
[null,null,null,null,"Coincident"]
[null,null,"ADJUSTMENTS - EMBEDDED GENERATION","MW","Non-coincident"]
[null,null,null,null,"Coincident"]
[null,null,"WEATHER CORRECTED MD 10% POE","MW","Non-coincident"]
[null,null,null,null,"Coincident"]
[null,null,"WEATHER CORRECTED MD 10% POE","MVA","Non-coincident"]
[null,null,null,null,"Coincident"]
[null,null,"WEATHER CORRECTED MD 50% POE","MW","Non-coincident"]
[null,null,null,null,"Coincident"]
[null,null,"WEATHER CORRECTED MD 50% POE","MVA","Non-coincident"]
[null,null,null,null,"Coincident"]
[null,"NSP to enter name","CONNECTION POINT RATING","MVA","Non-coincident"]
[null,null,null,null,"Coincident"]
[null,null,"WINTER/SUMMER PEAKING",null,"Non-coincident"]
[null,null,null,null,"Coincident"]
[null,null,"ADJUSTMENTS - EMBEDDED GENERATION","MW","Non-coincident"]
[null,null,null,null,"Coincident"]
[null,null,"WEATHER CORRECTED MD 10% POE","MW","Non-coincident"]
[null,null,null,null,"Coincident"]
[null,null,"WEATHER CORRECTED MD 10% POE","MVA","Non-coincident"]
[null,null,null,null,"Coincident"]
[null,null,"WEATHER CORRECTED MD 50% POE","MW","Non-coincident"]
[null,null,null,null,"Coincident"]
[null,null,"WEATHER CORRECTED MD 50% POE","MVA","Non-coincident"]
[null,null,null,null,"Coincident"]
[null,"NSP to enter name","CONNECTION POINT RATING","MVA","Non-coincident"]
[null,null,null,null,"Coincident"]
[null,null,"WINTER/SUMMER PEAKING",null,"Non-coincident"]
[null,null,null,null,"Coincident"]
[null,null,"ADJUSTMENTS - EMBEDDED GENERATION","MW","Non-coincident"]
[null,null,null,null,"Coincident"]
[null,null,"WEATHER CORRECTED MD 10% POE","MW","Non-coincident"]
[null,null,null,null,"Coincident"]
[null,null,"WEATHER CORRECTED MD 10% POE","MVA","Non-coincident"]
[null,null,null,null,"Coincident"]
[null,null,"WEATHER CORRECTED MD 50% POE","MW","Non-coincident"]
[null,null,null,null,"Coincident"]
[null,null,"WEATHER CORRECTED MD 50% POE","MVA","Non-coincident"]
[null,null,null,null,"Coincident"]
[null,"NSP to enter name","CONNECTION POINT RATING","MVA","Non-coincident"]
[null,null,null,null,"Coincident"]
[null,null,"WINTER/SUMMER PEAKING",null,"Non-coincident"]
[null,null,null,null,"Coincident"]
[null,null,"ADJUSTMENTS - EMBEDDED GENERATION","MW","Non-coincident"]
[null,null,null,null,"Coincident"]
[null,null,"WEATHER CORRECTED MD 10% POE","MW","Non-coincident"]
[null,null,null,null,"Coincident"]
[null,null,"WEATHER CORRECTED MD 10% POE","MVA","Non-coincident"]
[null,null,null,null,"Coincident"]
[null,null,"WEATHER CORRECTED MD 50% POE","MW","Non-coincident"]
[null,null,null,null,"Coincident"]
[null,null,"WEATHER CORRECTED MD 50% POE","MVA","Non-coincident"]
[null,null,null,null,"Coincident"]
[null,"NSP to enter name","CONNECTION POINT RATING","MVA","Non-coincident"]
[null,null,null,null,"Coincident"]
[null,null,"WINTER/SUMMER PEAKING",null,"Non-coincident"]
[null,null,null,null,"Coincident"]
[null,null,"ADJUSTMENTS - EMBEDDED GENERATION","MW","Non-coincident"]
[null,null,null,null,"Coincident"]
[null,null,"WEATHER CORRECTED MD 10% POE","MW","Non-coincident"]
[null,null,null,null,"Coincident"]
[null,null,"WEATHER CORRECTED MD 10% POE","MVA","Non-coincident"]
[null,null,null,null,"Coincident"]
[null,null,"WEATHER CORRECTED MD 50% POE","MW","Non-coincident"]
[null,null,null,null,"Coincident"]
[null,null,"WEATHER CORRECTED MD 50% POE","MVA","Non-coincident"]
[null,null,null,null,"Coincident"]
[null,"NSP to enter name","CONNECTION POINT RATING","MVA","Non-coincident"]
[null,null,null,null,"Coincident"]
[null,null,"WINTER/SUMMER PEAKING",null,"Non-coincident"]
[null,null,null,null,"Coincident"]
[null,null,"ADJUSTMENTS - EMBEDDED GENERATION","MW","Non-coincident"]
[null,null,null,null,"Coincident"]
[null,null,"WEATHER CORRECTED MD 10% POE","MW","Non-coincident"]
[null,null,null,null,"Coincident"]
[null,null,"WEATHER CORRECTED MD 10% POE","MVA","Non-coincident"]
[null,null,null,null,"Coincident"]
[null,null,"WEATHER CORRECTED MD 50% POE","MW","Non-coincident"]
[null,null,null,null,"Coincident"]
[null,null,"WEATHER CORRECTED MD 50% POE","MVA","Non-coincident"]
[null,null,null,null,"Coincident"]
[null,"NSP to enter name","CONNECTION POINT RATING","MVA","Non-coincident"]
[null,null,null,null,"Coincident"]
[null,null,"WINTER/SUMMER PEAKING",null,"Non-coincident"]
[null,null,null,null,"Coincident"]
[null,null,"ADJUSTMENTS - EMBEDDED GENERATION","MW","Non-coincident"]
[null,null,null,null,"Coincident"]
[null,null,"WEATHER CORRECTED MD 10% POE","MW","Non-coincident"]
[null,null,null,null,"Coincident"]
[null,null,"WEATHER CORRECTED MD 10% POE","MVA","Non-coincident"]
[null,null,null,null,"Coincident"]
[null,null,"WEATHER CORRECTED MD 50% POE","MW","Non-coincident"]
[null,null,null,null,"Coincident"]
[null,null,"WEATHER CORRECTED MD 50% POE","MVA","Non-coincident"]
[null,null,null,null,"Coincident"]
[null,"NSP to enter name","CONNECTION POINT RATING","MVA","Non-coincident"]
[null,null,null,null,"Coincident"]
[null,null,"WINTER/SUMMER PEAKING",null,"Non-coincident"]
[null,null,null,null,"Coincident"]
[null,null,"ADJUSTMENTS - EMBEDDED GENERATION","MW","Non-coincident"]
[null,null,null,null,"Coincident"]
[null,null,"WEATHER CORRECTED MD 10% POE","MW","Non-coincident"]
[null,null,null,null,"Coincident"]
[null,null,"WEATHER CORRECTED MD 10% POE","MVA","Non-coincident"]
[null,null,null,null,"Coincident"]
[null,null,"WEATHER CORRECTED MD 50% POE","MW","Non-coincident"]
[null,null,null,null,"Coincident"]
[null,null,"WEATHER CORRECTED MD 50% POE","MVA","Non-coincident"]
[null,null,null,null,"Coincident"]
[null,"NSP to enter name","CONNECTION POINT RATING","MVA","Non-coincident"]
[null,null,null,null,"Coincident"]
[null,null,"WINTER/SUMMER PEAKING",null,"Non-coincident"]
[null,null,null,null,"Coincident"]
[null,null,"ADJUSTMENTS - EMBEDDED GENERATION","MW","Non-coincident"]
[null,null,null,null,"Coincident"]
[null,null,"WEATHER CORRECTED MD 10% POE","MW","Non-coincident"]
[null,null,null,null,"Coincident"]
[null,null,"WEATHER CORRECTED MD 10% POE","MVA","Non-coincident"]
[null,null,null,null,"Coincident"]
[null,null,"WEATHER CORRECTED MD 50% POE","MW","Non-coincident"]
[null,null,null,null,"Coincident"]
[null,null,"WEATHER CORRECTED MD 50% POE","MVA","Non-coincident"]
[null,null,null,null,"Coincident"]
[null,"NSP to enter name","CONNECTION POINT RATING","MVA","Non-coincident"]
[null,null,null,null,"Coincident"]
[null,null,"WINTER/SUMMER PEAKING",null,"Non-coincident"]
[null,null,null,null,"Coincident"]
[null,null,"ADJUSTMENTS - EMBEDDED GENERATION","MW","Non-coincident"]
[null,null,null,null,"Coincident"]
[null,null,"WEATHER CORRECTED MD 10% POE","MW","Non-coincident"]
[null,null,null,null,"Coincident"]
[null,null,"WEATHER CORRECTED MD 10% POE","MVA","Non-coincident"]
[null,null,null,null,"Coincident"]
[null,null,"WEATHER CORRECTED MD 50% POE","MW","Non-coincident"]
[null,null,null,null,"Coincident"]
[null,null,"WEATHER CORRECTED MD 50% POE","MVA","Non-coincident"]
[null,null,null,null,"Coincident"]
[null,"NSP to enter name","CONNECTION POINT RATING","MVA","Non-coincident"]
[null,null,null,null,"Coincident"]
[null,null,"WINTER/SUMMER PEAKING",null,"Non-coincident"]
[null,null,null,null,"Coincident"]
[null,null,"ADJUSTMENTS - EMBEDDED GENERATION","MW","Non-coincident"]
[null,null,null,null,"Coincident"]
[null,null,"WEATHER CORRECTED MD 10% POE","MW","Non-coincident"]
[null,null,null,null,"Coincident"]
[null,null,"WEATHER CORRECTED MD 10% POE","MVA","Non-coincident"]
[null,null,null,null,"Coincident"]
[null,null,"WEATHER CORRECTED MD 50% POE","MW","Non-coincident"]
[null,null,null,null,"Coincident"]
[null,null,"WEATHER CORRECTED MD 50% POE","MVA","Non-coincident"]
[null,null,null,null,"Coincident"]
[null,"NSP to enter name","CONNECTION POINT RATING","MVA","Non-coincident"]
[null,null,null,null,"Coincident"]
[null,null,"WINTER/SUMMER PEAKING",null,"Non-coincident"]
[null,null,null,null,"Coincident"]
[null,null,"ADJUSTMENTS - EMBEDDED GENERATION","MW","Non-coincident"]
[null,null,null,null,"Coincident"]
[null,null,"WEATHER CORRECTED MD 10% POE","MW","Non-coincident"]
[null,null,null,null,"Coincident"]
[null,null,"WEATHER CORRECTED MD 10% POE","MVA","Non-coincident"]
[null,null,null,null,"Coincident"]
[null,null,"WEATHER CORRECTED MD 50% POE","MW","Non-coincident"]
[null,null,null,null,"Coincident"]
[null,null,"WEATHER CORRECTED MD 50% POE","MVA","Non-coincident"]
[null,null,null,null,"Coincident"]
[null,"NSP to enter name","CONNECTION POINT RATING","MVA","Non-coincident"]
[null,null,null,null,"Coincident"]
[null,null,"WINTER/SUMMER PEAKING",null,"Non-coincident"]
[null,null,null,null,"Coincident"]
[null,null,"ADJUSTMENTS - EMBEDDED GENERATION","MW","Non-coincident"]
[null,null,null,null,"Coincident"]
[null,null,"WEATHER CORRECTED MD 10% POE","MW","Non-coincident"]
[null,null,null,null,"Coincident"]
[null,null,"WEATHER CORRECTED MD 10% POE","MVA","Non-coincident"]
[null,null,null,null,"Coincident"]
[null,null,"WEATHER CORRECTED MD 50% POE","MW","Non-coincident"]
[null,null,null,null,"Coincident"]
[null,null,"WEATHER CORRECTED MD 50% POE","MVA","Non-coincident"]
[null,null,null,null,"Coincident"]
[null,"NSP to enter name","CONNECTION POINT RATING","MVA","Non-coincident"]
[null,null,null,null,"Coincident"]
[null,null,"WINTER/SUMMER PEAKING",null,"Non-coincident"]
[null,null,null,null,"Coincident"]
[null,null,"ADJUSTMENTS - EMBEDDED GENERATION","MW","Non-coincident"]
[null,null,null,null,"Coincident"]
[null,null,"WEATHER CORRECTED MD 10% POE","MW","Non-coincident"]
[null,null,null,null,"Coincident"]
[null,null,"WEATHER CORRECTED MD 10% POE","MVA","Non-coincident"]
[null,null,null,null,"Coincident"]
[null,null,"WEATHER CORRECTED MD 50% POE","MW","Non-coincident"]
[null,null,null,null,"Coincident"]
[null,null,"WEATHER CORRECTED MD 50% POE","MVA","Non-coincident"]
[null,null,null,null,"Coincident"]
[null,"NSP to enter name","CONNECTION POINT RATING","MVA","Non-coincident"]
[null,null,null,null,"Coincident"]
[null,null,"WINTER/SUMMER PEAKING",null,"Non-coincident"]
[null,null,null,null,"Coincident"]
[null,null,"ADJUSTMENTS - EMBEDDED GENERATION","MW","Non-coincident"]
[null,null,null,null,"Coincident"]
[null,null,"WEATHER CORRECTED MD 10% POE","MW","Non-coincident"]
[null,null,null,null,"Coincident"]
[null,null,"WEATHER CORRECTED MD 10% POE","MVA","Non-coincident"]
[null,null,null,null,"Coincident"]
[null,null,"WEATHER CORRECTED MD 50% POE","MW","Non-coincident"]
[null,null,null,null,"Coincident"]
[null,null,"WEATHER CORRECTED MD 50% POE","MVA","Non-coincident"]
[null,null,null,null,"Coincident"]
[null,"NSP to enter name","CONNECTION POINT RATING","MVA","Non-coincident"]
[null,null,null,null,"Coincident"]
[null,null,"WINTER/SUMMER PEAKING",null,"Non-coincident"]
[null,null,null,null,"Coincident"]
[null,null,"ADJUSTMENTS - EMBEDDED GENERATION","MW","Non-coincident"]
[null,null,null,null,"Coincident"]
[null,null,"WEATHER CORRECTED MD 10% POE","MW","Non-coincident"]
[null,null,null,null,"Coincident"]
[null,null,"WEATHER CORRECTED MD 10% POE","MVA","Non-coincident"]
[null,null,null,null,"Coincident"]
[null,null,"WEATHER CORRECTED MD 50% POE","MW","Non-coincident"]
[null,null,null,null,"Coincident"]
[null,null,"WEATHER CORRECTED MD 50% POE","MVA","Non-coincident"]
[null,null,null,null,"Coincident"]
[null,"NSP to enter name","CONNECTION POINT RATING","MVA","Non-coincident"]
[null,null,null,null,"Coincident"]
[null,null,"WINTER/SUMMER PEAKING",null,"Non-coincident"]
[null,null,null,null,"Coincident"]
[null,null,"ADJUSTMENTS - EMBEDDED GENERATION","MW","Non-coincident"]
[null,null,null,null,"Coincident"]
[null,null,"WEATHER CORRECTED MD 10% POE","MW","Non-coincident"]
[null,null,null,null,"Coincident"]
[null,null,"WEATHER CORRECTED MD 10% POE","MVA","Non-coincident"]
[null,null,null,null,"Coincident"]
[null,null,"WEATHER CORRECTED MD 50% POE","MW","Non-coincident"]
[null,null,null,null,"Coincident"]
[null,null,"WEATHER CORRECTED MD 50% POE","MVA","Non-coincident"]
[null,null,null,null,"Coincident"]
[null,"NSP to enter name","CONNECTION POINT RATING","MVA","Non-coincident"]
[null,null,null,null,"Coincident"]
[null,null,"WINTER/SUMMER PEAKING",null,"Non-coincident"]
[null,null,null,null,"Coincident"]
[null,null,"ADJUSTMENTS - EMBEDDED GENERATION","MW","Non-coincident"]
[null,null,null,null,"Coincident"]
[null,null,"WEATHER CORRECTED MD 10% POE","MW","Non-coincident"]
[null,null,null,null,"Coincident"]
[null,null,"WEATHER CORRECTED MD 10% POE","MVA","Non-coincident"]
[null,null,null,null,"Coincident"]
[null,null,"WEATHER CORRECTED MD 50% POE","MW","Non-coincident"]
[null,null,null,null,"Coincident"]
[null,null,"WEATHER CORRECTED MD 50% POE","MVA","Non-coincident"]
[null,null,null,null,"Coincident"]
[null,"NSP to enter name","CONNECTION POINT RATING","MVA","Non-coincident"]
[null,null,null,null,"Coincident"]
[null,null,"WINTER/SUMMER PEAKING",null,"Non-coincident"]
[null,null,null,null,"Coincident"]
[null,null,"ADJUSTMENTS - EMBEDDED GENERATION","MW","Non-coincident"]
[null,null,null,null,"Coincident"]
[null,null,"WEATHER CORRECTED MD 10% POE","MW","Non-coincident"]
[null,null,null,null,"Coincident"]
[null,null,"WEATHER CORRECTED MD 10% POE","MVA","Non-coincident"]
[null,null,null,null,"Coincident"]
[null,null,"WEATHER CORRECTED MD 50% POE","MW","Non-coincident"]
[null,null,null,null,"Coincident"]
[null,null,"WEATHER CORRECTED MD 50% POE","MVA","Non-coincident"]
[null,null,null,null,"Coincident"]
[null,"NSP to enter name","CONNECTION POINT RATING","MVA","Non-coincident"]
[null,null,null,null,"Coincident"]
[null,null,"WINTER/SUMMER PEAKING",null,"Non-coincident"]
[null,null,null,null,"Coincident"]
[null,null,"ADJUSTMENTS - EMBEDDED GENERATION","MW","Non-coincident"]
[null,null,null,null,"Coincident"]
[null,null,"WEATHER CORRECTED MD 10% POE","MW","Non-coincident"]
[null,null,null,null,"Coincident"]
[null,null,"WEATHER CORRECTED MD 10% POE","MVA","Non-coincident"]
[null,null,null,null,"Coincident"]
[null,null,"WEATHER CORRECTED MD 50% POE","MW","Non-coincident"]
[null,null,null,null,"Coincident"]
[null,null,"WEATHER CORRECTED MD 50% POE","MVA","Non-coincident"]
[null,null,null,null,"Coincident"]
[null,"NSP to enter name","CONNECTION POINT RATING","MVA","Non-coincident"]
[null,null,null,null,"Coincident"]
[null,null,"WINTER/SUMMER PEAKING",null,"Non-coincident"]
[null,null,null,null,"Coincident"]
[null,null,"ADJUSTMENTS - EMBEDDED GENERATION","MW","Non-coincident"]
[null,null,null,null,"Coincident"]
[null,null,"WEATHER CORRECTED MD 10% POE","MW","Non-coincident"]
[null,null,null,null,"Coincident"]
[null,null,"WEATHER CORRECTED MD 10% POE","MVA","Non-coincident"]
[null,null,null,null,"Coincident"]
[null,null,"WEATHER CORRECTED MD 50% POE","MW","Non-coincident"]
[null,null,null,null,"Coincident"]
[null,null,"WEATHER CORRECTED MD 50% POE","MVA","Non-coincident"]
[null,null,null,null,"Coincident"]
[null,"NSP to enter name","CONNECTION POINT RATING","MVA","Non-coincident"]
[null,null,null,null,"Coincident"]
[null,null,"WINTER/SUMMER PEAKING",null,"Non-coincident"]
[null,null,null,null,"Coincident"]
[null,null,"ADJUSTMENTS - EMBEDDED GENERATION","MW","Non-coincident"]
[null,null,null,null,"Coincident"]
[null,null,"WEATHER CORRECTED MD 10% POE","MW","Non-coincident"]
[null,null,null,null,"Coincident"]
[null,null,"WEATHER CORRECTED MD 10% POE","MVA","Non-coincident"]
[null,null,null,null,"Coincident"]
[null,null,"WEATHER CORRECTED MD 50% POE","MW","Non-coincident"]
[null,null,null,null,"Coincident"]
[null,null,"WEATHER CORRECTED MD 50% POE","MVA","Non-coincident"]
[null,null,null,null,"Coincident"]
[null,"NSP to enter name","CONNECTION POINT RATING","MVA","Non-coincident"]
[null,null,null,null,"Coincident"]
[null,null,"WINTER/SUMMER PEAKING",null,"Non-coincident"]
[null,null,null,null,"Coincident"]
[null,null,"ADJUSTMENTS - EMBEDDED GENERATION","MW","Non-coincident"]
[null,null,null,null,"Coincident"]
[null,null,"WEATHER CORRECTED MD 10% POE","MW","Non-coincident"]
[null,null,null,null,"Coincident"]
[null,null,"WEATHER CORRECTED MD 10% POE","MVA","Non-coincident"]
[null,null,null,null,"Coincident"]
[null,null,"WEATHER CORRECTED MD 50% POE","MW","Non-coincident"]
[null,null,null,null,"Coincident"]
[null,null,"WEATHER CORRECTED MD 50% POE","MVA","Non-coincident"]
[null,null,null,null,"Coincident"]
[null,"NSP to enter name","CONNECTION POINT RATING","MVA","Non-coincident"]
[null,null,null,null,"Coincident"]
[null,null,"WINTER/SUMMER PEAKING",null,"Non-coincident"]
[null,null,null,null,"Coincident"]
[null,null,"ADJUSTMENTS - EMBEDDED GENERATION","MW","Non-coincident"]
[null,null,null,null,"Coincident"]
[null,null,"WEATHER CORRECTED MD 10% POE","MW","Non-coincident"]
[null,null,null,null,"Coincident"]
[null,null,"WEATHER CORRECTED MD 10% POE","MVA","Non-coincident"]
[null,null,null,null,"Coincident"]
[null,null,"WEATHER CORRECTED MD 50% POE","MW","Non-coincident"]
[null,null,null,null,"Coincident"]
[null,null,"WEATHER CORRECTED MD 50% POE","MVA","Non-coincident"]
[null,null,null,null,"Coincident"]
[null,"NSP to enter name","CONNECTION POINT RATING","MVA","Non-coincident"]
[null,null,null,null,"Coincident"]
[null,null,"WINTER/SUMMER PEAKING",null,"Non-coincident"]
[null,null,null,null,"Coincident"]
[null,null,"ADJUSTMENTS - EMBEDDED GENERATION","MW","Non-coincident"]
[null,null,null,null,"Coincident"]
[null,null,"WEATHER CORRECTED MD 10% POE","MW","Non-coincident"]
[null,null,null,null,"Coincident"]
[null,null,"WEATHER CORRECTED MD 10% POE","MVA","Non-coincident"]
[null,null,null,null,"Coincident"]
[null,null,"WEATHER CORRECTED MD 50% POE","MW","Non-coincident"]
[null,null,null,null,"Coincident"]
[null,null,"WEATHER CORRECTED MD 50% POE","MVA","Non-coincident"]
[null,null,null,null,"Coincident"]
[null,"NSP to enter name","CONNECTION POINT RATING","MVA","Non-coincident"]
[null,null,null,null,"Coincident"]
[null,null,"WINTER/SUMMER PEAKING",null,"Non-coincident"]
[null,null,null,null,"Coincident"]
[null,null,"ADJUSTMENTS - EMBEDDED GENERATION","MW","Non-coincident"]
[null,null,null,null,"Coincident"]
[null,null,"WEATHER CORRECTED MD 10% POE","MW","Non-coincident"]
[null,null,null,null,"Coincident"]
[null,null,"WEATHER CORRECTED MD 10% POE","MVA","Non-coincident"]
[null,null,null,null,"Coincident"]
[null,null,"WEATHER CORRECTED MD 50% POE","MW","Non-coincident"]
[null,null,null,null,"Coincident"]
[null,null,"WEATHER CORRECTED MD 50% POE","MVA","Non-coincident"]
[null,null,null,null,"Coincident"]
[null,"NSP to enter name","CONNECTION POINT RATING","MVA","Non-coincident"]
[null,null,null,null,"Coincident"]
[null,null,"WINTER/SUMMER PEAKING",null,"Non-coincident"]
[null,null,null,null,"Coincident"]
[null,null,"ADJUSTMENTS - EMBEDDED GENERATION","MW","Non-coincident"]
[null,null,null,null,"Coincident"]
[null,null,"WEATHER CORRECTED MD 10% POE","MW","Non-coincident"]
[null,null,null,null,"Coincident"]
[null,null,"WEATHER CORRECTED MD 10% POE","MVA","Non-coincident"]
[null,null,null,null,"Coincident"]
[null,null,"WEATHER CORRECTED MD 50% POE","MW","Non-coincident"]
[null,null,null,null,"Coincident"]
[null,null,"WEATHER CORRECTED MD 50% POE","MVA","Non-coincident"]
[null,null,null,null,"Coincident"]
[null,"NSP to enter name","CONNECTION POINT RATING","MVA","Non-coincident"]
[null,null,null,null,"Coincident"]
[null,null,"WINTER/SUMMER PEAKING",null,"Non-coincident"]
[null,null,null,null,"Coincident"]
[null,null,"ADJUSTMENTS - EMBEDDED GENERATION","MW","Non-coincident"]
[null,null,null,null,"Coincident"]
[null,null,"WEATHER CORRECTED MD 10% POE","MW","Non-coincident"]
[null,null,null,null,"Coincident"]
[null,null,"WEATHER CORRECTED MD 10% POE","MVA","Non-coincident"]
[null,null,null,null,"Coincident"]
[null,null,"WEATHER CORRECTED MD 50% POE","MW","Non-coincident"]
[null,null,null,null,"Coincident"]
[null,null,"WEATHER CORRECTED MD 50% POE","MVA","Non-coincident"]
[null,null,null,null,"Coincident"]
[null,"NSP to enter name","CONNECTION POINT RATING","MVA","Non-coincident"]
[null,null,null,null,"Coincident"]
[null,null,"WINTER/SUMMER PEAKING",null,"Non-coincident"]
[null,null,null,null,"Coincident"]
[null,null,"ADJUSTMENTS - EMBEDDED GENERATION","MW","Non-coincident"]
[null,null,null,null,"Coincident"]
[null,null,"WEATHER CORRECTED MD 10% POE","MW","Non-coincident"]
[null,null,null,null,"Coincident"]
[null,null,"WEATHER CORRECTED MD 10% POE","MVA","Non-coincident"]
[null,null,null,null,"Coincident"]
[null,null,"WEATHER CORRECTED MD 50% POE","MW","Non-coincident"]
[null,null,null,null,"Coincident"]
[null,null,"WEATHER CORRECTED MD 50% POE","MVA","Non-coincident"]
[null,null,null,null,"Coincident"]
[null,"NSP to enter name","CONNECTION POINT RATING","MVA","Non-coincident"]
[null,null,null,null,"Coincident"]
[null,null,"WINTER/SUMMER PEAKING",null,"Non-coincident"]
[null,null,null,null,"Coincident"]
[null,null,"ADJUSTMENTS - EMBEDDED GENERATION","MW","Non-coincident"]
[null,null,null,null,"Coincident"]
[null,null,"WEATHER CORRECTED MD 10% POE","MW","Non-coincident"]
[null,null,null,null,"Coincident"]
[null,null,"WEATHER CORRECTED MD 10% POE","MVA","Non-coincident"]
[null,null,null,null,"Coincident"]
[null,null,"WEATHER CORRECTED MD 50% POE","MW","Non-coincident"]
[null,null,null,null,"Coincident"]
[null,null,"WEATHER CORRECTED MD 50% POE","MVA","Non-coincident"]
[null,null,null,null,"Coincident"]
[null,"NSP to enter name","CONNECTION POINT RATING","MVA","Non-coincident"]
[null,null,null,null,"Coincident"]
[null,null,"WINTER/SUMMER PEAKING",null,"Non-coincident"]
[null,null,null,null,"Coincident"]
[null,null,"ADJUSTMENTS - EMBEDDED GENERATION","MW","Non-coincident"]
[null,null,null,null,"Coincident"]
[null,null,"WEATHER CORRECTED MD 10% POE","MW","Non-coincident"]
[null,null,null,null,"Coincident"]
[null,null,"WEATHER CORRECTED MD 10% POE","MVA","Non-coincident"]
[null,null,null,null,"Coincident"]
[null,null,"WEATHER CORRECTED MD 50% POE","MW","Non-coincident"]
[null,null,null,null,"Coincident"]
[null,null,"WEATHER CORRECTED MD 50% POE","MVA","Non-coincident"]
[null,null,null,null,"Coincident"]
[null,"NSP to enter name","CONNECTION POINT RATING","MVA","Non-coincident"]
[null,null,null,null,"Coincident"]
[null,null,"WINTER/SUMMER PEAKING",null,"Non-coincident"]
[null,null,null,null,"Coincident"]
[null,null,"ADJUSTMENTS - EMBEDDED GENERATION","MW","Non-coincident"]
[null,null,null,null,"Coincident"]
[null,null,"WEATHER CORRECTED MD 10% POE","MW","Non-coincident"]
[null,null,null,null,"Coincident"]
[null,null,"WEATHER CORRECTED MD 10% POE","MVA","Non-coincident"]
[null,null,null,null,"Coincident"]
[null,null,"WEATHER CORRECTED MD 50% POE","MW","Non-coincident"]
[null,null,null,null,"Coincident"]
[null,null,"WEATHER CORRECTED MD 50% POE","MVA","Non-coincident"]
[null,null,null,null,"Coincident"]
[null,"NSP to enter name","CONNECTION POINT RATING","MVA","Non-coincident"]
[null,null,null,null,"Coincident"]
[null,null,"WINTER/SUMMER PEAKING",null,"Non-coincident"]
[null,null,null,null,"Coincident"]
[null,null,"ADJUSTMENTS - EMBEDDED GENERATION","MW","Non-coincident"]
[null,null,null,null,"Coincident"]
[null,null,"WEATHER CORRECTED MD 10% POE","MW","Non-coincident"]
[null,null,null,null,"Coincident"]
[null,null,"WEATHER CORRECTED MD 10% POE","MVA","Non-coincident"]
[null,null,null,null,"Coincident"]
[null,null,"WEATHER CORRECTED MD 50% POE","MW","Non-coincident"]
[null,null,null,null,"Coincident"]
[null,null,"WEATHER CORRECTED MD 50% POE","MVA","Non-coincident"]
[null,null,null,null,"Coincident"]
[null,"NSP to enter name","CONNECTION POINT RATING","MVA","Non-coincident"]
[null,null,null,null,"Coincident"]
[null,null,"WINTER/SUMMER PEAKING",null,"Non-coincident"]
[null,null,null,null,"Coincident"]
[null,null,"ADJUSTMENTS - EMBEDDED GENERATION","MW","Non-coincident"]
[null,null,null,null,"Coincident"]
[null,null,"WEATHER CORRECTED MD 10% POE","MW","Non-coincident"]
[null,null,null,null,"Coincident"]
[null,null,"WEATHER CORRECTED MD 10% POE","MVA","Non-coincident"]
[null,null,null,null,"Coincident"]
[null,null,"WEATHER CORRECTED MD 50% POE","MW","Non-coincident"]
[null,null,null,null,"Coincident"]
[null,null,"WEATHER CORRECTED MD 50% POE","MVA","Non-coincident"]
[null,null,null,null,"Coincident"]
[null,"NSP to enter name","CONNECTION POINT RATING","MVA","Non-coincident"]
[null,null,null,null,"Coincident"]
[null,null,"WINTER/SUMMER PEAKING",null,"Non-coincident"]
[null,null,null,null,"Coincident"]
[null,null,"ADJUSTMENTS - EMBEDDED GENERATION","MW","Non-coincident"]
[null,null,null,null,"Coincident"]
[null,null,"WEATHER CORRECTED MD 10% POE","MW","Non-coincident"]
[null,null,null,null,"Coincident"]
[null,null,"WEATHER CORRECTED MD 10% POE","MVA","Non-coincident"]
[null,null,null,null,"Coincident"]
[null,null,"WEATHER CORRECTED MD 50% POE","MW","Non-coincident"]
[null,null,null,null,"Coincident"]
[null,null,"WEATHER CORRECTED MD 50% POE","MVA","Non-coincident"]
[null,null,null,null,"Coincident"]
[null,"NSP to enter name","CONNECTION POINT RATING","MVA","Non-coincident"]
[null,null,null,null,"Coincident"]
[null,null,"WINTER/SUMMER PEAKING",null,"Non-coincident"]
[null,null,null,null,"Coincident"]
[null,null,"ADJUSTMENTS - EMBEDDED GENERATION","MW","Non-coincident"]
[null,null,null,null,"Coincident"]
[null,null,"WEATHER CORRECTED MD 10% POE","MW","Non-coincident"]
[null,null,null,null,"Coincident"]
[null,null,"WEATHER CORRECTED MD 10% POE","MVA","Non-coincident"]
[null,null,null,null,"Coincident"]
[null,null,"WEATHER CORRECTED MD 50% POE","MW","Non-coincident"]
[null,null,null,null,"Coincident"]
[null,null,"WEATHER CORRECTED MD 50% POE","MVA","Non-coincident"]
[null,null,null,null,"Coincident"]
[null,"NSP to enter name","CONNECTION POINT RATING","MVA","Non-coincident"]
[null,null,null,null,"Coincident"]
[null,null,"WINTER/SUMMER PEAKING",null,"Non-coincident"]
[null,null,null,null,"Coincident"]
[null,null,"ADJUSTMENTS - EMBEDDED GENERATION","MW","Non-coincident"]
[null,null,null,null,"Coincident"]
[null,null,"WEATHER CORRECTED MD 10% POE","MW","Non-coincident"]
[null,null,null,null,"Coincident"]
[null,null,"WEATHER CORRECTED MD 10% POE","MVA","Non-coincident"]
[null,null,null,null,"Coincident"]
[null,null,"WEATHER CORRECTED MD 50% POE","MW","Non-coincident"]
[null,null,null,null,"Coincident"]
[null,null,"WEATHER CORRECTED MD 50% POE","MVA","Non-coincident"]
[null,null,null,null,"Coincident"]
[null,"NSP to enter name","CONNECTION POINT RATING","MVA","Non-coincident"]
[null,null,null,null,"Coincident"]
[null,null,"WINTER/SUMMER PEAKING",null,"Non-coincident"]
[null,null,null,null,"Coincident"]
[null,null,"ADJUSTMENTS - EMBEDDED GENERATION","MW","Non-coincident"]
[null,null,null,null,"Coincident"]
[null,null,"WEATHER CORRECTED MD 10% POE","MW","Non-coincident"]
[null,null,null,null,"Coincident"]
[null,null,"WEATHER CORRECTED MD 10% POE","MVA","Non-coincident"]
[null,null,null,null,"Coincident"]
[null,null,"WEATHER CORRECTED MD 50% POE","MW","Non-coincident"]
[null,null,null,null,"Coincident"]
[null,null,"WEATHER CORRECTED MD 50% POE","MVA","Non-coincident"]
[null,null,null,null,"Coincident"]
[null,"NSP to enter name","CONNECTION POINT RATING","MVA","Non-coincident"]
[null,null,null,null,"Coincident"]
[null,null,"WINTER/SUMMER PEAKING",null,"Non-coincident"]
[null,null,null,null,"Coincident"]
[null,null,"ADJUSTMENTS - EMBEDDED GENERATION","MW","Non-coincident"]
[null,null,null,null,"Coincident"]
[null,null,"WEATHER CORRECTED MD 10% POE","MW","Non-coincident"]
[null,null,null,null,"Coincident"]
[null,null,"WEATHER CORRECTED MD 10% POE","MVA","Non-coincident"]
[null,null,null,null,"Coincident"]
[null,null,"WEATHER CORRECTED MD 50% POE","MW","Non-coincident"]
[null,null,null,null,"Coincident"]
[null,null,"WEATHER CORRECTED MD 50% POE","MVA","Non-coincident"]
[null,null,null,null,"Coincident"]
[null,"NSP to enter name","CONNECTION POINT RATING","MVA","Non-coincident"]
[null,null,null,null,"Coincident"]
[null,null,"WINTER/SUMMER PEAKING",null,"Non-coincident"]
[null,null,null,null,"Coincident"]
[null,null,"ADJUSTMENTS - EMBEDDED GENERATION","MW","Non-coincident"]
[null,null,null,null,"Coincident"]
[null,null,"WEATHER CORRECTED MD 10% POE","MW","Non-coincident"]
[null,null,null,null,"Coincident"]
[null,null,"WEATHER CORRECTED MD 10% POE","MVA","Non-coincident"]
[null,null,null,null,"Coincident"]
[null,null,"WEATHER CORRECTED MD 50% POE","MW","Non-coincident"]
[null,null,null,null,"Coincident"]
[null,null,"WEATHER CORRECTED MD 50% POE","MVA","Non-coincident"]
[null,null,null,null,"Coincident"]
[null,"NSP to enter name","CONNECTION POINT RATING","MVA","Non-coincident"]
[null,null,null,null,"Coincident"]
[null,null,"WINTER/SUMMER PEAKING",null,"Non-coincident"]
[null,null,null,null,"Coincident"]
[null,null,"ADJUSTMENTS - EMBEDDED GENERATION","MW","Non-coincident"]
[null,null,null,null,"Coincident"]
[null,null,"WEATHER CORRECTED MD 10% POE","MW","Non-coincident"]
[null,null,null,null,"Coincident"]
[null,null,"WEATHER CORRECTED MD 10% POE","MVA","Non-coincident"]
[null,null,null,null,"Coincident"]
[null,null,"WEATHER CORRECTED MD 50% POE","MW","Non-coincident"]
[null,null,null,null,"Coincident"]
[null,null,"WEATHER CORRECTED MD 50% POE","MVA","Non-coincident"]
[null,null,null,null,"Coincident"]
[null,"NSP to enter name","CONNECTION POINT RATING","MVA","Non-coincident"]
[null,null,null,null,"Coincident"]
[null,null,"WINTER/SUMMER PEAKING",null,"Non-coincident"]
[null,null,null,null,"Coincident"]
[null,null,"ADJUSTMENTS - EMBEDDED GENERATION","MW","Non-coincident"]
[null,null,null,null,"Coincident"]
[null,null,"WEATHER CORRECTED MD 10% POE","MW","Non-coincident"]
[null,null,null,null,"Coincident"]
[null,null,"WEATHER CORRECTED MD 10% POE","MVA","Non-coincident"]
[null,null,null,null,"Coincident"]
[null,null,"WEATHER CORRECTED MD 50% POE","MW","Non-coincident"]
[null,null,null,null,"Coincident"]
[null,null,"WEATHER CORRECTED MD 50% POE","MVA","Non-coincident"]
[null,null,null,null,"Coincident"]
[null,"NSP to enter name","CONNECTION POINT RATING","MVA","Non-coincident"]
[null,null,null,null,"Coincident"]
[null,null,"WINTER/SUMMER PEAKING",null,"Non-coincident"]
[null,null,null,null,"Coincident"]
[null,null,"ADJUSTMENTS - EMBEDDED GENERATION","MW","Non-coincident"]
[null,null,null,null,"Coincident"]
[null,null,"WEATHER CORRECTED MD 10% POE","MW","Non-coincident"]
[null,null,null,null,"Coincident"]
[null,null,"WEATHER CORRECTED MD 10% POE","MVA","Non-coincident"]
[null,null,null,null,"Coincident"]
[null,null,"WEATHER CORRECTED MD 50% POE","MW","Non-coincident"]
[null,null,null,null,"Coincident"]
[null,null,"WEATHER CORRECTED MD 50% POE","MVA","Non-coincident"]
[null,null,null,null,"Coincident"]
[null,"NSP to enter name","CONNECTION POINT RATING","MVA","Non-coincident"]
[null,null,null,null,"Coincident"]
[null,null,"WINTER/SUMMER PEAKING",null,"Non-coincident"]
[null,null,null,null,"Coincident"]
[null,null,"ADJUSTMENTS - EMBEDDED GENERATION","MW","Non-coincident"]
[null,null,null,null,"Coincident"]
[null,null,"WEATHER CORRECTED MD 10% POE","MW","Non-coincident"]
[null,null,null,null,"Coincident"]
[null,null,"WEATHER CORRECTED MD 10% POE","MVA","Non-coincident"]
[null,null,null,null,"Coincident"]
[null,null,"WEATHER CORRECTED MD 50% POE","MW","Non-coincident"]
[null,null,null,null,"Coincident"]
[null,null,"WEATHER CORRECTED MD 50% POE","MVA","Non-coincident"]
[null,null,null,null,"Coincident"]
[null,"NSP to enter name","CONNECTION POINT RATING","MVA","Non-coincident"]
[null,null,null,null,"Coincident"]
[null,null,"WINTER/SUMMER PEAKING",null,"Non-coincident"]
[null,null,null,null,"Coincident"]
[null,null,"ADJUSTMENTS - EMBEDDED GENERATION","MW","Non-coincident"]
[null,null,null,null,"Coincident"]
[null,null,"WEATHER CORRECTED MD 10% POE","MW","Non-coincident"]
[null,null,null,null,"Coincident"]
[null,null,"WEATHER CORRECTED MD 10% POE","MVA","Non-coincident"]
[null,null,null,null,"Coincident"]
[null,null,"WEATHER CORRECTED MD 50% POE","MW","Non-coincident"]
[null,null,null,null,"Coincident"]
[null,null,"WEATHER CORRECTED MD 50% POE","MVA","Non-coincident"]
[null,null,null,null,"Coincident"]
[null,"NSP to enter name","CONNECTION POINT RATING","MVA","Non-coincident"]
[null,null,null,null,"Coincident"]
[null,null,"WINTER/SUMMER PEAKING",null,"Non-coincident"]
[null,null,null,null,"Coincident"]
[null,null,"ADJUSTMENTS - EMBEDDED GENERATION","MW","Non-coincident"]
[null,null,null,null,"Coincident"]
[null,null,"WEATHER CORRECTED MD 10% POE","MW","Non-coincident"]
[null,null,null,null,"Coincident"]
[null,null,"WEATHER CORRECTED MD 10% POE","MVA","Non-coincident"]
[null,null,null,null,"Coincident"]
[null,null,"WEATHER CORRECTED MD 50% POE","MW","Non-coincident"]
[null,null,null,null,"Coincident"]
[null,null,"WEATHER CORRECTED MD 50% POE","MVA","Non-coincident"]
[null,null,null,null,"Coincident"]
[null,"NSP to enter name","CONNECTION POINT RATING","MVA","Non-coincident"]
[null,null,null,null,"Coincident"]
[null,null,"WINTER/SUMMER PEAKING",null,"Non-coincident"]
[null,null,null,null,"Coincident"]
[null,null,"ADJUSTMENTS - EMBEDDED GENERATION","MW","Non-coincident"]
[null,null,null,null,"Coincident"]
[null,null,"WEATHER CORRECTED MD 10% POE","MW","Non-coincident"]
[null,null,null,null,"Coincident"]
[null,null,"WEATHER CORRECTED MD 10% POE","MVA","Non-coincident"]
[null,null,null,null,"Coincident"]
[null,null,"WEATHER CORRECTED MD 50% POE","MW","Non-coincident"]
[null,null,null,null,"Coincident"]
[null,null,"WEATHER CORRECTED MD 50% POE","MVA","Non-coincident"]
[null,null,null,null,"Coincident"]
[null,"NSP to enter name","CONNECTION POINT RATING","MVA","Non-coincident"]
[null,null,null,null,"Coincident"]
[null,null,"WINTER/SUMMER PEAKING",null,"Non-coincident"]
[null,null,null,null,"Coincident"]
[null,null,"ADJUSTMENTS - EMBEDDED GENERATION","MW","Non-coincident"]
[null,null,null,null,"Coincident"]
[null,null,"WEATHER CORRECTED MD 10% POE","MW","Non-coincident"]
[null,null,null,null,"Coincident"]
[null,null,"WEATHER CORRECTED MD 10% POE","MVA","Non-coincident"]
[null,null,null,null,"Coincident"]
[null,null,"WEATHER CORRECTED MD 50% POE","MW","Non-coincident"]
[null,null,null,null,"Coincident"]
[null,null,"WEATHER CORRECTED MD 50% POE","MVA","Non-coincident"]
[null,null,null,null,"Coincident"]
[null,"NSP to enter name","CONNECTION POINT RATING","MVA","Non-coincident"]
[null,null,null,null,"Coincident"]
[null,null,"WINTER/SUMMER PEAKING",null,"Non-coincident"]
[null,null,null,null,"Coincident"]
[null,null,"ADJUSTMENTS - EMBEDDED GENERATION","MW","Non-coincident"]
[null,null,null,null,"Coincident"]
[null,null,"WEATHER CORRECTED MD 10% POE","MW","Non-coincident"]
[null,null,null,null,"Coincident"]
[null,null,"WEATHER CORRECTED MD 10% POE","MVA","Non-coincident"]
[null,null,null,null,"Coincident"]
[null,null,"WEATHER CORRECTED MD 50% POE","MW","Non-coincident"]
[null,null,null,null,"Coincident"]
[null,null,"WEATHER CORRECTED MD 50% POE","MVA","Non-coincident"]
[null,null,null,null,"Coincident"]
[null,"NSP to enter name","CONNECTION POINT RATING","MVA","Non-coincident"]
[null,null,null,null,"Coincident"]
[null,null,"WINTER/SUMMER PEAKING",null,"Non-coincident"]
[null,null,null,null,"Coincident"]
[null,null,"ADJUSTMENTS - EMBEDDED GENERATION","MW","Non-coincident"]
[null,null,null,null,"Coincident"]
[null,null,"WEATHER CORRECTED MD 10% POE","MW","Non-coincident"]
[null,null,null,null,"Coincident"]
[null,null,"WEATHER CORRECTED MD 10% POE","MVA","Non-coincident"]
[null,null,null,null,"Coincident"]
[null,null,"WEATHER CORRECTED MD 50% POE","MW","Non-coincident"]
[null,null,null,null,"Coincident"]
[null,null,"WEATHER CORRECTED MD 50% POE","MVA","Non-coincident"]
[null,null,null,null,"Coincident"]
[null,"NSP to enter name","CONNECTION POINT RATING","MVA","Non-coincident"]
[null,null,null,null,"Coincident"]
[null,null,"WINTER/SUMMER PEAKING",null,"Non-coincident"]
[null,null,null,null,"Coincident"]
[null,null,"ADJUSTMENTS - EMBEDDED GENERATION","MW","Non-coincident"]
[null,null,null,null,"Coincident"]
[null,null,"WEATHER CORRECTED MD 10% POE","MW","Non-coincident"]
[null,null,null,null,"Coincident"]
[null,null,"WEATHER CORRECTED MD 10% POE","MVA","Non-coincident"]
[null,null,null,null,"Coincident"]
[null,null,"WEATHER CORRECTED MD 50% POE","MW","Non-coincident"]
[null,null,null,null,"Coincident"]
[null,null,"WEATHER CORRECTED MD 50% POE","MVA","Non-coincident"]
[null,null,null,null,"Coincident"]
[null,"NSP to enter name","CONNECTION POINT RATING","MVA","Non-coincident"]
[null,null,null,null,"Coincident"]
[null,null,"WINTER/SUMMER PEAKING",null,"Non-coincident"]
[null,null,null,null,"Coincident"]
[null,null,"ADJUSTMENTS - EMBEDDED GENERATION","MW","Non-coincident"]
[null,null,null,null,"Coincident"]
[null,null,"WEATHER CORRECTED MD 10% POE","MW","Non-coincident"]
[null,null,null,null,"Coincident"]
[null,null,"WEATHER CORRECTED MD 10% POE","MVA","Non-coincident"]
[null,null,null,null,"Coincident"]
[null,null,"WEATHER CORRECTED MD 50% POE","MW","Non-coincident"]
[null,null,null,null,"Coincident"]
[null,null,"WEATHER CORRECTED MD 50% POE","MVA","Non-coincident"]
[null,null,null,null,"Coincident"]
[null,"NSP to enter name","CONNECTION POINT RATING","MVA","Non-coincident"]
[null,null,null,null,"Coincident"]
[null,null,"WINTER/SUMMER PEAKING",null,"Non-coincident"]
[null,null,null,null,"Coincident"]
[null,null,"ADJUSTMENTS - EMBEDDED GENERATION","MW","Non-coincident"]
[null,null,null,null,"Coincident"]
[null,null,"WEATHER CORRECTED MD 10% POE","MW","Non-coincident"]
[null,null,null,null,"Coincident"]
[null,null,"WEATHER CORRECTED MD 10% POE","MVA","Non-coincident"]
[null,null,null,null,"Coincident"]
[null,null,"WEATHER CORRECTED MD 50% POE","MW","Non-coincident"]
[null,null,null,null,"Coincident"]
[null,null,"WEATHER CORRECTED MD 50% POE","MVA","Non-coincident"]
[null,null,null,null,"Coincident"]
[null,"NSP to enter name","CONNECTION POINT RATING","MVA","Non-coincident"]
[null,null,null,null,"Coincident"]
[null,null,"WINTER/SUMMER PEAKING",null,"Non-coincident"]
[null,null,null,null,"Coincident"]
[null,null,"ADJUSTMENTS - EMBEDDED GENERATION","MW","Non-coincident"]
[null,null,null,null,"Coincident"]
[null,null,"WEATHER CORRECTED MD 10% POE","MW","Non-coincident"]
[null,null,null,null,"Coincident"]
[null,null,"WEATHER CORRECTED MD 10% POE","MVA","Non-coincident"]
[null,null,null,null,"Coincident"]
[null,null,"WEATHER CORRECTED MD 50% POE","MW","Non-coincident"]
[null,null,null,null,"Coincident"]
[null,null,"WEATHER CORRECTED MD 50% POE","MVA","Non-coincident"]
[null,null,null,null,"Coincident"]
[null,"NSP to enter name","CONNECTION POINT RATING","MVA","Non-coincident"]
[null,null,null,null,"Coincident"]
[null,null,"WINTER/SUMMER PEAKING",null,"Non-coincident"]
[null,null,null,null,"Coincident"]
[null,null,"ADJUSTMENTS - EMBEDDED GENERATION","MW","Non-coincident"]
[null,null,null,null,"Coincident"]
[null,null,"WEATHER CORRECTED MD 10% POE","MW","Non-coincident"]
[null,null,null,null,"Coincident"]
[null,null,"WEATHER CORRECTED MD 10% POE","MVA","Non-coincident"]
[null,null,null,null,"Coincident"]
[null,null,"WEATHER CORRECTED MD 50% POE","MW","Non-coincident"]
[null,null,null,null,"Coincident"]
[null,null,"WEATHER CORRECTED MD 50% POE","MVA","Non-coincident"]
[null,null,null,null,"Coincident"]
[null,"NSP to enter name","CONNECTION POINT RATING","MVA","Non-coincident"]
[null,null,null,null,"Coincident"]
[null,null,"WINTER/SUMMER PEAKING",null,"Non-coincident"]
[null,null,null,null,"Coincident"]
[null,null,"ADJUSTMENTS - EMBEDDED GENERATION","MW","Non-coincident"]
[null,null,null,null,"Coincident"]
[null,null,"WEATHER CORRECTED MD 10% POE","MW","Non-coincident"]
[null,null,null,null,"Coincident"]
[null,null,"WEATHER CORRECTED MD 10% POE","MVA","Non-coincident"]
[null,null,null,null,"Coincident"]
[null,null,"WEATHER CORRECTED MD 50% POE","MW","Non-coincident"]
[null,null,null,null,"Coincident"]
[null,null,"WEATHER CORRECTED MD 50% POE","MVA","Non-coincident"]
[null,null,null,null,"Coincident"]
[null,"NSP to enter name","CONNECTION POINT RATING","MVA","Non-coincident"]
[null,null,null,null,"Coincident"]
[null,null,"WINTER/SUMMER PEAKING",null,"Non-coincident"]
[null,null,null,null,"Coincident"]
[null,null,"ADJUSTMENTS - EMBEDDED GENERATION","MW","Non-coincident"]
[null,null,null,null,"Coincident"]
[null,null,"WEATHER CORRECTED MD 10% POE","MW","Non-coincident"]
[null,null,null,null,"Coincident"]
[null,null,"WEATHER CORRECTED MD 10% POE","MVA","Non-coincident"]
[null,null,null,null,"Coincident"]
[null,null,"WEATHER CORRECTED MD 50% POE","MW","Non-coincident"]
[null,null,null,null,"Coincident"]
[null,null,"WEATHER CORRECTED MD 50% POE","MVA","Non-coincident"]
[null,null,null,null,"Coincident"]
[null,"NSP to enter name","CONNECTION POINT RATING","MVA","Non-coincident"]
[null,null,null,null,"Coincident"]
[null,null,"WINTER/SUMMER PEAKING",null,"Non-coincident"]
[null,null,null,null,"Coincident"]
[null,null,"ADJUSTMENTS - EMBEDDED GENERATION","MW","Non-coincident"]
[null,null,null,null,"Coincident"]
[null,null,"WEATHER CORRECTED MD 10% POE","MW","Non-coincident"]
[null,null,null,null,"Coincident"]
[null,null,"WEATHER CORRECTED MD 10% POE","MVA","Non-coincident"]
[null,null,null,null,"Coincident"]
[null,null,"WEATHER CORRECTED MD 50% POE","MW","Non-coincident"]
[null,null,null,null,"Coincident"]
[null,null,"WEATHER CORRECTED MD 50% POE","MVA","Non-coincident"]
[null,null,null,null,"Coincident"]
[null,"NSP to enter name","CONNECTION POINT RATING","MVA","Non-coincident"]
[null,null,null,null,"Coincident"]
[null,null,"WINTER/SUMMER PEAKING",null,"Non-coincident"]
[null,null,null,null,"Coincident"]
[null,null,"ADJUSTMENTS - EMBEDDED GENERATION","MW","Non-coincident"]
[null,null,null,null,"Coincident"]
[null,null,"WEATHER CORRECTED MD 10% POE","MW","Non-coincident"]
[null,null,null,null,"Coincident"]
[null,null,"WEATHER CORRECTED MD 10% POE","MVA","Non-coincident"]
[null,null,null,null,"Coincident"]
[null,null,"WEATHER CORRECTED MD 50% POE","MW","Non-coincident"]
[null,null,null,null,"Coincident"]
[null,null,"WEATHER CORRECTED MD 50% POE","MVA","Non-coincident"]
[null,null,null,null,"Coincident"]
[null,"NSP to enter name","CONNECTION POINT RATING","MVA","Non-coincident"]
[null,null,null,null,"Coincident"]
[null,null,"WINTER/SUMMER PEAKING",null,"Non-coincident"]
[null,null,null,null,"Coincident"]
[null,null,"ADJUSTMENTS - EMBEDDED GENERATION","MW","Non-coincident"]
[null,null,null,null,"Coincident"]
[null,null,"WEATHER CORRECTED MD 10% POE","MW","Non-coincident"]
[null,null,null,null,"Coincident"]
[null,null,"WEATHER CORRECTED MD 10% POE","MVA","Non-coincident"]
[null,null,null,null,"Coincident"]
[null,null,"WEATHER CORRECTED MD 50% POE","MW","Non-coincident"]
[null,null,null,null,"Coincident"]
[null,null,"WEATHER CORRECTED MD 50% POE","MVA","Non-coincident"]
[null,null,null,null,"Coincident"]
[null,"NSP to enter name","CONNECTION POINT RATING","MVA","Non-coincident"]
[null,null,null,null,"Coincident"]
[null,null,"WINTER/SUMMER PEAKING",null,"Non-coincident"]
[null,null,null,null,"Coincident"]
[null,null,"ADJUSTMENTS - EMBEDDED GENERATION","MW","Non-coincident"]
[null,null,null,null,"Coincident"]
[null,null,"WEATHER CORRECTED MD 10% POE","MW","Non-coincident"]
[null,null,null,null,"Coincident"]
[null,null,"WEATHER CORRECTED MD 10% POE","MVA","Non-coincident"]
[null,null,null,null,"Coincident"]
[null,null,"WEATHER CORRECTED MD 50% POE","MW","Non-coincident"]
[null,null,null,null,"Coincident"]
[null,null,"WEATHER CORRECTED MD 50% POE","MVA","Non-coincident"]
[null,null,null,null,"Coincident"]
[null,"NSP to enter name","CONNECTION POINT RATING","MVA","Non-coincident"]
[null,null,null,null,"Coincident"]
[null,null,"WINTER/SUMMER PEAKING",null,"Non-coincident"]
[null,null,null,null,"Coincident"]
[null,null,"ADJUSTMENTS - EMBEDDED GENERATION","MW","Non-coincident"]
[null,null,null,null,"Coincident"]
[null,null,"WEATHER CORRECTED MD 10% POE","MW","Non-coincident"]
[null,null,null,null,"Coincident"]
[null,null,"WEATHER CORRECTED MD 10% POE","MVA","Non-coincident"]
[null,null,null,null,"Coincident"]
[null,null,"WEATHER CORRECTED MD 50% POE","MW","Non-coincident"]
[null,null,null,null,"Coincident"]
[null,null,"WEATHER CORRECTED MD 50% POE","MVA","Non-coincident"]
[null,null,null,null,"Coincident"]
[null,"NSP to enter name","CONNECTION POINT RATING","MVA","Non-coincident"]
[null,null,null,null,"Coincident"]
[null,null,"WINTER/SUMMER PEAKING",null,"Non-coincident"]
[null,null,null,null,"Coincident"]
[null,null,"ADJUSTMENTS - EMBEDDED GENERATION","MW","Non-coincident"]
[null,null,null,null,"Coincident"]
[null,null,"WEATHER CORRECTED MD 10% POE","MW","Non-coincident"]
[null,null,null,null,"Coincident"]
[null,null,"WEATHER CORRECTED MD 10% POE","MVA","Non-coincident"]
[null,null,null,null,"Coincident"]
[null,null,"WEATHER CORRECTED MD 50% POE","MW","Non-coincident"]
[null,null,null,null,"Coincident"]
[null,null,"WEATHER CORRECTED MD 50% POE","MVA","Non-coincident"]
[null,null,null,null,"Coincident"]
[null,"NSP to enter name","CONNECTION POINT RATING","MVA","Non-coincident"]
[null,null,null,null,"Coincident"]
[null,null,"WINTER/SUMMER PEAKING",null,"Non-coincident"]
[null,null,null,null,"Coincident"]
[null,null,"ADJUSTMENTS - EMBEDDED GENERATION","MW","Non-coincident"]
[null,null,null,null,"Coincident"]
[null,null,"WEATHER CORRECTED MD 10% POE","MW","Non-coincident"]
[null,null,null,null,"Coincident"]
[null,null,"WEATHER CORRECTED MD 10% POE","MVA","Non-coincident"]
[null,null,null,null,"Coincident"]
[null,null,"WEATHER CORRECTED MD 50% POE","MW","Non-coincident"]
[null,null,null,null,"Coincident"]
[null,null,"WEATHER CORRECTED MD 50% POE","MVA","Non-coincident"]
[null,null,null,null,"Coincident"]
[null,"NSP to enter name","CONNECTION POINT RATING","MVA","Non-coincident"]
[null,null,null,null,"Coincident"]
[null,null,"WINTER/SUMMER PEAKING",null,"Non-coincident"]
[null,null,null,null,"Coincident"]
[null,null,"ADJUSTMENTS - EMBEDDED GENERATION","MW","Non-coincident"]
[null,null,null,null,"Coincident"]
[null,null,"WEATHER CORRECTED MD 10% POE","MW","Non-coincident"]
[null,null,null,null,"Coincident"]
[null,null,"WEATHER CORRECTED MD 10% POE","MVA","Non-coincident"]
[null,null,null,null,"Coincident"]
[null,null,"WEATHER CORRECTED MD 50% POE","MW","Non-coincident"]
[null,null,null,null,"Coincident"]
[null,null,"WEATHER CORRECTED MD 50% POE","MVA","Non-coincident"]
[null,null,null,null,"Coincident"]
[null,"NSP to enter name","CONNECTION POINT RATING","MVA","Non-coincident"]
[null,null,null,null,"Coincident"]
[null,null,"WINTER/SUMMER PEAKING",null,"Non-coincident"]
[null,null,null,null,"Coincident"]
[null,null,"ADJUSTMENTS - EMBEDDED GENERATION","MW","Non-coincident"]
[null,null,null,null,"Coincident"]
[null,null,"WEATHER CORRECTED MD 10% POE","MW","Non-coincident"]
[null,null,null,null,"Coincident"]
[null,null,"WEATHER CORRECTED MD 10% POE","MVA","Non-coincident"]
[null,null,null,null,"Coincident"]
[null,null,"WEATHER CORRECTED MD 50% POE","MW","Non-coincident"]
[null,null,null,null,"Coincident"]
[null,null,"WEATHER CORRECTED MD 50% POE","MVA","Non-coincident"]
[null,null,null,null,"Coincident"]
[null,"NSP to enter name","CONNECTION POINT RATING","MVA","Non-coincident"]
[null,null,null,null,"Coincident"]
[null,null,"WINTER/SUMMER PEAKING",null,"Non-coincident"]
[null,null,null,null,"Coincident"]
[null,null,"ADJUSTMENTS - EMBEDDED GENERATION","MW","Non-coincident"]
[null,null,null,null,"Coincident"]
[null,null,"WEATHER CORRECTED MD 10% POE","MW","Non-coincident"]
[null,null,null,null,"Coincident"]
[null,null,"WEATHER CORRECTED MD 10% POE","MVA","Non-coincident"]
[null,null,null,null,"Coincident"]
[null,null,"WEATHER CORRECTED MD 50% POE","MW","Non-coincident"]
[null,null,null,null,"Coincident"]
[null,null,"WEATHER CORRECTED MD 50% POE","MVA","Non-coincident"]
[null,null,null,null,"Coincident"]
[null,"NSP to enter name","CONNECTION POINT RATING","MVA","Non-coincident"]
[null,null,null,null,"Coincident"]
[null,null,"WINTER/SUMMER PEAKING",null,"Non-coincident"]
[null,null,null,null,"Coincident"]
[null,null,"ADJUSTMENTS - EMBEDDED GENERATION","MW","Non-coincident"]
[null,null,null,null,"Coincident"]
[null,null,"WEATHER CORRECTED MD 10% POE","MW","Non-coincident"]
[null,null,null,null,"Coincident"]
[null,null,"WEATHER CORRECTED MD 10% POE","MVA","Non-coincident"]
[null,null,null,null,"Coincident"]
[null,null,"WEATHER CORRECTED MD 50% POE","MW","Non-coincident"]
[null,null,null,null,"Coincident"]
[null,null,"WEATHER CORRECTED MD 50% POE","MVA","Non-coincident"]
[null,null,null,null,"Coincident"]
[null,"NSP to enter name","CONNECTION POINT RATING","MVA","Non-coincident"]
[null,null,null,null,"Coincident"]
[null,null,"WINTER/SUMMER PEAKING",null,"Non-coincident"]
[null,null,null,null,"Coincident"]
[null,null,"ADJUSTMENTS - EMBEDDED GENERATION","MW","Non-coincident"]
[null,null,null,null,"Coincident"]
[null,null,"WEATHER CORRECTED MD 10% POE","MW","Non-coincident"]
[null,null,null,null,"Coincident"]
[null,null,"WEATHER CORRECTED MD 10% POE","MVA","Non-coincident"]
[null,null,null,null,"Coincident"]
[null,null,"WEATHER CORRECTED MD 50% POE","MW","Non-coincident"]
[null,null,null,null,"Coincident"]
[null,null,"WEATHER CORRECTED MD 50% POE","MVA","Non-coincident"]
[null,null,null,null,"Coincident"]
[null,"NSP to enter name","CONNECTION POINT RATING","MVA","Non-coincident"]
[null,null,null,null,"Coincident"]
[null,null,"WINTER/SUMMER PEAKING",null,"Non-coincident"]
[null,null,null,null,"Coincident"]
[null,null,"ADJUSTMENTS - EMBEDDED GENERATION","MW","Non-coincident"]
[null,null,null,null,"Coincident"]
[null,null,"WEATHER CORRECTED MD 10% POE","MW","Non-coincident"]
[null,null,null,null,"Coincident"]
[null,null,"WEATHER CORRECTED MD 10% POE","MVA","Non-coincident"]
[null,null,null,null,"Coincident"]
[null,null,"WEATHER CORRECTED MD 50% POE","MW","Non-coincident"]
[null,null,null,null,"Coincident"]
[null,null,"WEATHER CORRECTED MD 50% POE","MVA","Non-coincident"]
[null,null,null,null,"Coincident"]
[null,"NSP to enter name","CONNECTION POINT RATING","MVA","Non-coincident"]
[null,null,null,null,"Coincident"]
[null,null,"WINTER/SUMMER PEAKING",null,"Non-coincident"]
[null,null,null,null,"Coincident"]
[null,null,"ADJUSTMENTS - EMBEDDED GENERATION","MW","Non-coincident"]
[null,null,null,null,"Coincident"]
[null,null,"WEATHER CORRECTED MD 10% POE","MW","Non-coincident"]
[null,null,null,null,"Coincident"]
[null,null,"WEATHER CORRECTED MD 10% POE","MVA","Non-coincident"]
[null,null,null,null,"Coincident"]
[null,null,"WEATHER CORRECTED MD 50% POE","MW","Non-coincident"]
[null,null,null,null,"Coincident"]
[null,null,"WEATHER CORRECTED MD 50% POE","MVA","Non-coincident"]
[null,null,null,null,"Coincident"]
[null,"NSP to enter name","CONNECTION POINT RATING","MVA","Non-coincident"]
[null,null,null,null,"Coincident"]
[null,null,"WINTER/SUMMER PEAKING",null,"Non-coincident"]
[null,null,null,null,"Coincident"]
[null,null,"ADJUSTMENTS - EMBEDDED GENERATION","MW","Non-coincident"]
[null,null,null,null,"Coincident"]
[null,null,"WEATHER CORRECTED MD 10% POE","MW","Non-coincident"]
[null,null,null,null,"Coincident"]
[null,null,"WEATHER CORRECTED MD 10% POE","MVA","Non-coincident"]
[null,null,null,null,"Coincident"]
[null,null,"WEATHER CORRECTED MD 50% POE","MW","Non-coincident"]
[null,null,null,null,"Coincident"]
[null,null,"WEATHER CORRECTED MD 50% POE","MVA","Non-coincident"]
[null,null,null,null,"Coincident"]
[null,"NSP to enter name","CONNECTION POINT RATING","MVA","Non-coincident"]
[null,null,null,null,"Coincident"]
[null,null,"WINTER/SUMMER PEAKING",null,"Non-coincident"]
[null,null,null,null,"Coincident"]
[null,null,"ADJUSTMENTS - EMBEDDED GENERATION","MW","Non-coincident"]
[null,null,null,null,"Coincident"]
[null,null,"WEATHER CORRECTED MD 10% POE","MW","Non-coincident"]
[null,null,null,null,"Coincident"]
[null,null,"WEATHER CORRECTED MD 10% POE","MVA","Non-coincident"]
[null,null,null,null,"Coincident"]
[null,null,"WEATHER CORRECTED MD 50% POE","MW","Non-coincident"]
[null,null,null,null,"Coincident"]
[null,null,"WEATHER CORRECTED MD 50% POE","MVA","Non-coincident"]
[null,null,null,null,"Coincident"]
[null,"NSP to enter name","CONNECTION POINT RATING","MVA","Non-coincident"]
[null,null,null,null,"Coincident"]
[null,null,"WINTER/SUMMER PEAKING",null,"Non-coincident"]
[null,null,null,null,"Coincident"]
[null,null,"ADJUSTMENTS - EMBEDDED GENERATION","MW","Non-coincident"]
[null,null,null,null,"Coincident"]
[null,null,"WEATHER CORRECTED MD 10% POE","MW","Non-coincident"]
[null,null,null,null,"Coincident"]
[null,null,"WEATHER CORRECTED MD 10% POE","MVA","Non-coincident"]
[null,null,null,null,"Coincident"]
[null,null,"WEATHER CORRECTED MD 50% POE","MW","Non-coincident"]
[null,null,null,null,"Coincident"]
[null,null,"WEATHER CORRECTED MD 50% POE","MVA","Non-coincident"]
[null,null,null,null,"Coincident"]
[null,"NSP to enter name","CONNECTION POINT RATING","MVA","Non-coincident"]
[null,null,null,null,"Coincident"]
[null,null,"WINTER/SUMMER PEAKING",null,"Non-coincident"]
[null,null,null,null,"Coincident"]
[null,null,"ADJUSTMENTS - EMBEDDED GENERATION","MW","Non-coincident"]
[null,null,null,null,"Coincident"]
[null,null,"WEATHER CORRECTED MD 10% POE","MW","Non-coincident"]
[null,null,null,null,"Coincident"]
[null,null,"WEATHER CORRECTED MD 10% POE","MVA","Non-coincident"]
[null,null,null,null,"Coincident"]
[null,null,"WEATHER CORRECTED MD 50% POE","MW","Non-coincident"]
[null,null,null,null,"Coincident"]
[null,null,"WEATHER CORRECTED MD 50% POE","MVA","Non-coincident"]
[null,null,null,null,"Coincident"]
[null,"NSP to enter name","CONNECTION POINT RATING","MVA","Non-coincident"]
[null,null,null,null,"Coincident"]
[null,null,"WINTER/SUMMER PEAKING",null,"Non-coincident"]
[null,null,null,null,"Coincident"]
[null,null,"ADJUSTMENTS - EMBEDDED GENERATION","MW","Non-coincident"]
[null,null,null,null,"Coincident"]
[null,null,"WEATHER CORRECTED MD 10% POE","MW","Non-coincident"]
[null,null,null,null,"Coincident"]
[null,null,"WEATHER CORRECTED MD 10% POE","MVA","Non-coincident"]
[null,null,null,null,"Coincident"]
[null,null,"WEATHER CORRECTED MD 50% POE","MW","Non-coincident"]
[null,null,null,null,"Coincident"]
[null,null,"WEATHER CORRECTED MD 50% POE","MVA","Non-coincident"]
[null,null,null,null,"Coincident"]
[null,"NSP to enter name","CONNECTION POINT RATING","MVA","Non-coincident"]
[null,null,null,null,"Coincident"]
[null,null,"WINTER/SUMMER PEAKING",null,"Non-coincident"]
[null,null,null,null,"Coincident"]
[null,null,"ADJUSTMENTS - EMBEDDED GENERATION","MW","Non-coincident"]
[null,null,null,null,"Coincident"]
[null,null,"WEATHER CORRECTED MD 10% POE","MW","Non-coincident"]
[null,null,null,null,"Coincident"]
[null,null,"WEATHER CORRECTED MD 10% POE","MVA","Non-coincident"]
[null,null,null,null,"Coincident"]
[null,null,"WEATHER CORRECTED MD 50% POE","MW","Non-coincident"]
[null,null,null,null,"Coincident"]
[null,null,"WEATHER CORRECTED MD 50% POE","MVA","Non-coincident"]
[null,null,null,null,"Coincident"]
[null,"NSP to enter name","CONNECTION POINT RATING","MVA","Non-coincident"]
[null,null,null,null,"Coincident"]
[null,null,"WINTER/SUMMER PEAKING",null,"Non-coincident"]
[null,null,null,null,"Coincident"]
[null,null,"ADJUSTMENTS - EMBEDDED GENERATION","MW","Non-coincident"]
[null,null,null,null,"Coincident"]
[null,null,"WEATHER CORRECTED MD 10% POE","MW","Non-coincident"]
[null,null,null,null,"Coincident"]
[null,null,"WEATHER CORRECTED MD 10% POE","MVA","Non-coincident"]
[null,null,null,null,"Coincident"]
[null,null,"WEATHER CORRECTED MD 50% POE","MW","Non-coincident"]
[null,null,null,null,"Coincident"]
[null,null,"WEATHER CORRECTED MD 50% POE","MVA","Non-coincident"]
[null,null,null,null,"Coincident"]
[null,"NSP to enter name","CONNECTION POINT RATING","MVA","Non-coincident"]
[null,null,null,null,"Coincident"]
[null,null,"WINTER/SUMMER PEAKING",null,"Non-coincident"]
[null,null,null,null,"Coincident"]
[null,null,"ADJUSTMENTS - EMBEDDED GENERATION","MW","Non-coincident"]
[null,null,null,null,"Coincident"]
[null,null,"WEATHER CORRECTED MD 10% POE","MW","Non-coincident"]
[null,null,null,null,"Coincident"]
[null,null,"WEATHER CORRECTED MD 10% POE","MVA","Non-coincident"]
[null,null,null,null,"Coincident"]
[null,null,"WEATHER CORRECTED MD 50% POE","MW","Non-coincident"]
[null,null,null,null,"Coincident"]
[null,null,"WEATHER CORRECTED MD 50% POE","MVA","Non-coincident"]
[null,null,null,null,"Coincident"]
[null,"NSP to enter name","CONNECTION POINT RATING","MVA","Non-coincident"]
[null,null,null,null,"Coincident"]
[null,null,"WINTER/SUMMER PEAKING",null,"Non-coincident"]
[null,null,null,null,"Coincident"]
[null,null,"ADJUSTMENTS - EMBEDDED GENERATION","MW","Non-coincident"]
[null,null,null,null,"Coincident"]
[null,null,"WEATHER CORRECTED MD 10% POE","MW","Non-coincident"]
[null,null,null,null,"Coincident"]
[null,null,"WEATHER CORRECTED MD 10% POE","MVA","Non-coincident"]
[null,null,null,null,"Coincident"]
[null,null,"WEATHER CORRECTED MD 50% POE","MW","Non-coincident"]
[null,null,null,null,"Coincident"]
[null,null,"WEATHER CORRECTED MD 50% POE","MVA","Non-coincident"]
[null,null,null,null,"Coincident"]
[null,"NSP to enter name","CONNECTION POINT RATING","MVA","Non-coincident"]
[null,null,null,null,"Coincident"]
[null,null,"WINTER/SUMMER PEAKING",null,"Non-coincident"]
[null,null,null,null,"Coincident"]
[null,null,"ADJUSTMENTS - EMBEDDED GENERATION","MW","Non-coincident"]
[null,null,null,null,"Coincident"]
[null,null,"WEATHER CORRECTED MD 10% POE","MW","Non-coincident"]
[null,null,null,null,"Coincident"]
[null,null,"WEATHER CORRECTED MD 10% POE","MVA","Non-coincident"]
[null,null,null,null,"Coincident"]
[null,null,"WEATHER CORRECTED MD 50% POE","MW","Non-coincident"]
[null,null,null,null,"Coincident"]
[null,null,"WEATHER CORRECTED MD 50% POE","MVA","Non-coincident"]
[null,null,null,null,"Coincident"]
[null,"NSP to enter name","CONNECTION POINT RATING","MVA","Non-coincident"]
[null,null,null,null,"Coincident"]
[null,null,"WINTER/SUMMER PEAKING",null,"Non-coincident"]
[null,null,null,null,"Coincident"]
[null,null,"ADJUSTMENTS - EMBEDDED GENERATION","MW","Non-coincident"]
[null,null,null,null,"Coincident"]
[null,null,"WEATHER CORRECTED MD 10% POE","MW","Non-coincident"]
[null,null,null,null,"Coincident"]
[null,null,"WEATHER CORRECTED MD 10% POE","MVA","Non-coincident"]
[null,null,null,null,"Coincident"]
[null,null,"WEATHER CORRECTED MD 50% POE","MW","Non-coincident"]
[null,null,null,null,"Coincident"]
[null,null,"WEATHER CORRECTED MD 50% POE","MVA","Non-coincident"]
[null,null,null,null,"Coincident"]
[null,"NSP to enter name","CONNECTION POINT RATING","MVA","Non-coincident"]
[null,null,null,null,"Coincident"]
[null,null,"WINTER/SUMMER PEAKING",null,"Non-coincident"]
[null,null,null,null,"Coincident"]
[null,null,"ADJUSTMENTS - EMBEDDED GENERATION","MW","Non-coincident"]
[null,null,null,null,"Coincident"]
[null,null,"WEATHER CORRECTED MD 10% POE","MW","Non-coincident"]
[null,null,null,null,"Coincident"]
[null,null,"WEATHER CORRECTED MD 10% POE","MVA","Non-coincident"]
[null,null,null,null,"Coincident"]
[null,null,"WEATHER CORRECTED MD 50% POE","MW","Non-coincident"]
[null,null,null,null,"Coincident"]
[null,null,"WEATHER CORRECTED MD 50% POE","MVA","Non-coincident"]
[null,null,null,null,"Coincident"]
[null,"NSP to enter name","CONNECTION POINT RATING","MVA","Non-coincident"]
[null,null,null,null,"Coincident"]
[null,null,"WINTER/SUMMER PEAKING",null,"Non-coincident"]
[null,null,null,null,"Coincident"]
[null,null,"ADJUSTMENTS - EMBEDDED GENERATION","MW","Non-coincident"]
[null,null,null,null,"Coincident"]
[null,null,"WEATHER CORRECTED MD 10% POE","MW","Non-coincident"]
[null,null,null,null,"Coincident"]
[null,null,"WEATHER CORRECTED MD 10% POE","MVA","Non-coincident"]
[null,null,null,null,"Coincident"]
[null,null,"WEATHER CORRECTED MD 50% POE","MW","Non-coincident"]
[null,null,null,null,"Coincident"]
[null,null,"WEATHER CORRECTED MD 50% POE","MVA","Non-coincident"]
[null,null,null,null,"Coincident"]
[null,"NSP to enter name","CONNECTION POINT RATING","MVA","Non-coincident"]
[null,null,null,null,"Coincident"]
[null,null,"WINTER/SUMMER PEAKING",null,"Non-coincident"]
[null,null,null,null,"Coincident"]
[null,null,"ADJUSTMENTS - EMBEDDED GENERATION","MW","Non-coincident"]
[null,null,null,null,"Coincident"]
[null,null,"WEATHER CORRECTED MD 10% POE","MW","Non-coincident"]
[null,null,null,null,"Coincident"]
[null,null,"WEATHER CORRECTED MD 10% POE","MVA","Non-coincident"]
[null,null,null,null,"Coincident"]
[null,null,"WEATHER CORRECTED MD 50% POE","MW","Non-coincident"]
[null,null,null,null,"Coincident"]
[null,null,"WEATHER CORRECTED MD 50% POE","MVA","Non-coincident"]
[null,null,null,null,"Coincident"]
[null,"NSP to enter name","CONNECTION POINT RATING","MVA","Non-coincident"]
[null,null,null,null,"Coincident"]
[null,null,"WINTER/SUMMER PEAKING",null,"Non-coincident"]
[null,null,null,null,"Coincident"]
[null,null,"ADJUSTMENTS - EMBEDDED GENERATION","MW","Non-coincident"]
[null,null,null,null,"Coincident"]
[null,null,"WEATHER CORRECTED MD 10% POE","MW","Non-coincident"]
[null,null,null,null,"Coincident"]
[null,null,"WEATHER CORRECTED MD 10% POE","MVA","Non-coincident"]
[null,null,null,null,"Coincident"]
[null,null,"WEATHER CORRECTED MD 50% POE","MW","Non-coincident"]
[null,null,null,null,"Coincident"]
[null,null,"WEATHER CORRECTED MD 50% POE","MVA","Non-coincident"]
[null,null,null,null,"Coincident"]
[null,"NSP to enter name","CONNECTION POINT RATING","MVA","Non-coincident"]
[null,null,null,null,"Coincident"]
[null,null,"WINTER/SUMMER PEAKING",null,"Non-coincident"]
[null,null,null,null,"Coincident"]
[null,null,"ADJUSTMENTS - EMBEDDED GENERATION","MW","Non-coincident"]
[null,null,null,null,"Coincident"]
[null,null,"WEATHER CORRECTED MD 10% POE","MW","Non-coincident"]
[null,null,null,null,"Coincident"]
[null,null,"WEATHER CORRECTED MD 10% POE","MVA","Non-coincident"]
[null,null,null,null,"Coincident"]
[null,null,"WEATHER CORRECTED MD 50% POE","MW","Non-coincident"]
[null,null,null,null,"Coincident"]
[null,null,"WEATHER CORRECTED MD 50% POE","MVA","Non-coincident"]
[null,null,null,null,"Coincident"]
[null,"NSP to enter name","CONNECTION POINT RATING","MVA","Non-coincident"]
[null,null,null,null,"Coincident"]
[null,null,"WINTER/SUMMER PEAKING",null,"Non-coincident"]
[null,null,null,null,"Coincident"]
[null,null,"ADJUSTMENTS - EMBEDDED GENERATION","MW","Non-coincident"]
[null,null,null,null,"Coincident"]
[null,null,"WEATHER CORRECTED MD 10% POE","MW","Non-coincident"]
[null,null,null,null,"Coincident"]
[null,null,"WEATHER CORRECTED MD 10% POE","MVA","Non-coincident"]
[null,null,null,null,"Coincident"]
[null,null,"WEATHER CORRECTED MD 50% POE","MW","Non-coincident"]
[null,null,null,null,"Coincident"]
[null,null,"WEATHER CORRECTED MD 50% POE","MVA","Non-coincident"]
[null,null,null,null,"Coincident"]
[null,"NSP to enter name","CONNECTION POINT RATING","MVA","Non-coincident"]
[null,null,null,null,"Coincident"]
[null,null,"WINTER/SUMMER PEAKING",null,"Non-coincident"]
[null,null,null,null,"Coincident"]
[null,null,"ADJUSTMENTS - EMBEDDED GENERATION","MW","Non-coincident"]
[null,null,null,null,"Coincident"]
[null,null,"WEATHER CORRECTED MD 10% POE","MW","Non-coincident"]
[null,null,null,null,"Coincident"]
[null,null,"WEATHER CORRECTED MD 10% POE","MVA","Non-coincident"]
[null,null,null,null,"Coincident"]
[null,null,"WEATHER CORRECTED MD 50% POE","MW","Non-coincident"]
[null,null,null,null,"Coincident"]
[null,null,"WEATHER CORRECTED MD 50% POE","MVA","Non-coincident"]
[null,null,null,null,"Coincident"]
[null,"NSP to enter name","CONNECTION POINT RATING","MVA","Non-coincident"]
[null,null,null,null,"Coincident"]
[null,null,"WINTER/SUMMER PEAKING",null,"Non-coincident"]
[null,null,null,null,"Coincident"]
[null,null,"ADJUSTMENTS - EMBEDDED GENERATION","MW","Non-coincident"]
[null,null,null,null,"Coincident"]
[null,null,"WEATHER CORRECTED MD 10% POE","MW","Non-coincident"]
[null,null,null,null,"Coincident"]
[null,null,"WEATHER CORRECTED MD 10% POE","MVA","Non-coincident"]
[null,null,null,null,"Coincident"]
[null,null,"WEATHER CORRECTED MD 50% POE","MW","Non-coincident"]
[null,null,null,null,"Coincident"]
[null,null,"WEATHER CORRECTED MD 50% POE","MVA","Non-coincident"]
[null,null,null,null,"Coincident"]
[null,"NSP to enter name","CONNECTION POINT RATING","MVA","Non-coincident"]
[null,null,null,null,"Coincident"]
[null,null,"WINTER/SUMMER PEAKING",null,"Non-coincident"]
[null,null,null,null,"Coincident"]
[null,null,"ADJUSTMENTS - EMBEDDED GENERATION","MW","Non-coincident"]
[null,null,null,null,"Coincident"]
[null,null,"WEATHER CORRECTED MD 10% POE","MW","Non-coincident"]
[null,null,null,null,"Coincident"]
[null,null,"WEATHER CORRECTED MD 10% POE","MVA","Non-coincident"]
[null,null,null,null,"Coincident"]
[null,null,"WEATHER CORRECTED MD 50% POE","MW","Non-coincident"]
[null,null,null,null,"Coincident"]
[null,null,"WEATHER CORRECTED MD 50% POE","MVA","Non-coincident"]
[null,null,null,null,"Coincident"]
[null,"NSP to enter name","CONNECTION POINT RATING","MVA","Non-coincident"]
[null,null,null,null,"Coincident"]
[null,null,"WINTER/SUMMER PEAKING",null,"Non-coincident"]
[null,null,null,null,"Coincident"]
[null,null,"ADJUSTMENTS - EMBEDDED GENERATION","MW","Non-coincident"]
[null,null,null,null,"Coincident"]
[null,null,"WEATHER CORRECTED MD 10% POE","MW","Non-coincident"]
[null,null,null,null,"Coincident"]
[null,null,"WEATHER CORRECTED MD 10% POE","MVA","Non-coincident"]
[null,null,null,null,"Coincident"]
[null,null,"WEATHER CORRECTED MD 50% POE","MW","Non-coincident"]
[null,null,null,null,"Coincident"]
[null,null,"WEATHER CORRECTED MD 50% POE","MVA","Non-coincident"]
[null,null,null,null,"Coincident"]
[null,"NSP to enter name","CONNECTION POINT RATING","MVA","Non-coincident"]
[null,null,null,null,"Coincident"]
[null,null,"WINTER/SUMMER PEAKING",null,"Non-coincident"]
[null,null,null,null,"Coincident"]
[null,null,"ADJUSTMENTS - EMBEDDED GENERATION","MW","Non-coincident"]
[null,null,null,null,"Coincident"]
[null,null,"WEATHER CORRECTED MD 10% POE","MW","Non-coincident"]
[null,null,null,null,"Coincident"]
[null,null,"WEATHER CORRECTED MD 10% POE","MVA","Non-coincident"]
[null,null,null,null,"Coincident"]
[null,null,"WEATHER CORRECTED MD 50% POE","MW","Non-coincident"]
[null,null,null,null,"Coincident"]
[null,null,"WEATHER CORRECTED MD 50% POE","MVA","Non-coincident"]
[null,null,null,null,"Coincident"]
[null,"NSP to enter name","CONNECTION POINT RATING","MVA","Non-coincident"]
[null,null,null,null,"Coincident"]
[null,null,"WINTER/SUMMER PEAKING",null,"Non-coincident"]
[null,null,null,null,"Coincident"]
[null,null,"ADJUSTMENTS - EMBEDDED GENERATION","MW","Non-coincident"]
[null,null,null,null,"Coincident"]
[null,null,"WEATHER CORRECTED MD 10% POE","MW","Non-coincident"]
[null,null,null,null,"Coincident"]
[null,null,"WEATHER CORRECTED MD 10% POE","MVA","Non-coincident"]
[null,null,null,null,"Coincident"]
[null,null,"WEATHER CORRECTED MD 50% POE","MW","Non-coincident"]
[null,null,null,null,"Coincident"]
[null,null,"WEATHER CORRECTED MD 50% POE","MVA","Non-coincident"]
[null,null,null,null,"Coincident"]
[null,"NSP to enter name","CONNECTION POINT RATING","MVA","Non-coincident"]
[null,null,null,null,"Coincident"]
[null,null,"WINTER/SUMMER PEAKING",null,"Non-coincident"]
[null,null,null,null,"Coincident"]
[null,null,"ADJUSTMENTS - EMBEDDED GENERATION","MW","Non-coincident"]
[null,null,null,null,"Coincident"]
[null,null,"WEATHER CORRECTED MD 10% POE","MW","Non-coincident"]
[null,null,null,null,"Coincident"]
[null,null,"WEATHER CORRECTED MD 10% POE","MVA","Non-coincident"]
[null,null,null,null,"Coincident"]
[null,null,"WEATHER CORRECTED MD 50% POE","MW","Non-coincident"]
[null,null,null,null,"Coincident"]
[null,null,"WEATHER CORRECTED MD 50% POE","MVA","Non-coincident"]
[null,null,null,null,"Coincident"]
[null,"NSP to enter name","CONNECTION POINT RATING","MVA","Non-coincident"]
[null,null,null,null,"Coincident"]
[null,null,"WINTER/SUMMER PEAKING",null,"Non-coincident"]
[null,null,null,null,"Coincident"]
[null,null,"ADJUSTMENTS - EMBEDDED GENERATION","MW","Non-coincident"]
[null,null,null,null,"Coincident"]
[null,null,"WEATHER CORRECTED MD 10% POE","MW","Non-coincident"]
[null,null,null,null,"Coincident"]
[null,null,"WEATHER CORRECTED MD 10% POE","MVA","Non-coincident"]
[null,null,null,null,"Coincident"]
[null,null,"WEATHER CORRECTED MD 50% POE","MW","Non-coincident"]
[null,null,null,null,"Coincident"]
[null,null,"WEATHER CORRECTED MD 50% POE","MVA","Non-coincident"]
[null,null,null,null,"Coincident"]
[null,"NSP to enter name","CONNECTION POINT RATING","MVA","Non-coincident"]
[null,null,null,null,"Coincident"]
[null,null,"WINTER/SUMMER PEAKING",null,"Non-coincident"]
[null,null,null,null,"Coincident"]
[null,null,"ADJUSTMENTS - EMBEDDED GENERATION","MW","Non-coincident"]
[null,null,null,null,"Coincident"]
[null,null,"WEATHER CORRECTED MD 10% POE","MW","Non-coincident"]
[null,null,null,null,"Coincident"]
[null,null,"WEATHER CORRECTED MD 10% POE","MVA","Non-coincident"]
[null,null,null,null,"Coincident"]
[null,null,"WEATHER CORRECTED MD 50% POE","MW","Non-coincident"]
[null,null,null,null,"Coincident"]
[null,null,"WEATHER CORRECTED MD 50% POE","MVA","Non-coincident"]
[null,null,null,null,"Coincident"]
[null,"NSP to enter name","CONNECTION POINT RATING","MVA","Non-coincident"]
[null,null,null,null,"Coincident"]
[null,null,"WINTER/SUMMER PEAKING",null,"Non-coincident"]
[null,null,null,null,"Coincident"]
[null,null,"ADJUSTMENTS - EMBEDDED GENERATION","MW","Non-coincident"]
[null,null,null,null,"Coincident"]
[null,null,"WEATHER CORRECTED MD 10% POE","MW","Non-coincident"]
[null,null,null,null,"Coincident"]
[null,null,"WEATHER CORRECTED MD 10% POE","MVA","Non-coincident"]
[null,null,null,null,"Coincident"]
[null,null,"WEATHER CORRECTED MD 50% POE","MW","Non-coincident"]
[null,null,null,null,"Coincident"]
[null,null,"WEATHER CORRECTED MD 50% POE","MVA","Non-coincident"]
[null,null,null,null,"Coincident"]
[null,"NSP to enter name","CONNECTION POINT RATING","MVA","Non-coincident"]
[null,null,null,null,"Coincident"]
[null,null,"WINTER/SUMMER PEAKING",null,"Non-coincident"]
[null,null,null,null,"Coincident"]
[null,null,"ADJUSTMENTS - EMBEDDED GENERATION","MW","Non-coincident"]
[null,null,null,null,"Coincident"]
[null,null,"WEATHER CORRECTED MD 10% POE","MW","Non-coincident"]
[null,null,null,null,"Coincident"]
[null,null,"WEATHER CORRECTED MD 10% POE","MVA","Non-coincident"]
[null,null,null,null,"Coincident"]
[null,null,"WEATHER CORRECTED MD 50% POE","MW","Non-coincident"]
[null,null,null,null,"Coincident"]
[null,null,"WEATHER CORRECTED MD 50% POE","MVA","Non-coincident"]
[null,null,null,null,"Coincident"]
[null,"NSP to enter name","CONNECTION POINT RATING","MVA","Non-coincident"]
[null,null,null,null,"Coincident"]
[null,null,"WINTER/SUMMER PEAKING",null,"Non-coincident"]
[null,null,null,null,"Coincident"]
[null,null,"ADJUSTMENTS - EMBEDDED GENERATION","MW","Non-coincident"]
[null,null,null,null,"Coincident"]
[null,null,"WEATHER CORRECTED MD 10% POE","MW","Non-coincident"]
[null,null,null,null,"Coincident"]
[null,null,"WEATHER CORRECTED MD 10% POE","MVA","Non-coincident"]
[null,null,null,null,"Coincident"]
[null,null,"WEATHER CORRECTED MD 50% POE","MW","Non-coincident"]
[null,null,null,null,"Coincident"]
[null,null,"WEATHER CORRECTED MD 50% POE","MVA","Non-coincident"]
[null,null,null,null,"Coincident"]
[null,"NSP to enter name","CONNECTION POINT RATING","MVA","Non-coincident"]
[null,null,null,null,"Coincident"]
[null,null,"WINTER/SUMMER PEAKING",null,"Non-coincident"]
[null,null,null,null,"Coincident"]
[null,null,"ADJUSTMENTS - EMBEDDED GENERATION","MW","Non-coincident"]
[null,null,null,null,"Coincident"]
[null,null,"WEATHER CORRECTED MD 10% POE","MW","Non-coincident"]
[null,null,null,null,"Coincident"]
[null,null,"WEATHER CORRECTED MD 10% POE","MVA","Non-coincident"]
[null,null,null,null,"Coincident"]
[null,null,"WEATHER CORRECTED MD 50% POE","MW","Non-coincident"]
[null,null,null,null,"Coincident"]
[null,null,"WEATHER CORRECTED MD 50% POE","MVA","Non-coincident"]
[null,null,null,null,"Coincident"]
[null,"NSP to enter name","CONNECTION POINT RATING","MVA","Non-coincident"]
[null,null,null,null,"Coincident"]
[null,null,"WINTER/SUMMER PEAKING",null,"Non-coincident"]
[null,null,null,null,"Coincident"]
[null,null,"ADJUSTMENTS - EMBEDDED GENERATION","MW","Non-coincident"]
[null,null,null,null,"Coincident"]
[null,null,"WEATHER CORRECTED MD 10% POE","MW","Non-coincident"]
[null,null,null,null,"Coincident"]
[null,null,"WEATHER CORRECTED MD 10% POE","MVA","Non-coincident"]
[null,null,null,null,"Coincident"]
[null,null,"WEATHER CORRECTED MD 50% POE","MW","Non-coincident"]
[null,null,null,null,"Coincident"]
[null,null,"WEATHER CORRECTED MD 50% POE","MVA","Non-coincident"]
[null,null,null,null,"Coincident"]
[null,"NSP to enter name","CONNECTION POINT RATING","MVA","Non-coincident"]
[null,null,null,null,"Coincident"]
[null,null,"WINTER/SUMMER PEAKING",null,"Non-coincident"]
[null,null,null,null,"Coincident"]
[null,null,"ADJUSTMENTS - EMBEDDED GENERATION","MW","Non-coincident"]
[null,null,null,null,"Coincident"]
[null,null,"WEATHER CORRECTED MD 10% POE","MW","Non-coincident"]
[null,null,null,null,"Coincident"]
[null,null,"WEATHER CORRECTED MD 10% POE","MVA","Non-coincident"]
[null,null,null,null,"Coincident"]
[null,null,"WEATHER CORRECTED MD 50% POE","MW","Non-coincident"]
[null,null,null,null,"Coincident"]
[null,null,"WEATHER CORRECTED MD 50% POE","MVA","Non-coincident"]
[null,null,null,null,"Coincident"]
[null,"NSP to enter name","CONNECTION POINT RATING","MVA","Non-coincident"]
[null,null,null,null,"Coincident"]
[null,null,"WINTER/SUMMER PEAKING",null,"Non-coincident"]
[null,null,null,null,"Coincident"]
[null,null,"ADJUSTMENTS - EMBEDDED GENERATION","MW","Non-coincident"]
[null,null,null,null,"Coincident"]
[null,null,"WEATHER CORRECTED MD 10% POE","MW","Non-coincident"]
[null,null,null,null,"Coincident"]
[null,null,"WEATHER CORRECTED MD 10% POE","MVA","Non-coincident"]
[null,null,null,null,"Coincident"]
[null,null,"WEATHER CORRECTED MD 50% POE","MW","Non-coincident"]
[null,null,null,null,"Coincident"]
[null,null,"WEATHER CORRECTED MD 50% POE","MVA","Non-coincident"]
[null,null,null,null,"Coincident"]
[null,"NSP to enter name","CONNECTION POINT RATING","MVA","Non-coincident"]
[null,null,null,null,"Coincident"]
[null,null,"WINTER/SUMMER PEAKING",null,"Non-coincident"]
[null,null,null,null,"Coincident"]
[null,null,"ADJUSTMENTS - EMBEDDED GENERATION","MW","Non-coincident"]
[null,null,null,null,"Coincident"]
[null,null,"WEATHER CORRECTED MD 10% POE","MW","Non-coincident"]
[null,null,null,null,"Coincident"]
[null,null,"WEATHER CORRECTED MD 10% POE","MVA","Non-coincident"]
[null,null,null,null,"Coincident"]
[null,null,"WEATHER CORRECTED MD 50% POE","MW","Non-coincident"]
[null,null,null,null,"Coincident"]
[null,null,"WEATHER CORRECTED MD 50% POE","MVA","Non-coincident"]
[null,null,null,null,"Coincident"]
[null,"NSP to enter name","CONNECTION POINT RATING","MVA","Non-coincident"]
[null,null,null,null,"Coincident"]
[null,null,"WINTER/SUMMER PEAKING",null,"Non-coincident"]
[null,null,null,null,"Coincident"]
[null,null,"ADJUSTMENTS - EMBEDDED GENERATION","MW","Non-coincident"]
[null,null,null,null,"Coincident"]
[null,null,"WEATHER CORRECTED MD 10% POE","MW","Non-coincident"]
[null,null,null,null,"Coincident"]
[null,null,"WEATHER CORRECTED MD 10% POE","MVA","Non-coincident"]
[null,null,null,null,"Coincident"]
[null,null,"WEATHER CORRECTED MD 50% POE","MW","Non-coincident"]
[null,null,null,null,"Coincident"]
[null,null,"WEATHER CORRECTED MD 50% POE","MVA","Non-coincident"]
[null,null,null,null,"Coincident"]
[null,"NSP to enter name","CONNECTION POINT RATING","MVA","Non-coincident"]
[null,null,null,null,"Coincident"]
[null,null,"WINTER/SUMMER PEAKING",null,"Non-coincident"]
[null,null,null,null,"Coincident"]
[null,null,"ADJUSTMENTS - EMBEDDED GENERATION","MW","Non-coincident"]
[null,null,null,null,"Coincident"]
[null,null,"WEATHER CORRECTED MD 10% POE","MW","Non-coincident"]
[null,null,null,null,"Coincident"]
[null,null,"WEATHER CORRECTED MD 10% POE","MVA","Non-coincident"]
[null,null,null,null,"Coincident"]
[null,null,"WEATHER CORRECTED MD 50% POE","MW","Non-coincident"]
[null,null,null,null,"Coincident"]
[null,null,"WEATHER CORRECTED MD 50% POE","MVA","Non-coincident"]
[null,null,null,null,"Coincident"]
[null,"NSP to enter name","CONNECTION POINT RATING","MVA","Non-coincident"]
[null,null,null,null,"Coincident"]
[null,null,"WINTER/SUMMER PEAKING",null,"Non-coincident"]
[null,null,null,null,"Coincident"]
[null,null,"ADJUSTMENTS - EMBEDDED GENERATION","MW","Non-coincident"]
[null,null,null,null,"Coincident"]
[null,null,"WEATHER CORRECTED MD 10% POE","MW","Non-coincident"]
[null,null,null,null,"Coincident"]
[null,null,"WEATHER CORRECTED MD 10% POE","MVA","Non-coincident"]
[null,null,null,null,"Coincident"]
[null,null,"WEATHER CORRECTED MD 50% POE","MW","Non-coincident"]
[null,null,null,null,"Coincident"]
[null,null,"WEATHER CORRECTED MD 50% POE","MVA","Non-coincident"]
[null,null,null,null,"Coincident"]
[null,"NSP to enter name","CONNECTION POINT RATING","MVA","Non-coincident"]
[null,null,null,null,"Coincident"]
[null,null,"WINTER/SUMMER PEAKING",null,"Non-coincident"]
[null,null,null,null,"Coincident"]
[null,null,"ADJUSTMENTS - EMBEDDED GENERATION","MW","Non-coincident"]
[null,null,null,null,"Coincident"]
[null,null,"WEATHER CORRECTED MD 10% POE","MW","Non-coincident"]
[null,null,null,null,"Coincident"]
[null,null,"WEATHER CORRECTED MD 10% POE","MVA","Non-coincident"]
[null,null,null,null,"Coincident"]
[null,null,"WEATHER CORRECTED MD 50% POE","MW","Non-coincident"]
[null,null,null,null,"Coincident"]
[null,null,"WEATHER CORRECTED MD 50% POE","MVA","Non-coincident"]
[null,null,null,null,"Coincident"]
[null,"NSP to enter name","CONNECTION POINT RATING","MVA","Non-coincident"]
[null,null,null,null,"Coincident"]
[null,null,"WINTER/SUMMER PEAKING",null,"Non-coincident"]
[null,null,null,null,"Coincident"]
[null,null,"ADJUSTMENTS - EMBEDDED GENERATION","MW","Non-coincident"]
[null,null,null,null,"Coincident"]
[null,null,"WEATHER CORRECTED MD 10% POE","MW","Non-coincident"]
[null,null,null,null,"Coincident"]
[null,null,"WEATHER CORRECTED MD 10% POE","MVA","Non-coincident"]
[null,null,null,null,"Coincident"]
[null,null,"WEATHER CORRECTED MD 50% POE","MW","Non-coincident"]
[null,null,null,null,"Coincident"]
[null,null,"WEATHER CORRECTED MD 50% POE","MVA","Non-coincident"]
[null,null,null,null,"Coincident"]
[null,"NSP to enter name","CONNECTION POINT RATING","MVA","Non-coincident"]
[null,null,null,null,"Coincident"]
[null,null,"WINTER/SUMMER PEAKING",null,"Non-coincident"]
[null,null,null,null,"Coincident"]
[null,null,"ADJUSTMENTS - EMBEDDED GENERATION","MW","Non-coincident"]
[null,null,null,null,"Coincident"]
[null,null,"WEATHER CORRECTED MD 10% POE","MW","Non-coincident"]
[null,null,null,null,"Coincident"]
[null,null,"WEATHER CORRECTED MD 10% POE","MVA","Non-coincident"]
[null,null,null,null,"Coincident"]
[null,null,"WEATHER CORRECTED MD 50% POE","MW","Non-coincident"]
[null,null,null,null,"Coincident"]
[null,null,"WEATHER CORRECTED MD 50% POE","MVA","Non-coincident"]
[null,null,null,null,"Coincident"]
[null,"NSP to enter name","CONNECTION POINT RATING","MVA","Non-coincident"]
[null,null,null,null,"Coincident"]
[null,null,"WINTER/SUMMER PEAKING",null,"Non-coincident"]
[null,null,null,null,"Coincident"]
[null,null,"ADJUSTMENTS - EMBEDDED GENERATION","MW","Non-coincident"]
[null,null,null,null,"Coincident"]
[null,null,"WEATHER CORRECTED MD 10% POE","MW","Non-coincident"]
[null,null,null,null,"Coincident"]
[null,null,"WEATHER CORRECTED MD 10% POE","MVA","Non-coincident"]
[null,null,null,null,"Coincident"]
[null,null,"WEATHER CORRECTED MD 50% POE","MW","Non-coincident"]
[null,null,null,null,"Coincident"]
[null,null,"WEATHER CORRECTED MD 50% POE","MVA","Non-coincident"]
[null,null,null,null,"Coincident"]
[null,"NSP to enter name","CONNECTION POINT RATING","MVA","Non-coincident"]
[null,null,null,null,"Coincident"]
[null,null,"WINTER/SUMMER PEAKING",null,"Non-coincident"]
[null,null,null,null,"Coincident"]
[null,null,"ADJUSTMENTS - EMBEDDED GENERATION","MW","Non-coincident"]
[null,null,null,null,"Coincident"]
[null,null,"WEATHER CORRECTED MD 10% POE","MW","Non-coincident"]
[null,null,null,null,"Coincident"]
[null,null,"WEATHER CORRECTED MD 10% POE","MVA","Non-coincident"]
[null,null,null,null,"Coincident"]
[null,null,"WEATHER CORRECTED MD 50% POE","MW","Non-coincident"]
[null,null,null,null,"Coincident"]
[null,null,"WEATHER CORRECTED MD 50% POE","MVA","Non-coincident"]
[null,null,null,null,"Coincident"]
[null,"NSP to enter name","CONNECTION POINT RATING","MVA","Non-coincident"]
[null,null,null,null,"Coincident"]
[null,null,"WINTER/SUMMER PEAKING",null,"Non-coincident"]
[null,null,null,null,"Coincident"]
[null,null,"ADJUSTMENTS - EMBEDDED GENERATION","MW","Non-coincident"]
[null,null,null,null,"Coincident"]
[null,null,"WEATHER CORRECTED MD 10% POE","MW","Non-coincident"]
[null,null,null,null,"Coincident"]
[null,null,"WEATHER CORRECTED MD 10% POE","MVA","Non-coincident"]
[null,null,null,null,"Coincident"]
[null,null,"WEATHER CORRECTED MD 50% POE","MW","Non-coincident"]
[null,null,null,null,"Coincident"]
[null,null,"WEATHER CORRECTED MD 50% POE","MVA","Non-coincident"]
[null,null,null,null,"Coincident"]
[null,"NSP to enter name","CONNECTION POINT RATING","MVA","Non-coincident"]
[null,null,null,null,"Coincident"]
[null,null,"WINTER/SUMMER PEAKING",null,"Non-coincident"]
[null,null,null,null,"Coincident"]
[null,null,"ADJUSTMENTS - EMBEDDED GENERATION","MW","Non-coincident"]
[null,null,null,null,"Coincident"]
[null,null,"WEATHER CORRECTED MD 10% POE","MW","Non-coincident"]
[null,null,null,null,"Coincident"]
[null,null,"WEATHER CORRECTED MD 10% POE","MVA","Non-coincident"]
[null,null,null,null,"Coincident"]
[null,null,"WEATHER CORRECTED MD 50% POE","MW","Non-coincident"]
[null,null,null,null,"Coincident"]
[null,null,"WEATHER CORRECTED MD 50% POE","MVA","Non-coincident"]
[null,null,null,null,"Coincident"]
[null,"NSP to enter name","CONNECTION POINT RATING","MVA","Non-coincident"]
[null,null,null,null,"Coincident"]
[null,null,"WINTER/SUMMER PEAKING",null,"Non-coincident"]
[null,null,null,null,"Coincident"]
[null,null,"ADJUSTMENTS - EMBEDDED GENERATION","MW","Non-coincident"]
[null,null,null,null,"Coincident"]
[null,null,"WEATHER CORRECTED MD 10% POE","MW","Non-coincident"]
[null,null,null,null,"Coincident"]
[null,null,"WEATHER CORRECTED MD 10% POE","MVA","Non-coincident"]
[null,null,null,null,"Coincident"]
[null,null,"WEATHER CORRECTED MD 50% POE","MW","Non-coincident"]
[null,null,null,null,"Coincident"]
[null,null,"WEATHER CORRECTED MD 50% POE","MVA","Non-coincident"]
[null,null,null,null,"Coincident"]
[null,"NSP to enter name","CONNECTION POINT RATING","MVA","Non-coincident"]
[null,null,null,null,"Coincident"]
[null,null,"WINTER/SUMMER PEAKING",null,"Non-coincident"]
[null,null,null,null,"Coincident"]
[null,null,"ADJUSTMENTS - EMBEDDED GENERATION","MW","Non-coincident"]
[null,null,null,null,"Coincident"]
[null,null,"WEATHER CORRECTED MD 10% POE","MW","Non-coincident"]
[null,null,null,null,"Coincident"]
[null,null,"WEATHER CORRECTED MD 10% POE","MVA","Non-coincident"]
[null,null,null,null,"Coincident"]
[null,null,"WEATHER CORRECTED MD 50% POE","MW","Non-coincident"]
[null,null,null,null,"Coincident"]
[null,null,"WEATHER CORRECTED MD 50% POE","MVA","Non-coincident"]
[null,null,null,null,"Coincident"]
[null,"NSP to enter name","CONNECTION POINT RATING","MVA","Non-coincident"]
[null,null,null,null,"Coincident"]
[null,null,"WINTER/SUMMER PEAKING",null,"Non-coincident"]
[null,null,null,null,"Coincident"]
[null,null,"ADJUSTMENTS - EMBEDDED GENERATION","MW","Non-coincident"]
[null,null,null,null,"Coincident"]
[null,null,"WEATHER CORRECTED MD 10% POE","MW","Non-coincident"]
[null,null,null,null,"Coincident"]
[null,null,"WEATHER CORRECTED MD 10% POE","MVA","Non-coincident"]
[null,null,null,null,"Coincident"]
[null,null,"WEATHER CORRECTED MD 50% POE","MW","Non-coincident"]
[null,null,null,null,"Coincident"]
[null,null,"WEATHER CORRECTED MD 50% POE","MVA","Non-coincident"]
[null,null,null,null,"Coincident"]
[null,"NSP to enter name","CONNECTION POINT RATING","MVA","Non-coincident"]
[null,null,null,null,"Coincident"]
[null,null,"WINTER/SUMMER PEAKING",null,"Non-coincident"]
[null,null,null,null,"Coincident"]
[null,null,"ADJUSTMENTS - EMBEDDED GENERATION","MW","Non-coincident"]
[null,null,null,null,"Coincident"]
[null,null,"WEATHER CORRECTED MD 10% POE","MW","Non-coincident"]
[null,null,null,null,"Coincident"]
[null,null,"WEATHER CORRECTED MD 10% POE","MVA","Non-coincident"]
[null,null,null,null,"Coincident"]
[null,null,"WEATHER CORRECTED MD 50% POE","MW","Non-coincident"]
[null,null,null,null,"Coincident"]
[null,null,"WEATHER CORRECTED MD 50% POE","MVA","Non-coincident"]
[null,null,null,null,"Coincident"]
[null,"NSP to enter name","CONNECTION POINT RATING","MVA","Non-coincident"]
[null,null,null,null,"Coincident"]
[null,null,"WINTER/SUMMER PEAKING",null,"Non-coincident"]
[null,null,null,null,"Coincident"]
[null,null,"ADJUSTMENTS - EMBEDDED GENERATION","MW","Non-coincident"]
[null,null,null,null,"Coincident"]
[null,null,"WEATHER CORRECTED MD 10% POE","MW","Non-coincident"]
[null,null,null,null,"Coincident"]
[null,null,"WEATHER CORRECTED MD 10% POE","MVA","Non-coincident"]
[null,null,null,null,"Coincident"]
[null,null,"WEATHER CORRECTED MD 50% POE","MW","Non-coincident"]
[null,null,null,null,"Coincident"]
[null,null,"WEATHER CORRECTED MD 50% POE","MVA","Non-coincident"]
[null,null,null,null,"Coincident"]
[null,"NSP to enter name","CONNECTION POINT RATING","MVA","Non-coincident"]
[null,null,null,null,"Coincident"]
[null,null,"WINTER/SUMMER PEAKING",null,"Non-coincident"]
[null,null,null,null,"Coincident"]
[null,null,"ADJUSTMENTS - EMBEDDED GENERATION","MW","Non-coincident"]
[null,null,null,null,"Coincident"]
[null,null,"WEATHER CORRECTED MD 10% POE","MW","Non-coincident"]
[null,null,null,null,"Coincident"]
[null,null,"WEATHER CORRECTED MD 10% POE","MVA","Non-coincident"]
[null,null,null,null,"Coincident"]
[null,null,"WEATHER CORRECTED MD 50% POE","MW","Non-coincident"]
[null,null,null,null,"Coincident"]
[null,null,"WEATHER CORRECTED MD 50% POE","MVA","Non-coincident"]
[null,null,null,null,"Coincident"]
[null,"NSP to enter name","CONNECTION POINT RATING","MVA","Non-coincident"]
[null,null,null,null,"Coincident"]
[null,null,"WINTER/SUMMER PEAKING",null,"Non-coincident"]
[null,null,null,null,"Coincident"]
[null,null,"ADJUSTMENTS - EMBEDDED GENERATION","MW","Non-coincident"]
[null,null,null,null,"Coincident"]
[null,null,"WEATHER CORRECTED MD 10% POE","MW","Non-coincident"]
[null,null,null,null,"Coincident"]
[null,null,"WEATHER CORRECTED MD 10% POE","MVA","Non-coincident"]
[null,null,null,null,"Coincident"]
[null,null,"WEATHER CORRECTED MD 50% POE","MW","Non-coincident"]
[null,null,null,null,"Coincident"]
[null,null,"WEATHER CORRECTED MD 50% POE","MVA","Non-coincident"]
[null,null,null,null,"Coincident"]
[null,"NSP to enter name","CONNECTION POINT RATING","MVA","Non-coincident"]
[null,null,null,null,"Coincident"]
[null,null,"WINTER/SUMMER PEAKING",null,"Non-coincident"]
[null,null,null,null,"Coincident"]
[null,null,"ADJUSTMENTS - EMBEDDED GENERATION","MW","Non-coincident"]
[null,null,null,null,"Coincident"]
[null,null,"WEATHER CORRECTED MD 10% POE","MW","Non-coincident"]
[null,null,null,null,"Coincident"]
[null,null,"WEATHER CORRECTED MD 10% POE","MVA","Non-coincident"]
[null,null,null,null,"Coincident"]
[null,null,"WEATHER CORRECTED MD 50% POE","MW","Non-coincident"]
[null,null,null,null,"Coincident"]
[null,null,"WEATHER CORRECTED MD 50% POE","MVA","Non-coincident"]
[null,null,null,null,"Coincident"]
[null,"NSP to enter name","CONNECTION POINT RATING","MVA","Non-coincident"]
[null,null,null,null,"Coincident"]
[null,null,"WINTER/SUMMER PEAKING",null,"Non-coincident"]
[null,null,null,null,"Coincident"]
[null,null,"ADJUSTMENTS - EMBEDDED GENERATION","MW","Non-coincident"]
[null,null,null,null,"Coincident"]
[null,null,"WEATHER CORRECTED MD 10% POE","MW","Non-coincident"]
[null,null,null,null,"Coincident"]
[null,null,"WEATHER CORRECTED MD 10% POE","MVA","Non-coincident"]
[null,null,null,null,"Coincident"]
[null,null,"WEATHER CORRECTED MD 50% POE","MW","Non-coincident"]
[null,null,null,null,"Coincident"]
[null,null,"WEATHER CORRECTED MD 50% POE","MVA","Non-coincident"]
[null,null,null,null,"Coincident"]
[null,"NSP to enter name","CONNECTION POINT RATING","MVA","Non-coincident"]
[null,null,null,null,"Coincident"]
[null,null,"WINTER/SUMMER PEAKING",null,"Non-coincident"]
[null,null,null,null,"Coincident"]
[null,null,"ADJUSTMENTS - EMBEDDED GENERATION","MW","Non-coincident"]
[null,null,null,null,"Coincident"]
[null,null,"WEATHER CORRECTED MD 10% POE","MW","Non-coincident"]
[null,null,null,null,"Coincident"]
[null,null,"WEATHER CORRECTED MD 10% POE","MVA","Non-coincident"]
[null,null,null,null,"Coincident"]
[null,null,"WEATHER CORRECTED MD 50% POE","MW","Non-coincident"]
[null,null,null,null,"Coincident"]
[null,null,"WEATHER CORRECTED MD 50% POE","MVA","Non-coincident"]
[null,null,null,null,"Coincident"]
[null,"NSP to enter name","CONNECTION POINT RATING","MVA","Non-coincident"]
[null,null,null,null,"Coincident"]
[null,null,"WINTER/SUMMER PEAKING",null,"Non-coincident"]
[null,null,null,null,"Coincident"]
[null,null,"ADJUSTMENTS - EMBEDDED GENERATION","MW","Non-coincident"]
[null,null,null,null,"Coincident"]
[null,null,"WEATHER CORRECTED MD 10% POE","MW","Non-coincident"]
[null,null,null,null,"Coincident"]
[null,null,"WEATHER CORRECTED MD 10% POE","MVA","Non-coincident"]
[null,null,null,null,"Coincident"]
[null,null,"WEATHER CORRECTED MD 50% POE","MW","Non-coincident"]
[null,null,null,null,"Coincident"]
[null,null,"WEATHER CORRECTED MD 50% POE","MVA","Non-coincident"]
[null,null,null,null,"Coincident"]
[null,"NSP to enter name","CONNECTION POINT RATING","MVA","Non-coincident"]
[null,null,null,null,"Coincident"]
[null,null,"WINTER/SUMMER PEAKING",null,"Non-coincident"]
[null,null,null,null,"Coincident"]
[null,null,"ADJUSTMENTS - EMBEDDED GENERATION","MW","Non-coincident"]
[null,null,null,null,"Coincident"]
[null,null,"WEATHER CORRECTED MD 10% POE","MW","Non-coincident"]
[null,null,null,null,"Coincident"]
[null,null,"WEATHER CORRECTED MD 10% POE","MVA","Non-coincident"]
[null,null,null,null,"Coincident"]
[null,null,"WEATHER CORRECTED MD 50% POE","MW","Non-coincident"]
[null,null,null,null,"Coincident"]
[null,null,"WEATHER CORRECTED MD 50% POE","MVA","Non-coincident"]
[null,null,null,null,"Coincident"]
[null,"NSP to enter name","CONNECTION POINT RATING","MVA","Non-coincident"]
[null,null,null,null,"Coincident"]
[null,null,"WINTER/SUMMER PEAKING",null,"Non-coincident"]
[null,null,null,null,"Coincident"]
[null,null,"ADJUSTMENTS - EMBEDDED GENERATION","MW","Non-coincident"]
[null,null,null,null,"Coincident"]
[null,null,"WEATHER CORRECTED MD 10% POE","MW","Non-coincident"]
[null,null,null,null,"Coincident"]
[null,null,"WEATHER CORRECTED MD 10% POE","MVA","Non-coincident"]
[null,null,null,null,"Coincident"]
[null,null,"WEATHER CORRECTED MD 50% POE","MW","Non-coincident"]
[null,null,null,null,"Coincident"]
[null,null,"WEATHER CORRECTED MD 50% POE","MVA","Non-coincident"]
[null,null,null,null,"Coincident"]
[null,"NSP to enter name","CONNECTION POINT RATING","MVA","Non-coincident"]
[null,null,null,null,"Coincident"]
[null,null,"WINTER/SUMMER PEAKING",null,"Non-coincident"]
[null,null,null,null,"Coincident"]
[null,null,"ADJUSTMENTS - EMBEDDED GENERATION","MW","Non-coincident"]
[null,null,null,null,"Coincident"]
[null,null,"WEATHER CORRECTED MD 10% POE","MW","Non-coincident"]
[null,null,null,null,"Coincident"]
[null,null,"WEATHER CORRECTED MD 10% POE","MVA","Non-coincident"]
[null,null,null,null,"Coincident"]
[null,null,"WEATHER CORRECTED MD 50% POE","MW","Non-coincident"]
[null,null,null,null,"Coincident"]
[null,null,"WEATHER CORRECTED MD 50% POE","MVA","Non-coincident"]
[null,null,null,null,"Coincident"]
[null,"NSP to enter name","CONNECTION POINT RATING","MVA","Non-coincident"]
[null,null,null,null,"Coincident"]
[null,null,"WINTER/SUMMER PEAKING",null,"Non-coincident"]
[null,null,null,null,"Coincident"]
[null,null,"ADJUSTMENTS - EMBEDDED GENERATION","MW","Non-coincident"]
[null,null,null,null,"Coincident"]
[null,null,"WEATHER CORRECTED MD 10% POE","MW","Non-coincident"]
[null,null,null,null,"Coincident"]
[null,null,"WEATHER CORRECTED MD 10% POE","MVA","Non-coincident"]
[null,null,null,null,"Coincident"]
[null,null,"WEATHER CORRECTED MD 50% POE","MW","Non-coincident"]
[null,null,null,null,"Coincident"]
[null,null,"WEATHER CORRECTED MD 50% POE","MVA","Non-coincident"]
[null,null,null,null,"Coincident"]
[null,"NSP to enter name","CONNECTION POINT RATING","MVA","Non-coincident"]
[null,null,null,null,"Coincident"]
[null,null,"WINTER/SUMMER PEAKING",null,"Non-coincident"]
[null,null,null,null,"Coincident"]
[null,null,"ADJUSTMENTS - EMBEDDED GENERATION","MW","Non-coincident"]
[null,null,null,null,"Coincident"]
[null,null,"WEATHER CORRECTED MD 10% POE","MW","Non-coincident"]
[null,null,null,null,"Coincident"]
[null,null,"WEATHER CORRECTED MD 10% POE","MVA","Non-coincident"]
[null,null,null,null,"Coincident"]
[null,null,"WEATHER CORRECTED MD 50% POE","MW","Non-coincident"]
[null,null,null,null,"Coincident"]
[null,null,"WEATHER CORRECTED MD 50% POE","MVA","Non-coincident"]
[null,null,null,null,"Coincident"]
[null,"NSP to enter name","CONNECTION POINT RATING","MVA","Non-coincident"]
[null,null,null,null,"Coincident"]
[null,null,"WINTER/SUMMER PEAKING",null,"Non-coincident"]
[null,null,null,null,"Coincident"]
[null,null,"ADJUSTMENTS - EMBEDDED GENERATION","MW","Non-coincident"]
[null,null,null,null,"Coincident"]
[null,null,"WEATHER CORRECTED MD 10% POE","MW","Non-coincident"]
[null,null,null,null,"Coincident"]
[null,null,"WEATHER CORRECTED MD 10% POE","MVA","Non-coincident"]
[null,null,null,null,"Coincident"]
[null,null,"WEATHER CORRECTED MD 50% POE","MW","Non-coincident"]
[null,null,null,null,"Coincident"]
[null,null,"WEATHER CORRECTED MD 50% POE","MVA","Non-coincident"]
[null,null,null,null,"Coincident"]
[null,"NSP to enter name","CONNECTION POINT RATING","MVA","Non-coincident"]
[null,null,null,null,"Coincident"]
[null,null,"WINTER/SUMMER PEAKING",null,"Non-coincident"]
[null,null,null,null,"Coincident"]
[null,null,"ADJUSTMENTS - EMBEDDED GENERATION","MW","Non-coincident"]
[null,null,null,null,"Coincident"]
[null,null,"WEATHER CORRECTED MD 10% POE","MW","Non-coincident"]
[null,null,null,null,"Coincident"]
[null,null,"WEATHER CORRECTED MD 10% POE","MVA","Non-coincident"]
[null,null,null,null,"Coincident"]
[null,null,"WEATHER CORRECTED MD 50% POE","MW","Non-coincident"]
[null,null,null,null,"Coincident"]
[null,null,"WEATHER CORRECTED MD 50% POE","MVA","Non-coincident"]
[null,null,null,null,"Coincident"]
[null,"NSP to enter name","CONNECTION POINT RATING","MVA","Non-coincident"]
[null,null,null,null,"Coincident"]
[null,null,"WINTER/SUMMER PEAKING",null,"Non-coincident"]
[null,null,null,null,"Coincident"]
[null,null,"ADJUSTMENTS - EMBEDDED GENERATION","MW","Non-coincident"]
[null,null,null,null,"Coincident"]
[null,null,"WEATHER CORRECTED MD 10% POE","MW","Non-coincident"]
[null,null,null,null,"Coincident"]
[null,null,"WEATHER CORRECTED MD 10% POE","MVA","Non-coincident"]
[null,null,null,null,"Coincident"]
[null,null,"WEATHER CORRECTED MD 50% POE","MW","Non-coincident"]
[null,null,null,null,"Coincident"]
[null,null,"WEATHER CORRECTED MD 50% POE","MVA","Non-coincident"]
[null,null,null,null,"Coincident"]
[null,"NSP to enter name","CONNECTION POINT RATING","MVA","Non-coincident"]
[null,null,null,null,"Coincident"]
[null,null,"WINTER/SUMMER PEAKING",null,"Non-coincident"]
[null,null,null,null,"Coincident"]
[null,null,"ADJUSTMENTS - EMBEDDED GENERATION","MW","Non-coincident"]
[null,null,null,null,"Coincident"]
[null,null,"WEATHER CORRECTED MD 10% POE","MW","Non-coincident"]
[null,null,null,null,"Coincident"]
[null,null,"WEATHER CORRECTED MD 10% POE","MVA","Non-coincident"]
[null,null,null,null,"Coincident"]
[null,null,"WEATHER CORRECTED MD 50% POE","MW","Non-coincident"]
[null,null,null,null,"Coincident"]
[null,null,"WEATHER CORRECTED MD 50% POE","MVA","Non-coincident"]
[null,null,null,null,"Coincident"]
[null,"NSP to enter name","CONNECTION POINT RATING","MVA","Non-coincident"]
[null,null,null,null,"Coincident"]
[null,null,"WINTER/SUMMER PEAKING",null,"Non-coincident"]
[null,null,null,null,"Coincident"]
[null,null,"ADJUSTMENTS - EMBEDDED GENERATION","MW","Non-coincident"]
[null,null,null,null,"Coincident"]
[null,null,"WEATHER CORRECTED MD 10% POE","MW","Non-coincident"]
[null,null,null,null,"Coincident"]
[null,null,"WEATHER CORRECTED MD 10% POE","MVA","Non-coincident"]
[null,null,null,null,"Coincident"]
[null,null,"WEATHER CORRECTED MD 50% POE","MW","Non-coincident"]
[null,null,null,null,"Coincident"]
[null,null,"WEATHER CORRECTED MD 50% POE","MVA","Non-coincident"]
[null,null,null,null,"Coincident"]
[null,"NSP to enter name","CONNECTION POINT RATING","MVA","Non-coincident"]
[null,null,null,null,"Coincident"]
[null,null,"WINTER/SUMMER PEAKING",null,"Non-coincident"]
[null,null,null,null,"Coincident"]
[null,null,"ADJUSTMENTS - EMBEDDED GENERATION","MW","Non-coincident"]
[null,null,null,null,"Coincident"]
[null,null,"WEATHER CORRECTED MD 10% POE","MW","Non-coincident"]
[null,null,null,null,"Coincident"]
[null,null,"WEATHER CORRECTED MD 10% POE","MVA","Non-coincident"]
[null,null,null,null,"Coincident"]
[null,null,"WEATHER CORRECTED MD 50% POE","MW","Non-coincident"]
[null,null,null,null,"Coincident"]
[null,null,"WEATHER CORRECTED MD 50% POE","MVA","Non-coincident"]
[null,null,null,null,"Coincident"]
[null,"NSP to enter name","CONNECTION POINT RATING","MVA","Non-coincident"]
[null,null,null,null,"Coincident"]
[null,null,"WINTER/SUMMER PEAKING",null,"Non-coincident"]
[null,null,null,null,"Coincident"]
[null,null,"ADJUSTMENTS - EMBEDDED GENERATION","MW","Non-coincident"]
[null,null,null,null,"Coincident"]
[null,null,"WEATHER CORRECTED MD 10% POE","MW","Non-coincident"]
[null,null,null,null,"Coincident"]
[null,null,"WEATHER CORRECTED MD 10% POE","MVA","Non-coincident"]
[null,null,null,null,"Coincident"]
[null,null,"WEATHER CORRECTED MD 50% POE","MW","Non-coincident"]
[null,null,null,null,"Coincident"]
[null,null,"WEATHER CORRECTED MD 50% POE","MVA","Non-coincident"]
[null,null,null,null,"Coincident"]
[null,"NSP to enter name","CONNECTION POINT RATING","MVA","Non-coincident"]
[null,null,null,null,"Coincident"]
[null,null,"WINTER/SUMMER PEAKING",null,"Non-coincident"]
[null,null,null,null,"Coincident"]
[null,null,"ADJUSTMENTS - EMBEDDED GENERATION","MW","Non-coincident"]
[null,null,null,null,"Coincident"]
[null,null,"WEATHER CORRECTED MD 10% POE","MW","Non-coincident"]
[null,null,null,null,"Coincident"]
[null,null,"WEATHER CORRECTED MD 10% POE","MVA","Non-coincident"]
[null,null,null,null,"Coincident"]
[null,null,"WEATHER CORRECTED MD 50% POE","MW","Non-coincident"]
[null,null,null,null,"Coincident"]
[null,null,"WEATHER CORRECTED MD 50% POE","MVA","Non-coincident"]
[null,null,null,null,"Coincident"]
[null,"NSP to enter name","CONNECTION POINT RATING","MVA","Non-coincident"]
[null,null,null,null,"Coincident"]
[null,null,"WINTER/SUMMER PEAKING",null,"Non-coincident"]
[null,null,null,null,"Coincident"]
[null,null,"ADJUSTMENTS - EMBEDDED GENERATION","MW","Non-coincident"]
[null,null,null,null,"Coincident"]
[null,null,"WEATHER CORRECTED MD 10% POE","MW","Non-coincident"]
[null,null,null,null,"Coincident"]
[null,null,"WEATHER CORRECTED MD 10% POE","MVA","Non-coincident"]
[null,null,null,null,"Coincident"]
[null,null,"WEATHER CORRECTED MD 50% POE","MW","Non-coincident"]
[null,null,null,null,"Coincident"]
[null,null,"WEATHER CORRECTED MD 50% POE","MVA","Non-coincident"]
[null,null,null,null,"Coincident"]
[null,"NSP to enter name","CONNECTION POINT RATING","MVA","Non-coincident"]
[null,null,null,null,"Coincident"]
[null,null,"WINTER/SUMMER PEAKING",null,"Non-coincident"]
[null,null,null,null,"Coincident"]
[null,null,"ADJUSTMENTS - EMBEDDED GENERATION","MW","Non-coincident"]
[null,null,null,null,"Coincident"]
[null,null,"WEATHER CORRECTED MD 10% POE","MW","Non-coincident"]
[null,null,null,null,"Coincident"]
[null,null,"WEATHER CORRECTED MD 10% POE","MVA","Non-coincident"]
[null,null,null,null,"Coincident"]
[null,null,"WEATHER CORRECTED MD 50% POE","MW","Non-coincident"]
[null,null,null,null,"Coincident"]
[null,null,"WEATHER CORRECTED MD 50% POE","MVA","Non-coincident"]
[null,null,null,null,"Coincident"]
[null,"NSP to enter name","CONNECTION POINT RATING","MVA","Non-coincident"]
[null,null,null,null,"Coincident"]
[null,null,"WINTER/SUMMER PEAKING",null,"Non-coincident"]
[null,null,null,null,"Coincident"]
[null,null,"ADJUSTMENTS - EMBEDDED GENERATION","MW","Non-coincident"]
[null,null,null,null,"Coincident"]
[null,null,"WEATHER CORRECTED MD 10% POE","MW","Non-coincident"]
[null,null,null,null,"Coincident"]
[null,null,"WEATHER CORRECTED MD 10% POE","MVA","Non-coincident"]
[null,null,null,null,"Coincident"]
[null,null,"WEATHER CORRECTED MD 50% POE","MW","Non-coincident"]
[null,null,null,null,"Coincident"]
[null,null,"WEATHER CORRECTED MD 50% POE","MVA","Non-coincident"]
[null,null,null,null,"Coincident"]
[null,"NSP to enter name","CONNECTION POINT RATING","MVA","Non-coincident"]
[null,null,null,null,"Coincident"]
[null,null,"WINTER/SUMMER PEAKING",null,"Non-coincident"]
[null,null,null,null,"Coincident"]
[null,null,"ADJUSTMENTS - EMBEDDED GENERATION","MW","Non-coincident"]
[null,null,null,null,"Coincident"]
[null,null,"WEATHER CORRECTED MD 10% POE","MW","Non-coincident"]
[null,null,null,null,"Coincident"]
[null,null,"WEATHER CORRECTED MD 10% POE","MVA","Non-coincident"]
[null,null,null,null,"Coincident"]
[null,null,"WEATHER CORRECTED MD 50% POE","MW","Non-coincident"]
[null,null,null,null,"Coincident"]
[null,null,"WEATHER CORRECTED MD 50% POE","MVA","Non-coincident"]
[null,null,null,null,"Coincident"]
[null,"NSP to enter name","CONNECTION POINT RATING","MVA","Non-coincident"]
[null,null,null,null,"Coincident"]
[null,null,"WINTER/SUMMER PEAKING",null,"Non-coincident"]
[null,null,null,null,"Coincident"]
[null,null,"ADJUSTMENTS - EMBEDDED GENERATION","MW","Non-coincident"]
[null,null,null,null,"Coincident"]
[null,null,"WEATHER CORRECTED MD 10% POE","MW","Non-coincident"]
[null,null,null,null,"Coincident"]
[null,null,"WEATHER CORRECTED MD 10% POE","MVA","Non-coincident"]
[null,null,null,null,"Coincident"]
[null,null,"WEATHER CORRECTED MD 50% POE","MW","Non-coincident"]
[null,null,null,null,"Coincident"]
[null,null,"WEATHER CORRECTED MD 50% POE","MVA","Non-coincident"]
[null,null,null,null,"Coincident"]
[null,"NSP to enter name","CONNECTION POINT RATING","MVA","Non-coincident"]
[null,null,null,null,"Coincident"]
[null,null,"WINTER/SUMMER PEAKING",null,"Non-coincident"]
[null,null,null,null,"Coincident"]
[null,null,"ADJUSTMENTS - EMBEDDED GENERATION","MW","Non-coincident"]
[null,null,null,null,"Coincident"]
[null,null,"WEATHER CORRECTED MD 10% POE","MW","Non-coincident"]
[null,null,null,null,"Coincident"]
[null,null,"WEATHER CORRECTED MD 10% POE","MVA","Non-coincident"]
[null,null,null,null,"Coincident"]
[null,null,"WEATHER CORRECTED MD 50% POE","MW","Non-coincident"]
[null,null,null,null,"Coincident"]
[null,null,"WEATHER CORRECTED MD 50% POE","MVA","Non-coincident"]
[null,null,null,null,"Coincident"]
[null,"NSP to enter name","CONNECTION POINT RATING","MVA","Non-coincident"]
[null,null,null,null,"Coincident"]
[null,null,"WINTER/SUMMER PEAKING",null,"Non-coincident"]
[null,null,null,null,"Coincident"]
[null,null,"ADJUSTMENTS - EMBEDDED GENERATION","MW","Non-coincident"]
[null,null,null,null,"Coincident"]
[null,null,"WEATHER CORRECTED MD 10% POE","MW","Non-coincident"]
[null,null,null,null,"Coincident"]
[null,null,"WEATHER CORRECTED MD 10% POE","MVA","Non-coincident"]
[null,null,null,null,"Coincident"]
[null,null,"WEATHER CORRECTED MD 50% POE","MW","Non-coincident"]
[null,null,null,null,"Coincident"]
[null,null,"WEATHER CORRECTED MD 50% POE","MVA","Non-coincident"]
[null,null,null,null,"Coincident"]
[null,"NSP to enter name","CONNECTION POINT RATING","MVA","Non-coincident"]
[null,null,null,null,"Coincident"]
[null,null,"WINTER/SUMMER PEAKING",null,"Non-coincident"]
[null,null,null,null,"Coincident"]
[null,null,"ADJUSTMENTS - EMBEDDED GENERATION","MW","Non-coincident"]
[null,null,null,null,"Coincident"]
[null,null,"WEATHER CORRECTED MD 10% POE","MW","Non-coincident"]
[null,null,null,null,"Coincident"]
[null,null,"WEATHER CORRECTED MD 10% POE","MVA","Non-coincident"]
[null,null,null,null,"Coincident"]
[null,null,"WEATHER CORRECTED MD 50% POE","MW","Non-coincident"]
[null,null,null,null,"Coincident"]
[null,null,"WEATHER CORRECTED MD 50% POE","MVA","Non-coincident"]
[null,null,null,null,"Coincident"]
[null,"NSP to enter name","CONNECTION POINT RATING","MVA","Non-coincident"]
[null,null,null,null,"Coincident"]
[null,null,"WINTER/SUMMER PEAKING",null,"Non-coincident"]
[null,null,null,null,"Coincident"]
[null,null,"ADJUSTMENTS - EMBEDDED GENERATION","MW","Non-coincident"]
[null,null,null,null,"Coincident"]
[null,null,"WEATHER CORRECTED MD 10% POE","MW","Non-coincident"]
[null,null,null,null,"Coincident"]
[null,null,"WEATHER CORRECTED MD 10% POE","MVA","Non-coincident"]
[null,null,null,null,"Coincident"]
[null,null,"WEATHER CORRECTED MD 50% POE","MW","Non-coincident"]
[null,null,null,null,"Coincident"]
[null,null,"WEATHER CORRECTED MD 50% POE","MVA","Non-coincident"]
[null,null,null,null,"Coincident"]
[null,"NSP to enter name","CONNECTION POINT RATING","MVA","Non-coincident"]
[null,null,null,null,"Coincident"]
[null,null,"WINTER/SUMMER PEAKING",null,"Non-coincident"]
[null,null,null,null,"Coincident"]
[null,null,"ADJUSTMENTS - EMBEDDED GENERATION","MW","Non-coincident"]
[null,null,null,null,"Coincident"]
[null,null,"WEATHER CORRECTED MD 10% POE","MW","Non-coincident"]
[null,null,null,null,"Coincident"]
[null,null,"WEATHER CORRECTED MD 10% POE","MVA","Non-coincident"]
[null,null,null,null,"Coincident"]
[null,null,"WEATHER CORRECTED MD 50% POE","MW","Non-coincident"]
[null,null,null,null,"Coincident"]
[null,null,"WEATHER CORRECTED MD 50% POE","MVA","Non-coincident"]
[null,null,null,null,"Coincident"]
[null,"NSP to enter name","CONNECTION POINT RATING","MVA","Non-coincident"]
[null,null,null,null,"Coincident"]
[null,null,"WINTER/SUMMER PEAKING",null,"Non-coincident"]
[null,null,null,null,"Coincident"]
[null,null,"ADJUSTMENTS - EMBEDDED GENERATION","MW","Non-coincident"]
[null,null,null,null,"Coincident"]
[null,null,"WEATHER CORRECTED MD 10% POE","MW","Non-coincident"]
[null,null,null,null,"Coincident"]
[null,null,"WEATHER CORRECTED MD 10% POE","MVA","Non-coincident"]
[null,null,null,null,"Coincident"]
[null,null,"WEATHER CORRECTED MD 50% POE","MW","Non-coincident"]
[null,null,null,null,"Coincident"]
[null,null,"WEATHER CORRECTED MD 50% POE","MVA","Non-coincident"]
[null,null,null,null,"Coincident"]
[null,"NSP to enter name","CONNECTION POINT RATING","MVA","Non-coincident"]
[null,null,null,null,"Coincident"]
[null,null,"WINTER/SUMMER PEAKING",null,"Non-coincident"]
[null,null,null,null,"Coincident"]
[null,null,"ADJUSTMENTS - EMBEDDED GENERATION","MW","Non-coincident"]
[null,null,null,null,"Coincident"]
[null,null,"WEATHER CORRECTED MD 10% POE","MW","Non-coincident"]
[null,null,null,null,"Coincident"]
[null,null,"WEATHER CORRECTED MD 10% POE","MVA","Non-coincident"]
[null,null,null,null,"Coincident"]
[null,null,"WEATHER CORRECTED MD 50% POE","MW","Non-coincident"]
[null,null,null,null,"Coincident"]
[null,null,"WEATHER CORRECTED MD 50% POE","MVA","Non-coincident"]
[null,null,null,null,"Coincident"]
[null,"NSP to enter name","CONNECTION POINT RATING","MVA","Non-coincident"]
[null,null,null,null,"Coincident"]
[null,null,"WINTER/SUMMER PEAKING",null,"Non-coincident"]
[null,null,null,null,"Coincident"]
[null,null,"ADJUSTMENTS - EMBEDDED GENERATION","MW","Non-coincident"]
[null,null,null,null,"Coincident"]
[null,null,"WEATHER CORRECTED MD 10% POE","MW","Non-coincident"]
[null,null,null,null,"Coincident"]
[null,null,"WEATHER CORRECTED MD 10% POE","MVA","Non-coincident"]
[null,null,null,null,"Coincident"]
[null,null,"WEATHER CORRECTED MD 50% POE","MW","Non-coincident"]
[null,null,null,null,"Coincident"]
[null,null,"WEATHER CORRECTED MD 50% POE","MVA","Non-coincident"]
[null,null,null,null,"Coincident"]
[null,"NSP to enter name","CONNECTION POINT RATING","MVA","Non-coincident"]
[null,null,null,null,"Coincident"]
[null,null,"WINTER/SUMMER PEAKING",null,"Non-coincident"]
[null,null,null,null,"Coincident"]
[null,null,"ADJUSTMENTS - EMBEDDED GENERATION","MW","Non-coincident"]
[null,null,null,null,"Coincident"]
[null,null,"WEATHER CORRECTED MD 10% POE","MW","Non-coincident"]
[null,null,null,null,"Coincident"]
[null,null,"WEATHER CORRECTED MD 10% POE","MVA","Non-coincident"]
[null,null,null,null,"Coincident"]
[null,null,"WEATHER CORRECTED MD 50% POE","MW","Non-coincident"]
[null,null,null,null,"Coincident"]
[null,null,"WEATHER CORRECTED MD 50% POE","MVA","Non-coincident"]
[null,null,null,null,"Coincident"]

{"sheet":"7.1  Policies and Procedures","index":20,"n_rows":224,"n_cols":5,"rows_kept":224,"cut":false,"hidden":false,"merged":[[6,1,6,3],[11,1,11,4],[15,1,15,4],[33,1,33,4],[37,1,37,4],[38,1,38,4],[41,1,41,4],[46,1,46,4],[70,1,70,4],[206,1,206,4],[211,1,211,4],[222,1,222,4],[75,1,75,4],[155,1,155,4],[160,1,160,4],[197,1,197,4],[201,1,201,4]]}
[null,{"$f":"(LOOKUP(dms_Model,dms_Model_List,dms_Worksheet_List))","v":"REGULATORY REPORTING STATEMENT"}]
[null,{"$f":"INDEX(dms_TradingNameFull_List,MATCH(dms_TradingName,dms_TradingName_List))","v":"TasNetworks (T)"}]
[null,{"$f":"CONCATENATE(\"REGULATORY PERIOD FROM \", FRCP_y1,\" TO \",dms_MultiYear_FinalYear_Result)","v":"REGULATORY PERIOD FROM 2024-25 TO 2028-29"}]
[null,"7.1  PLANS, POLICIES, PROCEDURES AND STRATEGIES"]
[]
[null,"Instructions"]
[null,{"$f":"CONCATENATE(dms_TradingName, \" must list and provide a brief description of key internal plans, \"&\"policies, procedures or strategies that are used by it to plan and conduct its day to day operations and that have been relied upon in the development of its regulatory proposal. \"&dms_TradingName,\" must identify any internal plans, policies, procedures and strategies that have changed in the current regulatory control period \"&\"or that are expected to change before the next regulatory control period where the change has been identified as a step change.\")","v":"TasNetworks (T) must list and provide a brief description of key internal plans, policies, procedures or strategies that are used by it to plan and conduct its day to day operations and that have been relied upon in the development of its regulatory proposal. TasNetworks (T) must identify any internal plans, policies, procedures and strategies that have changed in the current regulatory control period or that are expected to change before the next regulatory control period where the change has been identified as a step change."}]
[]
[null,"7.1.1 - PLANS, POLICIES, PROCEDURES AND STRATEGIES"]
[null,null,"Brief description","Relevance to regulatory proposal","Expenditure impact"]
[null,null,"Description of the plan, policy, procedure or strategy.","Identify the element of the proposal/supporting documents that the policy, plan, procedure or strategy is relevant to e.g. replacement capex, capacity utilisation thresholds, opex ","Is this policy, plan or procedure identified in the response to section 4 'Step Changes' of the notice (yes or no)?"]
[null,"Corporate"]
[null,"TasNetworks towards 2030","Represents TasNetworks' view of internal and external business environments, corporate objectives and strategic directions up to 2023","Strategic overview of the future network conditions that set the tone and priorities of almost all aspects of our Regulatory Proposal","No"]
[null,"Environment and sustainability policy","Provides TasNetworks' policy commitments for the environment, including the operation, construction and maintenance of our assets in a way which recognises and mitigates the risks to people and the environment.","Capex and Opex","No"]
[]
[null,"Governance framework"]
[null,"Gated investment framework","The Gated Investment Framework is TasNetworks’ governing document for the assessment and management of business investments. The Framework ensures that TasNetworks’ investment expenditure program is managed to ensure the most effective and efficient use of capital and operating expenditure ","Capex and Opex","No"]
[null,"Procurement Policy","Ensures TasNetworks' procurment process reflects best practice and encourages competition, innovation and transparency in our procurement activities.","Capex and Opex","No"]
[null,"Information management policy","This policy details TasNetworks’ commitment to the management of business information as a valued asset in line with our legislative, regulatory and contractual obligations and business requirements.  ","This document is relevant to all elements of TasNetworks' combined proposal.","No"]
[null,"Privacy policy","The fundamental objective of the Privacy Policy is to ensure that TasNetworks complies with its obligations under The Privacy Act 1988 (Cth) and the Personal Information Protection Act 2004 (TAS).","This document is relevant to all elements of TasNetworks' combined proposal.","No"]
[null,"Risk management policy","This policy outlines how TasNetworks will manage the opportunities and challenges arising from owning and operating the network as well as responding to changes in the external environment as the economy, electricity industry and stakeholder expectations change.","This document is relevant to all elements of TasNetworks' combined proposal.","No"]
[]
[]
[]
[]
[]
[]
[]
[]
[]
[]
[]
[]
[null,"Accounting policies, procedures and methodologies (including a capitalisation policy, depreciation policy and an approved expenditure allocation methodology)"]
[null,"Capitalisation policy","The purpose of this policy is to ensure that capital expenditure is accounted for in a logical and cost-effective manner which is compliant with relevant Australian Accounting Standards.","Capex","No"]
[null,"Cost Allocation Method","This AER approved document describes the principles and policies for allocating costs within the categories of distribution services that TasNetworks provides.","Capex and Opex","No"]
[]
[null,"Asset management plan or equivalent documentation"]
[null,"Asset Management Policies"]
[null,"Asset Management Policy","This policy aims to outline TasNetworks’ position and communicate TasNetworks’ commitments with regard to asset management.","Capex and Opex","No"]
[]
[null,"Asset Management Strategies"]
[null,"End to end works management process","This document outlines the steps, roles and responsibilities of the process to ensure works are delivered in an efficient and effective manner.","Capex and Opex","No"]
[null,"End to end consultation requirements procedure","This procedure sets out TasNetworks’ requirements for consultation in relation to activities within the business. It describes how to identify key internal stakeholders and subject matter experts and when they should be consulted in relation to a range of activities.","Capex and Opex","No"]
[null,"Strategic Asset Management Plan","Defines TasNetworks' asset strategy for the specific asset class","Capex and Opex","No"]
[]
[null,"Asset Management Plans"]
[null,"Asset Management Information System (AMIS) Asset Management Plan","Defines TasNetworks' asset strategy for the specific asset class","Capex and Opex","No"]
[null,"Asset Management Policy ","Defines TasNetworks' asset strategy for the specific asset class","Capex and Opex","No"]
[null,"Conductors and Hardware Asset Management Plan","Defines TasNetworks' asset strategy for the specific asset class","Capex and Opex","No"]
[null,"Connection Assets Asset Management Plan","Defines TasNetworks' asset strategy for the specific asset class","Capex and Opex","No"]
[null,"EHV Disconnector and Earth Switch Asset Management Plan","Defines TasNetworks' asset strategy for the specific asset class","Capex and Opex","No"]
[null,"Facilities Asset Management Plan ","Defines TasNetworks' asset strategy for the specific asset class","Capex and Opex","No"]
[null,"High Voltage Switchgear Asset Management Plan","Defines TasNetworks' asset strategy for the specific asset class","Capex and Opex","No"]
[null,"IT Infrastructure Asset Management Plan","Defines TasNetworks' asset strategy for the specific asset class","Capex and Opex","No"]
[null,"IT Software Asset Management Plan ","Defines TasNetworks' asset strategy for the specific asset class","Capex and Opex","No"]
[null,"Power Transformer Asset Management Plan","Defines TasNetworks' asset strategy for the specific asset class","Capex and Opex","No"]
[null,"SCADA Systems Asset Management Plan Transmission","Defines TasNetworks' asset strategy for the specific asset class","Capex and Opex","No"]
[null,"Telecommunications Network Management Systems (TNMS) Asset Management Plan","Defines TasNetworks' asset strategy for the specific asset class","Capex and Opex","No"]
[null,"Transmission Line Insulator Assemblies Asset Management Plan","Defines TasNetworks' asset strategy for the specific asset class","Capex and Opex","No"]
[null,"Transmission Line Protection and Control Asset Management Plan","Defines TasNetworks' asset strategy for the specific asset class","Capex and Opex","No"]
[null,"Transmission Line Support Structure Asset Management Plan","Defines TasNetworks' asset strategy for the specific asset class","Capex and Opex","No"]
[null,"Transmission Line Support Structure Foundations Asset Management Plan","Defines TasNetworks' asset strategy for the specific asset class","Capex and Opex","No"]
[]
[]
[]
[]
[]
[]
[]
[null,"Capital expenditure policies and procedures (including capex approval policies and procedures and replacement policy) "]
[null,"Gated investment framework","The Gated Investment Framework is TasNetworks’ governing document for the assessment and management of business investments. The Framework ensures that TasNetworks’ investment expenditure program is managed to ensure the most effective and efficient use of capital and operating expenditure ","Capex and Opex","No"]
[]
[]
[]
[null,"Internal standards for network planning, design, maintenance and operation"]
[null,"Management System Procedure - Design","This procedure details the method by which TasNetworks manages the design process for Design and Construction contracts","Capex and Opex","No"]
[null,"Traffic Management Procedure","This procedure details the method by which TasNetworks manages traffic management","Capex and Opex","No"]
[null,"Hazardous Substances Management","This procedure details how to manage hazardous substances by providing guidance on the procurement, use, storage, transport and disposal procedures for hazardous chemicals, dangerous goods and associated wastes","Capex and Opex","No"]
[null,"Environmental Considerations: Distribution - Design, Construction and Decommissioning","This procedure describes how the environmental and heritage impacts and risks associated with design, construction and decommissioning of distribution lines, wayleaves, and access tracks are considered in the design and planning stage and controls put in place for these activities. ","Capex and Opex","No"]
[null,"Confined Spaces Procedure","This procedure defines a systematic approach to dealing with the hazards and risks associated with TasNetworks confined spaces. ","Capex and Opex","No"]
[null,"Work practice suite - Support structures","The suite of work practices provide for the design, maintenance and safe operation of support structure assets","Capex and Opex","No"]
[null,"Work practice suite - Overhead conductors","The suite of work practices provide for the design, maintenance and safe operation of overhead conductor assets","Capex and Opex","No"]
[null,"Work practice suite - Substations","The suite of work practices provide for the design, maintenance and safe operation of substation assets","Capex and Opex","No"]
[]
[]
[]
[]
[]
[]
[]
[]
[]
[]
[]
[]
[]
[]
[]
[]
[]
[]
[]
[]
[]
[]
[]
[]
[]
[]
[]
[]
[]
[]
[]
[]
[]
[]
[]
[]
[]
[]
[]
[]
[]
[]
[]
[]
[]
[]
[]
[]
[]
[]
[]
[]
[]
[]
[]
[]
[]
[]
[]
[]
[]
[]
[]
[]
[]
[]
[]
[]
[]
[]
[]
[null,"Procurement and contracting out policies"]
[null,"Procurement Policy","Ensures TasNetworks' procurment process reflects best practice and encourages competition, innovation and transparency in our procurement activities.","Capex and Opex","No"]
[null,"Contract Management Guideline","This guideline covers the end-to-end Contract Management process and aims to act as a guide to support Contract Owners to carry out their responsibilities.  It is ‘principles’ based, acknowledging that different contract types will require varying degrees and types of management.","This document is relevant to all elements of TasNetworks' combined proposal.","No"]
[]
[]
[null,"Information technology policies or strategies"]
[null,"Cyber Security Policy","This Policy describes the security requirements needed to protect TasNetworks’ critical assets – people, property and information – from human and technology threats and vulnerabilities.","Capex and Opex","No"]
[null,"Tools of trade technology policy","This Tool of Trade Technology Standard governs the life cycle of our Tool of Trade technology, from procurement to disposal and replacement and defines the requirements that Team Members and Leaders must adhere to when utilising these services.  ","Capex and Opex","No"]
[null,"Secure Software Development Standard","The purpose of this document is to define the minimum requirements for secure software development activities either in house or in engaging a vendor to perform the development work.","Opex","No"]
[null,"Information Security Classification Standard","The purpose of this standard is to define the requirements for assigning security classification, labelling and the handling of all business information in order to safeguard the confidentiality, integrity, sensitivity and availability of information stored, accessed and transmitted.","Opex","No"]
[]
[]
[]
[]
[]
[]
[]
[]
[]
[]
[]
[]
[]
[]
[]
[]
[]
[]
[]
[]
[]
[]
[]
[]
[]
[]
[]
[]
[]
[]
[]
[]
[null,"Demand management policies or strategies"]
[null,"Network demand management plan","This document sets out a framework to avoid (or defer) necessary network augmentation required to manage emerging issues on the network, which is typically a network capacity constraint issue","Capex and Opex","No"]
[null,"Annual planning report","The Annual Planning Report presents TasNetworks’ network development and asset replacement plans to ensure the future adequacy of the electricity network in Tasmania \n","Capex and Opex","No"]
[]
[null,"Self insurance guidelines or policy"]
[]
[]
[]
[]
[null,"Land and easement acquisition polices"]
[null,"Strategic Easement and Land Acquisition Expenditure Estimation Methodology \n","This document supports the Investment Evaluation Summary for the Strategic Easement and Land Acquisition\n","Capex","No"]
[]
[]
[]
[null,"Asset security plans and policies"]
[null,"System Spares Policy \n","This policy exists to define the minimum holding requirement for spare assets and spare parts which are specifically held to replace or repair in-service assets that may either fail or suffer damage, under the responsibility of  Networks","capex","No"]
[]
[]
[]
[]
[]
[]
[]
[]
[]
[null,"Disaster recovery policy"]
[null,"Emergency risk management framework","This framework provides TasNetworks with a whole-of-business prevention, preparedness, response, and recovery treatment of all incidents using a risk management approach.  ","This document is relevant to all elements of TasNetworks' combined proposal.","No"]

{"sheet":"7.2 Contingent projects","index":21,"n_rows":31,"n_cols":6,"rows_kept":31,"cut":false,"hidden":false,"merged":[[7,1,7,3]]}
[null,{"$f":"(LOOKUP(dms_Model,dms_Model_List,dms_Worksheet_List))","v":"REGULATORY REPORTING STATEMENT"}]
[null,{"$f":"INDEX(dms_TradingNameFull_List,MATCH(dms_TradingName,dms_TradingName_List))","v":"TasNetworks (T)"}]
[null,{"$f":"CONCATENATE(\"REGULATORY PERIOD FROM \", FRCP_y1,\" TO \",dms_MultiYear_FinalYear_Result)","v":"REGULATORY PERIOD FROM 2024-25 TO 2028-29"}]
[null,"7.2 CONTINGENT PROJECTS"]
[]
[]
[null,"Instructions"]
[null,{"$f":"CONCATENATE(dms_TradingName,\" is required to populate all input cells (yellow) in table 7.2.1 presented below.\"\n\n\n\n)","v":"TasNetworks (T) is required to populate all input cells (yellow) in table 7.2.1 presented below."}]
[]
[null,"7.2.1 - PROPOSED CONTINGENT PROJECTS FOR THE FORTHCOMING REGULATORY CONTROL PERIOD"]
[null,"Proposed contingent project name","Proposed contingent capital expenditure \n($0's, nominal)","Proposed trigger events",{"$f":"CONCATENATE(\"Proposed MAR for \", FRCP_y1,\" \n($0's, nominal)\")","v":"Proposed MAR for 2024-25 \n($0's, nominal)"},{"$f":"CONCATENATE(\"5 per cent of the \", FRCP_y1,\" ($0's, nominal) MAR\")","v":"5 per cent of the 2024-25 ($0's, nominal) MAR"}]
[null,"Address network security requirements at George Town Substation",50000000,"1. TasNetworks demonstrates that customer commitment of additional load to connect to the transmission network at or around George Town / Bell Bay results in:\n \nA material increase in the probability of cascading failure, following non-credible contingent events, as defined in Schedule 5.1.8 of the NER; and / or \n(i) Breaches of minimum network performance requirements under regulation 5 of the (ii) Electricity Supply Industry (Network Planning Requirements) Regulations. \n\n2. TasNetworks demonstrates that the solution required to meet the power system security obligations cannot be accommodated within the existing layout of George Town substation. \n\n3. Successful completion of the RIT-T, including a comprehensive assessment of credible options, that demonstrates a network investment is the most efficient option to ensure TasNetworks meets its power system security obligations at George Town under: \n(i) Clause S5.1.8 of the NER; \n(ii) The Electricity Supply Industry (Network Planning Requirements) Regulations; \n \n4. TasNetworks Board commitment to proceed with the project subject to the Australian Energy Regulator amending the revenue determination pursuant to the NER. \n\n",159574886.60992175,{"$f":"+E12*0.05","v":7978744.3304960877}]
[null,"Maintain voltage stability at George Town Substation (to 2026)",75000000,"1. TasNetworks demonstrates customer commitment of additional load to connect to the transmission network at or around George Town / Bell Bay will result in TasNetworks being non-compliant with power system voltage and system stability requirements at George Town with respect to clause S5.1.8 of the NER;\n\n2. Successful completion of the RIT-T, including a comprehensive assessment of credible options, demonstrating a network investment is the most efficient option to meet reactive support requirements at George Town under Clause S5.1.8 of the NER; and \n\n3. TasNetworks Board commitment to proceed with the project subject to the Australian Energy Regulator amending the revenue determination pursuant to the NER. ",{"$f":"+$E$12","v":159574886.60992175},7978744.3304960877]
[null,"Maintain voltage stability at George Town Substation (to 2029)",80000000,"1. TasNetworks demonstrates further customer commitment of additional load to connect to the transmission network at or around George Town / Bell Bay will result in TasNetworks being non-compliant with power system voltage and system stability requirements at George Town with respect to clause S5.1.8 of the NER;\n\n2. Successful completion of the RIT-T, including a comprehensive assessment of credible options, demonstrating a network investment is the most efficient option to meet reactive support requirements at George Town under Clause S5.1.8 of the NER; and \n\n3. TasNetworks Board commitment to proceed with the project subject to the Australian Energy Regulator amending the revenue determination pursuant to the NER. ",159574886.60992175,7978744.3304960877]
[null,"Address thermal constraint on the Palmerston - Sheffield 220 kV corridor ",212000000,"1. One or both of the following: \n(i) Commitment of additional load from one or more customers to connect to the transmission network at or around George Town / Bell Bay; and / or \n(ii) Commitment of new generation to connect in North West Tasmania or Central Highlands that results in higher power flows on the Palmerston – Sheffield – George Town triangle and causes a power flows through the Sheffield–Palmerston transmission corridor to be constrained to maintain network stability. \n\n2. Successful completion of the RIT-T, including a comprehensive assessment of credible options, that demonstrates augmenting power transfer capacity between Sheffield and Palmerston is the preferred option that provides net market benefits and / or addresses a reliability corrective action; and \n\n3. TasNetworks Board commitment to proceed with the project subject to the AER amending the revenue determination pursuant to the NER. \n",159574886.60992175,7978744.3304960877]
[null,"Address transfer capability constraints of the Sheffield–George Town 220 kV corridor ",166000000,"1. One or both of the following: \n(i) Commitment of additional load from one or more customers with aggregated load above 300 MW to connect to the transmission network at or around George Town / Bell Bay; and / or \n(ii) commitment of new generation to connect in North West Tasmania or Central Highlands that results in higher power flows on the Sheffield – George Town - Palmerston triangle and causes power flows between Sheffield and George Town to be constrained to maintain network stability. \n\n2. Successful completion of the RIT-T, including a comprehensive assessment of credible options, that demonstrates upgrading the capacity between Sheffield and George Town is the preferred option that provides positive net market benefits and / or addresses a reliability corrective action; and \n\n3. TasNetworks Board commitment to proceed with the project subject to the AER amending the revenue determination pursuant to the NER. \n",159574886.60992175,7978744.3304960877]
[null,"Address transfer capability constraints of the Palmerston–Hadspen–George Town 220 kV corridor ",209000000,"1. One or both of the following: \n(i) Commitment of additional load from one or more customers with aggregated load above 700 MW to connect to the transmission network at or around George Town / Bell Bay; and / or \n(ii) commitment of new generation to connect in North West Tasmania or the Central Highlands that results in higher power flows on the Palmerston – Sheffield - George Town triangle and causes power flows on the Palmerston to George Town via Hadspen 220kV transmission line to be constrained to maintain flows within thermal limits. \n\n2. Successful completion of the RIT-T, including a comprehensive assessment of credible options, that demonstrates upgrading the capacity of the network between Palmerston and George Town via Hadspen is the preferred option that provides positive net market benefits and / or addresses a reliability corrective action; and \n\n3. TasNetworks Board commitment to proceed with the project subject to the AER amending the revenue determination pursuant to the NER. \n",159574886.60992175,7978744.3304960877]
[null,"Address transfer capability constraints of the Waddamana–Palmerston 220 kV corridor","113,00,000","1. Commitment of new generation in the Central Highlands and / or the southern transmission network that results in power flow through the Waddamana–Palmerston transmission corridor to be constrained to maintain flows within thermal and/or stability limits; \n\n2. successful completion of the RIT-T, including a comprehensive assessment of credible options, that demonstrates upgrading the transfer capability of the Waddamana–Palmerston transmission corridor is the option that maximises positive net market benefits; and \n\n3. TasNetworks board commitment to proceed with the project subject, to the AER amending the revenue determination pursuant to the NER. \n",159574886.60992175,7978744.3304960877]
[null,null,null,null,159574886.60992175,7978744.3304960877]
[null,null,null,null,159574886.60992175,7978744.3304960877]
[null,null,null,null,159574886.60992175,7978744.3304960877]
[null,null,null,null,159574886.60992175,7978744.3304960877]
[null,null,null,null,159574886.60992175,7978744.3304960877]
[null,null,null,null,159574886.60992175,7978744.3304960877]
[null,null,null,null,159574886.60992175,7978744.3304960877]
[null,null,null,null,159574886.60992175,7978744.3304960877]
[null,null,null,null,159574886.60992175,7978744.3304960877]
[null,null,null,null,159574886.60992175,7978744.3304960877]
[null,null,null,null,159574886.60992175,7978744.3304960877]
[null,null,null,null,159574886.60992175,7978744.3304960877]
[null,null,null,null,159574886.60992175,7978744.3304960877]

{"sheet":"7.3 Obligations","index":22,"n_rows":301,"n_cols":5,"rows_kept":301,"cut":false,"hidden":false,"merged":[[3,1,3,4],[5,1,5,2],[8,1,8,2]]}
[null,{"$f":"(LOOKUP(dms_Model,dms_Model_List,dms_Worksheet_List))","v":"REGULATORY REPORTING STATEMENT"}]
[null,{"$f":"INDEX(dms_TradingNameFull_List,MATCH(dms_TradingName,dms_TradingName_List))","v":"TasNetworks (T)"}]
[null,{"$f":"CONCATENATE(\"REGULATORY PERIOD FROM \", FRCP_y1,\" TO \",dms_MultiYear_FinalYear_Result)","v":"REGULATORY PERIOD FROM 2024-25 TO 2028-29"}]
[null,"7.3  OBLIGATIONS, REQUIREMENTS & STANDARDS"]
[]
[null,"There is ONE table on this worksheet. It has been sub-grouped for ease of navigation. See the Instructions sheet on how to group or ungroup data."]
[]
[null,"Instructions"]
[null,{"$f":"CONCATENATE(\"Outline those obligations and requirements that \",dms_TradingName, \" identifies as having a material impact on expenditure requirements.\")","v":"Outline those obligations and requirements that TasNetworks (T) identifies as having a material impact on expenditure requirements."}]
[]
[]
[null,"7.3.1 - OBLIGATIONS OR REQUIREMENTS"]
[null,null,"Brief description","Relevance to regulatory proposal","Expenditure impact"]
[null,null,"Description of relevant obligations or requirements within the instrument (e.g. safety obligations, reliability targets) ","Identify what element of the proposal/supporting documents the obligation or requirement is relevant to e.g. replacement capex, capacity utilisation thresholds, opex ","Is the obligation or requirement identified in the response to section 4 'Step Changes' of the notice (yes or no)?"]
[null,"Legislation"]
[null,"Commonwealth Government","A New Tax System (Goods and Services Tax) Act 1999  (Cth)\nA New Tax System (Goods and Services Tax) Regulations 1999 (Cth)","Capex and Opex","No"]
[null,"Commonwealth Government","Competition and Consumer Act 2010 (Cth)\nCompetition and Consumer Regulations 2010 (Cth)","Opex","No"]
[null,"Commonwealth Government","Corporations Act 2001 (Cth)","Opex","No"]
[null,"Commonwealth Government","Corporations Regulations 2001 (Cth)","Opex","No"]
[null,"Commonwealth Government","Environment Protection and Biodiversity Conservation Act 1999 (Cth)\nEnvironment Protection and Biodiversity Conservation Regulations 2000 (Cth)","Capex and Opex","No"]
[null,"Commonwealth Government","Fair Work Act 2009 (Cth)\nFair Work Regulations 2009  (Cth)\n\n","Opex","No"]
[null,"Commonwealth Government","Fringe Benefits Tax Act 1986 (Cth)\nFringe Benefits Tax Assessment Act 1986 (Cth)\nFringe Benefits Tax Regulations 1992 (Cth)\n\n\n","Opex","No"]
[null,"Commonwealth Government","Fuel Tax Act 2006 (Cth)","Opex","No"]
[null,"Commonwealth Government","National Harmonisation of Work Health and Safety Regulations 2011 (Cth)","Capex and Opex","No"]
[null,"Commonwealth Government","Independent Contractors Act 2006 (Cth)\nIndependent Contractors Regulations 2007 (Cth)","Capex and Opex","No"]
[null,"Commonwealth Government","Income Tax Act 1986 (Cth)","Opex","No"]
[null,"Commonwealth Government","Income Tax Assessment Act 1936 (Cth)\nIncome Tax Assessment Act 1997 (Cth)\nIncome Tax Assessment Regulations 1997 (Cth)\nIncome Tax Regulations 1936 (Cth)","Opex","No"]
[null,"Commonwealth Government","National Greenhouse and Energy Reporting Act 2007 (Cth)\nNational Greenhouse and Energy Reporting Regulations 2008 (Cth)","Opex","No"]
[null,"Commonwealth Government","Native Title Act 1993 (Cth)\nNative Title (Indigenous Land Use Agreements) Regulations 1999 (Cth)","Opex","No"]
[null,"Commonwealth Government","Privacy Act 1988 (Cth)\nPrivacy Regulation 2013 (Cth)\n","Opex","No"]
[null,"Commonwealth Government","Superannuation Guarantee (Administration) Act 1992  (Cth)\nSuperannuation Guarantee (Administration) Regulations 1993  (Cth)","Capex and Opex","No"]
[null,"Commonwealth Government","Superannuation Industry (Supervision) Act 1993 (Cth)\nSuperannuation Industry (Supervision) Regulations 1994  (Cth)","Opex","No"]
[null,"Commonwealth Government","Telecommunications (Interception and Access) Act 1979 (Cth)\nTelecommunications (Interception and Access) Regulations 1987 (Cth)\n","Opex","No"]
[null,"Commonwealth Government","Telecommunications Act 1997 (Cth)\nTelecommunications Regulations 2001 (Cth)","Opex","No"]
[null,"Commonwealth Government","Workplace Relations Acts and Regulations (Cth)","Opex","No"]
[null,"Commonwealth Government","Security of Critical Infrastructure Act 2018","Opex","Yes"]
[null,"South Australian and Victorian Governments ","National Electricity Law\n","Capex and Opex","No"]
[null,"Tasmanian Government","Aboriginal Heritage Act 1975","Capex and Opex","No"]
[null,"Tasmanian Government","Aboriginal Lands Act 1995","Capex and Opex","No"]
[null,"Tasmanian Government","Access to Neighbouring Land Act 1992","Capex and Opex","No"]
[null,"Tasmanian Government","Anti-Discrimination Act 1998","Opex","No"]
[null,"Tasmanian Government","Biosecurity Act 2019","Opex","No"]
[null,"Tasmanian Government","Climate Change (State Action) Act 2008","Capex and Opex","No"]
[null,"Tasmanian Government","COVID-19 Disease Emergency (Miscellaneous Provisions) Act 2020","Opex","No"]
[null,"Tasmanian Government","Economic Regulator Act 2009","Capex and Opex","No"]
[null,"Tasmanian Government","Electricity - National Scheme (Tasmania) Act 1999","Opex","No"]
[null,"Tasmanian Government","Electricity Companies Act 1997","Opex","No"]
[null,"Tasmanian Government","Electricity Industry Safety and Administration Act 1997","Opex","No"]
[null,"Tasmanian Government","Electricity Reform Act 2012","Opex","No"]
[null,"Tasmanian Government","Electricity Supply Industry Act 1995","Opex","No"]
[null,"Tasmanian Government","Electricity Wayleaves and Easements Act 2000","Opex","No"]
[null,"Tasmanian Government","Energy Ombudsman Act 1998","Opex","No"]
[null,"Tasmanian Government","Government Business Enterprises Act 1995","Opex","No"]
[null,"Tasmanian Government","Industrial Relations Act 1984","Opex","No"]
[null,"Tasmanian Government","Long Service Leave (State Employees) Act 1994","Opex","No"]
[null,"Tasmanian Government","Major Infrastructure Development Approvals Act 1999","Capex and Opex","No"]
[null,"Tasmanian Government","National Electricity (Tasmania) Law","Capex and Opex","No"]
[null,"Tasmanian Government","National Energy Retail Law (Tasmania) Act 2012","Opex","No"]
[null,"Tasmanian Government","National Taxation Reform (Commonwealth-State Relations) Act 1999","Opex","No"]
[null,"Tasmanian Government","Occupational Licensing Act 2005","Opex","No"]
[null,"Tasmanian Government","Payroll Tax Act 2008","Opex","No"]
[null,"Tasmanian Government","Payroll Tax Rebate (Apprentices, Trainees and Youth Employees) Act 2017","Opex","No"]
[null,"Tasmanian Government","Personal Information Protection Act 2004","Opex","No"]
[null,"Tasmanian Government","Public Interest Disclosures Act 2002","Opex","No"]
[null,"Tasmanian Government","Registration to Work with Vulnerable People Act 2013","Opex","No"]
[null,"Tasmanian Government","Right to Information Act 2009","Opex","No"]
[null,"Tasmanian Government","Roads and Jetties Act 1935","Capex and Opex","No"]
[null,"Tasmanian Government","State Service Act 2000","Opex","No"]
[null,"Tasmanian Government","Trades Unions Act 1889","Opex","No"]
[null,"Tasmanian Government","Work Health and Safety Act 2012","Opex","No"]
[null,"Tasmanian Government","Workers Rehabilitation and Compensation Act 1988","Opex","No"]
[]
[]
[]
[]
[]
[]
[]
[]
[]
[]
[]
[]
[]
[]
[]
[]
[]
[]
[]
[]
[]
[]
[]
[]
[]
[]
[]
[]
[]
[]
[]
[]
[]
[]
[]
[]
[]
[]
[]
[]
[]
[]
[]
[]
[]
[]
[]
[]
[]
[]
[]
[]
[]
[]
[]
[]
[]
[]
[]
[]
[]
[]
[]
[]
[]
[]
[]
[]
[]
[]
[]
[]
[]
[]
[]
[]
[]
[]
[]
[]
[]
[]
[]
[]
[]
[]
[]
[]
[]
[]
[]
[]
[]
[]
[]
[]
[]
[]
[]
[]
[]
[]
[]
[]
[]
[]
[]
[]
[]
[]
[]
[]
[]
[]
[]
[]
[]
[]
[]
[]
[]
[]
[]
[]
[]
[]
[]
[]
[]
[]
[]
[]
[]
[]
[]
[]
[]
[]
[]
[]
[]
[]
[]
[]
[]
[]
[]
[]
[]
[]
[]
[]
[]
[]
[]
[null,"Licences"]
[null,"ESI act 1995","Electrical distribution license","Capex and Opex","No"]
[null,"ACMA","Carrier licences for telecommunications and radio communications permits us to operate our radio and operational telecommunications","Opex","No"]
[]
[]
[null,"Rules"]
[null,"AEMC","National Electricity Rules","Capex and Opex","No"]
[null,"Standards Australia","AS/NZ 7000:2016 Overhead line design","Capex and Opex","No"]
[]
[]
[null,"Orders"]
[]
[]
[]
[null,"Codes"]
[null,"Building Code of Australia","Building Code of Australia published by the Australian Building Codes Board as in force from time to time","Capex and Opex","No"]
[]
[]
[]
[]
[]
[]
[]
[]
[]
[]
[]
[]
[]
[]
[null,"Guidelines"]
[null,"AER","Approach to reporting requirements and monitoring standards in the electricity market: final report and guideline issued","Opex","No"]
[null,"AER","Better Resets Handbook - Towards consumer-centric network proposals","Capex and Opex","No"]
[null,"AER","Compulsory notice guidelines","Capex and Opex","No"]
[null,"AER","Confidentiality guideline ","Capex and Opex","No"]
[null,"AER","Consumer engagement guideline for network service providers","Capex and Opex","No"]
[null,"AER","Cost allocation guideline (transmission) ","Capex and Opex","No"]
[null,"AER","Expenditure Forecast Assessment Guideline","Capex and Opex","No"]
[null,"AER","Expenditure incentives guideline","Capex","No"]
[null,"AER","Guidelines to make the integrated system plan actionable","Capex","No"]
[null,"AER","Information guideline","Capex and Opex","No"]
[null,"AER","Inter-regional transmission charging arrangements","Opex","No"]
[null,"AER","Pricing methodology guidelines - System strength pricing","Capex and Opex","No"]
[null,"AER","Process guideline for contingent project","Capex and opex","No"]
[null,"AER","Process guideline on how to prepare a transmission network support pass through application","Capex and opex","No"]
[null,"AER","Rate of Return Instrument","Capex and opex","No"]
[null,"AER","Regulatory test and application guidelines","Capex and opex","No"]
[null,"AER","RIT-T and RIT-D application guidelines","Capex","No"]
[null,"AER","Service standards guidelines","Capex and Opex","No"]
[null,"AER","Shared asset guideline","Capex and Opex","No"]
[null,"AER","Statement of principles for the regulation of transmission revenues","Capex and Opex","No"]
[null,"AER","Transmission annual planning report guidelines","Capex and Opex","No"]
[null,"AER","Transmission Efficiency Test and revenue determination guideline: non-contestable network infrastructure projects","Capex and Opex","No"]
[null,"AER","Trial projects guidelines - Regulatory sandboxing","Opex","No"]
[]
[]
[]
[]
[]
[]
[]
[]
[]
[]
[]
[]
[]
[]
[]
[null,"Default agreements "]
[]
[]
[]
[]
[null,"Other"]

{"sheet":"7.4 Shared Assets","index":23,"n_rows":29,"n_cols":11,"rows_kept":29,"cut":false,"hidden":false,"merged":[[7,1,8,1],[7,2,8,2]]}
[null,{"$f":"(LOOKUP(dms_Model,dms_Model_List,dms_Worksheet_List))","v":"REGULATORY REPORTING STATEMENT"}]
[null,{"$f":"INDEX(dms_TradingNameFull_List,MATCH(dms_TradingName,dms_TradingName_List))","v":"TasNetworks (T)"}]
[null,{"$f":"CONCATENATE(\"REGULATORY PERIOD FROM \", FRCP_y1,\" TO \",dms_MultiYear_FinalYear_Result)","v":"REGULATORY PERIOD FROM 2024-25 TO 2028-29"}]
[null,"7.4 SHARED ASSETS"]
[]
[]
[null,"7.4.1 - TOTAL UNREGULATED REVENUE EARNED WITH SHARED ASSETS "]
[null,"Name of shared asset unregulated service","Description of shared assets used to provide the service",{"$f":"CONCATENATE(\"REVENUE  ($0's, real \", dms_DollarReal,\")\")","v":"REVENUE  ($0's, real June 2024)"}]
[null,null,null,{"$f":"dms_y1","v":"2022-23"},{"$f":"dms_y2","v":"2023-24"},{"$f":"dms_y3","v":"2024-25"},{"$f":"dms_y4","v":"2025-26"},{"$f":"dms_y5","v":"2026-27"},{"$f":"dms_y6","v":"2027-28"},{"$f":"dms_y7","v":"2028-29"},{"$f":"CONCATENATE(\"Total \n\",FRCP_y1, \" to \", dms_MultiYear_FinalYear_Result)","v":"Total \n2024-25 to 2028-29"}]
[null,"Tower Access","Provision of unregulated equipment on transmission tower",33646.997909315745,33646.997909315745,33646.997909315745,33646.997909315745,33646.997909315745,33646.997909315745,33646.997909315745,{"$f":"SUM(F10:J10)","v":168234.98954657873}]
[null,"Space Rental","Rental of space for unregulated equipment",331519.2910140148,331519.2910140148,331519.2910140148,331519.2910140148,331519.2910140148,331519.2910140148,331519.2910140148,1657596.4550700739]
[null,null,null,null,null,null,null,null,null,null,0]
[null,null,null,null,null,null,null,null,null,null,0]
[null,null,null,null,null,null,null,null,null,null,0]
[null,null,null,null,null,null,null,null,null,null,0]
[null,null,null,null,null,null,null,null,null,null,0]
[null,null,null,null,null,null,null,null,null,null,0]
[null,null,null,null,null,null,null,null,null,null,0]
[null,null,null,null,null,null,null,null,null,null,0]
[null,null,null,null,null,null,null,null,null,null,0]
[null,null,null,null,null,null,null,null,null,null,0]
[null,null,null,null,null,null,null,null,null,null,0]
[null,null,null,null,null,null,null,null,null,null,0]
[null,null,null,null,null,null,null,null,null,null,0]
[]
[]
[]
[null,"7.4.2 - SHARED ASSET UNREGULATED SERVICES - APPORTIONMENT METHODOLOGY"]
[null,"Name of shared asset unregulated service for which revenues were apportioned","Apportionment methodology"]

{"sheet":"7.9 STPIS","index":24,"n_rows":11,"n_cols":6,"rows_kept":11,"cut":false,"hidden":false,"merged":[]}
[null,{"$f":"(LOOKUP(dms_Model,dms_Model_List,dms_Worksheet_List))","v":"REGULATORY REPORTING STATEMENT"}]
[null,{"$f":"INDEX(dms_TradingNameFull_List,MATCH(dms_TradingName,dms_TradingName_List))","v":"TasNetworks (T)"}]
[null,{"$f":"CONCATENATE(\"REGULATORY PERIOD FROM \", FRCP_y1,\" TO \",dms_MultiYear_FinalYear_Result)","v":"REGULATORY PERIOD FROM 2024-25 TO 2028-29"}]
[null,"7.9 SERVICE TARGET PERFORMANCE INCENTIVE SCHEME (STPIS)"]
[]
[]
[]
[null,"7.9.3 – NETWORK LIMIT INFORMATION"]
[null,"Limit definition","Define limit  ","Reason for the limit ","Is limit addressed by priority project","Supporting information reference"]
[null,"Thermal capacity limitation on the Waddamana-Palmerston 220 kV transmission circuits","1,000 MVA ","Terminal equipment limitation","Yes","TasNetworks-Network Capability Incentive Parameter Action Plan (NCIPAP) -Dec-22"]
[null,"Thermal capacity limitation on the Derby-Scottsdale 110 kV transmission circuit","155 MVA","Dynamic ratings not applied to transmission line","Yes","TasNetworks-Network Capability Incentive Parameter Action Plan (NCIPAP) -Dec-23"]

{"sheet":"8.2 Capex","index":25,"n_rows":61,"n_cols":4,"rows_kept":61,"cut":false,"hidden":false,"merged":[]}
[null,{"$f":"(LOOKUP(dms_Model,dms_Model_List,dms_Worksheet_List))","v":"REGULATORY REPORTING STATEMENT"}]
[null,{"$f":"INDEX(dms_TradingNameFull_List,MATCH(dms_TradingName,dms_TradingName_List))","v":"TasNetworks (T)"}]
[null,{"$f":"CONCATENATE(\"REGULATORY PERIOD FROM \", FRCP_y1,\" TO \",dms_MultiYear_FinalYear_Result)","v":"REGULATORY PERIOD FROM 2024-25 TO 2028-29"}]
[null,"8.2 - CAPEX"]
[]
[null,"8.2.7 - IMMEDIATE EXPENSING OF CAPEX"]
[null,"ESTIMATED - AS COMMISSIONED"]
[null,null,"EXPENDITURE"]
[null,null,"$0's, Nominal",{"$f":"CONCATENATE(\"$0's, real \", dms_DollarReal)","v":"$0's, real June 2024"}]
[null,"Asset class",{"$f":"dms_y1","v":"2022-23"},{"$f":"dms_y2","v":"2023-24"}]
[]
[]
[]
[]
[]
[]
[]
[]
[]
[]
[]
[]
[]
[]
[]
[]
[]
[]
[]
[]
[]
[]
[]
[]
[]
[]
[]
[]
[]
[]
[]
[]
[]
[]
[]
[]
[]
[]
[]
[]
[]
[]
[]
[]
[]
[]
[]
[]
[]
[]
[null,"Total",{"$f":"SUM(C11:C60)","v":0},{"$f":"SUM(D11:D60)","v":0}]

{"sheet":"Formatting Styles","index":26,"n_rows":48,"n_cols":11,"rows_kept":48,"cut":false,"hidden":true,"merged":[]}
[null,"THIS WORKSHEET CONTAINS STYLES AND FORMATTING USED IN RIN TEMPLATES"]
[]
[]
[]
[]
[null,null,null,null,null,null,null,null,null,null,"My named range"]
[]
[]
[]
[]
[]
[]
[]
[]
[]
[]
[]
[]
[]
[]
[]
[]
[]
[]
[]
[]
[]
[null,"STYLES IN USE","dms_H2"]
[null,"TOP HEADER","dms_H1"]
[null,"HEADING ONE","dms_1"]
[null,"HEADING TWO","dms_2"]
[null,"HEADING THREE","dms_3"]
[null,"HEADING FOUR","dms_4"]
[null,"HEADING FIVE","dms_5"]
[null,5.1109999999999998,"dms_NUM"]
[null,5.45E-2,"dms_NUM%"]
[null,5.5555000000000003,"dms_NUM3d"]
[null,"Text description","dms_Row_Locked"]
[null,"Text description - not locked","dms_Row1"]
[null,"Text description","dms_Row2"]
[null,"Total","dms_T1"]
[null,"Total","dms_T2"]
[null,"EXPENSES","dms_BH"]
[null,2019,"dms_BY1"]
[null,2019,"dms_BY2"]
[null,"VOLUMES","dms_GH"]
[null,2019,"dms_GY1"]
[null,2019,"dms_GY2"]

{"sheet":"AER Sheet Heading","index":27,"n_rows":44,"n_cols":9,"rows_kept":44,"cut":false,"hidden":true,"merged":[]}
[null,{"$f":"INDEX(dms_Worksheet_List,MATCH(dms_Model,dms_Model_List))","v":"REGULATORY REPORTING STATEMENT"}]
[null,{"$f":"INDEX(dms_TradingNameFull_List,MATCH(dms_TradingName,dms_TradingName_List))","v":"TasNetworks (T)"}]
[null,{"$f":"CONCATENATE(\"REGULATORY PERIOD FROM \", FRCP_y1,\" TO \",dms_MultiYear_FinalYear_Result)","v":"REGULATORY PERIOD FROM 2024-25 TO 2028-29"}]
[null,"XX"]
[]
[]
[]
[]
[]
[]
[null,null,"EXPENDITURE"]
[null,null,{"$f":"CONCATENATE(\"Forecast ($0's, real \",dms_DollarReal,\")\")","v":"Forecast ($0's, real June 2024)"}]
[null,null,{"$f":"dms_y1","v":"2022-23"},{"$f":"dms_y2","v":"2023-24"},{"$f":"dms_y3","v":"2024-25"},{"$f":"dms_y4","v":"2025-26"},{"$f":"dms_y5","v":"2026-27"},{"$f":"dms_y6","v":"2027-28"},{"$f":"dms_y7","v":"2028-29"}]
[]
[]
[]
[]
[]
[]
[]
[]
[]
[]
[]
[]
[]
[]
[]
[]
[]
[]
[]
[]
[]
[]
[]
[]
[]
[]
[]
[]
[null,null,"VOLUMES"]
[null,null,"0's"]
[null,null,{"$f":"dms_y1","v":"2022-23"},{"$f":"dms_y2","v":"2023-24"},{"$f":"dms_y3","v":"2024-25"},{"$f":"dms_y4","v":"2025-26"},{"$f":"dms_y5","v":"2026-27"},{"$f":"dms_y6","v":"2027-28"},{"$f":"dms_y7","v":"2028-29"}]

{"sheet":"AER CF","index":28,"n_rows":76,"n_cols":25,"rows_kept":76,"cut":false,"hidden":true,"merged":[[41,38,41,59],[41,69,41,90],[3,1,3,22],[39,38,39,59],[39,69,39,90],[40,38,40,59],[40,69,40,90]]}
[null,"AER CONDITIONAL FORMATTING"]
[]
[null,"CELLS FLAGED \"Y\" and greyed out will be greyed out in the worksheets."]
[null,"CONDITIONAL FORMATTING MAP"]
[null,null,null,null,null,"=INDEX(dms_CF_3.6.1, MATCH(dms_TradingName,dms_CF_TradingName))=\"Y\"","=INDEX(dms_CF_3.6.5, MATCH(dms_TradingName,dms_CF_TradingName))=\"Y\"","=INDEX(dms_CF_3.6.6.1, MATCH(dms_TradingName,dms_CF_TradingName))=\"Y\"","=INDEX(dms_CF_3.6.6.2, MATCH(dms_TradingName,dms_CF_TradingName))=\"Y\"","=INDEX(dms_CF_3.6.6.3, MATCH(dms_TradingName,dms_CF_TradingName))=\"Y\"","=INDEX(dms_CF_3.6.7.1, MATCH(dms_TradingName,dms_CF_TradingName))=\"Y\"","=INDEX(dms_CF_3.6.7.2, MATCH(dms_TradingName,dms_CF_TradingName))=\"Y\"","=INDEX(dms_CF_3.6.7.3, MATCH(dms_TradingName,dms_CF_TradingName))=\"Y\"","=INDEX(dms_CF_3.6.7.4, MATCH(dms_TradingName,dms_CF_TradingName))=\"Y\"","=INDEX(dms_CF_3.6.8, MATCH(dms_TradingName,dms_CF_TradingName))=\"Y\"","=INDEX(dms_CF_4.1, MATCH(dms_TradingName,dms_CF_TradingName))=\"Y\"","=INDEX(dms_CF_6.8, MATCH(dms_TradingName,dms_CF_TradingName))=\"Y\"","=INDEX(dms_CF_7.12, MATCH(dms_TradingName,dms_CF_TradingName))=\"Y\"","=INDEX(dms_CF_8.1_A, MATCH(dms_TradingName,dms_CF_TradingName))=\"Y\"","=INDEX(dms_CF_8.1_B, MATCH(dms_TradingName,dms_CF_TradingName))=\"Y\"",{"$f":"INDEX(dms_CF_8.1_Neg, MATCH(dms_TradingName,dms_CF_TradingName))=\"Y\"","v":true},"=INDEX(dms_CF_4.4.1_Neg, MATCH(dms_TradingName,dms_CF_TradingName))=\"Y\"",null,null,"=INDEX(dms_CF_F10, MATCH(dms_TradingName,dms_CF_TradingName))=\"Y\""]
[null,"dms_CF_TradingName","JurisdictionList","Sector","Segment","dms_CF_3.6.1","dms_CF_3.6.5","dms_CF_3.6.6.1","dms_CF_3.6.6.2","dms_CF_3.6.6.3","dms_CF_3.6.7.1","dms_CF_3.6.7.2","dms_CF_3.6.7.3","dms_CF_3.6.7.4","dms_CF_3.6.8","dms_CF_4.1","dms_CF_6.8 (set from dms_MAIFI_flag)","dms_CF_7.12","dms_CF_8.1_A  (and 8.4)","dms_CF_8.1_B  (and 8.4)","dms_CF_8.1_Neg  (and 8.4)","dms_CF_4.4.1","dms_CF_MAIFI_flag (set from dms_MAIFI_flag)","9.5 TUOS (set from Jurisdiction)","dms_CF_F10"]
[null,"Amadeus","NT","Gas","Transmission","-","-","-","-","-","-","-","-","-","-","-","-","-","-","-","-","-","-","-","-"]
[null,"APA GasNet","Vic","Gas","Transmission","-","-","-","-","-","-","-","-","-","-","-","-","-","-","-","-","-","-","-","-"]
[null,"Ausgrid","NSW","Electricity","Distribution",null,"Y","N","N","N","N","N","N","Y","N","N",{"$f":"IFERROR(IF(dms_MAIFI_flag=\"Yes\",\"N\",\"Y\"),\"Y\")","v":"Y"},"Y","N","Y","Y","N",{"$f":"IFERROR(LEFT(dms_MAIFI_flag),\"N\")","v":"N"},{"$f":"IF('AER CF'!$C7=\"Vic\",\"Y\",\"N\")","v":"N"}]
[null,"Ausgrid (Tx Assets)","NSW","Electricity","Distribution",null,"Y","N","N","N","N","N","N","Y","N","N",{"$f":"IFERROR(IF(dms_MAIFI_flag=\"Yes\",\"N\",\"Y\"),\"Y\")","v":"Y"},"Y","N","Y","Y","N",{"$f":"IFERROR(LEFT(dms_MAIFI_flag),\"N\")","v":"N"},{"$f":"IF('AER CF'!$C8=\"Vic\",\"Y\",\"N\")","v":"Y"}]
[null,"AusNet (D)","Vic","Electricity","Distribution",null,"N","N",null,null,"N","N","N","N","N","N",{"$f":"IFERROR(IF(dms_MAIFI_flag=\"Yes\",\"N\",\"Y\"),\"Y\")","v":"Y"},"N","N","N","Y","N",{"$f":"IFERROR(LEFT(dms_MAIFI_flag),\"N\")","v":"N"},{"$f":"IF('AER CF'!$C9=\"Vic\",\"Y\",\"N\")","v":"N"}]
[null,"AusNet (T)","Vic","Electricity","Transmission",null,"N",null,null,null,"N","N","N","N","N","Y",{"$f":"IFERROR(IF(dms_MAIFI_flag=\"Yes\",\"N\",\"Y\"),\"Y\")","v":"Y"},"N","N","N","Y","N",{"$f":"IFERROR(LEFT(dms_MAIFI_flag),\"N\")","v":"N"},{"$f":"IF('AER CF'!$C10=\"Vic\",\"Y\",\"N\")","v":"N"}]
[null,"Australian Distribution Co.","NSW","Electricity","Distribution","N","N","N","N",null,"N","N","N","N","N","N",{"$f":"IFERROR(IF(dms_MAIFI_flag=\"Yes\",\"N\",\"Y\"),\"Y\")","v":"Y"},"N","N","N","N","N",{"$f":"IFERROR(LEFT(dms_MAIFI_flag),\"N\")","v":"N"},{"$f":"IF('AER CF'!$C13=\"Vic\",\"Y\",\"N\")","v":"N"}]
[null,"Australian Distribution Co. (Vic)","Vic","Electricity","Distribution","N","N","N","N",null,"N","N","N","N","N","N",{"$f":"IFERROR(IF(dms_MAIFI_flag=\"Yes\",\"N\",\"Y\"),\"Y\")","v":"Y"},"N","N","N","N","N",{"$f":"IFERROR(LEFT(dms_MAIFI_flag),\"N\")","v":"N"},{"$f":"IF('AER CF'!$C14=\"Vic\",\"Y\",\"N\")","v":"Y"}]
[null,"CitiPower","Vic","Electricity","Distribution",null,"N","N",null,null,"N","N","N","N","N","N",{"$f":"IFERROR(IF(dms_MAIFI_flag=\"Yes\",\"N\",\"Y\"),\"Y\")","v":"Y"},"N","N","N","Y","N",{"$f":"IFERROR(LEFT(dms_MAIFI_flag),\"N\")","v":"N"},{"$f":"IF('AER CF'!$C15=\"Vic\",\"Y\",\"N\")","v":"Y"}]
[null,"Directlink","Qld","Electricity","Transmission",null,"N",null,null,null,"N","N","N","N","N","-",{"$f":"IFERROR(IF(dms_MAIFI_flag=\"Yes\",\"N\",\"Y\"),\"Y\")","v":"Y"},"N","N","Y","Y","N",{"$f":"IFERROR(LEFT(dms_MAIFI_flag),\"N\")","v":"N"},{"$f":"IF('AER CF'!$C16=\"Vic\",\"Y\",\"N\")","v":"N"}]
[null,"ElectraNet","SA","Electricity","Transmission",null,"N",null,null,null,"N","N","N","N","N","-",{"$f":"IFERROR(IF(dms_MAIFI_flag=\"Yes\",\"N\",\"Y\"),\"Y\")","v":"Y"},"N","N","Y","Y","N",{"$f":"IFERROR(LEFT(dms_MAIFI_flag),\"N\")","v":"N"},{"$f":"IF('AER CF'!$C17=\"Vic\",\"Y\",\"N\")","v":"N"}]
[null,"Endeavour Energy","NSW","Electricity","Distribution",null,"Y","N","Y","Y","N","N","N","Y","N","N",{"$f":"IFERROR(IF(dms_MAIFI_flag=\"Yes\",\"N\",\"Y\"),\"Y\")","v":"Y"},"Y","N","Y","Y","Y",{"$f":"IFERROR(LEFT(dms_MAIFI_flag),\"N\")","v":"N"},{"$f":"IF('AER CF'!$C18=\"Vic\",\"Y\",\"N\")","v":"N"}]
[null,"Energex","Qld","Electricity","Distribution",null,"Y","N",null,null,"N","N","N","N","N","N",{"$f":"IFERROR(IF(dms_MAIFI_flag=\"Yes\",\"N\",\"Y\"),\"Y\")","v":"Y"},"Y","N","Y","Y","Y",{"$f":"IFERROR(LEFT(dms_MAIFI_flag),\"N\")","v":"N"},{"$f":"IF('AER CF'!$C19=\"Vic\",\"Y\",\"N\")","v":"N"}]
[null,"Ergon Energy","Qld","Electricity","Distribution",null,"Y","N","Y","Y","N","N","N","N","N","N",{"$f":"IFERROR(IF(dms_MAIFI_flag=\"Yes\",\"N\",\"Y\"),\"Y\")","v":"Y"},"Y","N","Y","Y","N",{"$f":"IFERROR(LEFT(dms_MAIFI_flag),\"N\")","v":"N"},{"$f":"IF('AER CF'!$C20=\"Vic\",\"Y\",\"N\")","v":"N"}]
[null,"Essential Energy","NSW","Electricity","Distribution",null,"Y","N","Y","Y","N","N","N","Y","N","N",{"$f":"IFERROR(IF(dms_MAIFI_flag=\"Yes\",\"N\",\"Y\"),\"Y\")","v":"Y"},"Y","N","Y","Y","N",{"$f":"IFERROR(LEFT(dms_MAIFI_flag),\"N\")","v":"N"},{"$f":"IF('AER CF'!$C21=\"Vic\",\"Y\",\"N\")","v":"N"}]
[null,"Evoenergy Distribution","ACT","Electricity","Distribution",null,"Y","N","Y","Y","Y","Y","N","Y","N","Y",{"$f":"IFERROR(IF(dms_MAIFI_flag=\"Yes\",\"N\",\"Y\"),\"Y\")","v":"Y"},"Y","N","Y","Y","N",{"$f":"IFERROR(LEFT(dms_MAIFI_flag),\"N\")","v":"N"},{"$f":"IF('AER CF'!$C22=\"Vic\",\"Y\",\"N\")","v":"N"}]
[null,"Evoenergy Distribution (Tx Assets)","ACT","Electricity","Distribution",null,"Y","N","Y","Y","Y","Y","N","Y","N","Y",{"$f":"IFERROR(IF(dms_MAIFI_flag=\"Yes\",\"N\",\"Y\"),\"Y\")","v":"Y"},"Y","N","Y","Y","N",{"$f":"IFERROR(LEFT(dms_MAIFI_flag),\"N\")","v":"N"},{"$f":"IF('AER CF'!$C23=\"Vic\",\"Y\",\"N\")","v":"N"}]
[null,"Jemena Electricity","Vic","Electricity","Distribution",null,"N","N",null,null,"N","N","N","N","N","N",{"$f":"IFERROR(IF(dms_MAIFI_flag=\"Yes\",\"N\",\"Y\"),\"Y\")","v":"Y"},"N","N","N","Y","N",{"$f":"IFERROR(LEFT(dms_MAIFI_flag),\"N\")","v":"N"},{"$f":"IF('AER CF'!$C25=\"Vic\",\"Y\",\"N\")","v":"Y"}]
[null,"JGN","Vic","Gas","Distribution","-","-","-","-","-","-","-","-","-","-","-","-","-","-","-","-","-","-","-","-"]
[null,"Murraylink","SA","Electricity","Transmission",null,"N",null,null,null,"N","N","N","N","N","-",{"$f":"IFERROR(IF(dms_MAIFI_flag=\"Yes\",\"N\",\"Y\"),\"Y\")","v":"Y"},"N","N","Y","Y","N",{"$f":"IFERROR(LEFT(dms_MAIFI_flag),\"N\")","v":"N"},{"$f":"IF('AER CF'!$C26=\"Vic\",\"Y\",\"N\")","v":"N"}]
[null,"Power and Water","NT","Electricity","Distribution",null,"N","N",null,null,"N","Y","N","N","N","Y",{"$f":"IFERROR(IF(dms_MAIFI_flag=\"Yes\",\"N\",\"Y\"),\"Y\")","v":"Y"},"Y","Y","Y","Y","N",{"$f":"IFERROR(LEFT(dms_MAIFI_flag),\"N\")","v":"N"},{"$f":"IF('AER CF'!$C27=\"Vic\",\"Y\",\"N\")","v":"N"}]
[null,"Powercor Australia","Vic","Electricity","Distribution",null,"N","N",null,null,"N","N","N","N","N","N",{"$f":"IFERROR(IF(dms_MAIFI_flag=\"Yes\",\"N\",\"Y\"),\"Y\")","v":"Y"},"N","N","N","Y","N",{"$f":"IFERROR(LEFT(dms_MAIFI_flag),\"N\")","v":"N"},{"$f":"IF('AER CF'!$C28=\"Vic\",\"Y\",\"N\")","v":"Y"}]
[null,"Powerlink","Qld","Electricity","Transmission",null,"N",null,null,null,"N","N","N","N","N","-",{"$f":"IFERROR(IF(dms_MAIFI_flag=\"Yes\",\"N\",\"Y\"),\"Y\")","v":"Y"},"N","N","Y","Y","N",{"$f":"IFERROR(LEFT(dms_MAIFI_flag),\"N\")","v":"N"},{"$f":"IF('AER CF'!$C29=\"Vic\",\"Y\",\"N\")","v":"N"}]
[null,"Roma to Brisbane Pipeline","Qld","Gas","Transmission","-","-","-","-","-","-","-","-","-","-","-","-","-","-","-","-","-","-","-","-"]
[null,"SA Power Networks","SA","Electricity","Distribution",null,"Y","N",null,null,"N","N","N","N","N","N",{"$f":"IFERROR(IF(dms_MAIFI_flag=\"Yes\",\"N\",\"Y\"),\"Y\")","v":"Y"},"Y","N","Y","N","N",{"$f":"IFERROR(LEFT(dms_MAIFI_flag),\"N\")","v":"N"},{"$f":"IF('AER CF'!$C31=\"Vic\",\"Y\",\"N\")","v":"N"}]
[null,"TasNetworks (D)","Tas","Electricity","Distribution",null,"Y","N",null,null,"N","N","N","N","N","N",{"$f":"IFERROR(IF(dms_MAIFI_flag=\"Yes\",\"N\",\"Y\"),\"Y\")","v":"Y"},"Y","N","Y","Y","N",{"$f":"IFERROR(LEFT(dms_MAIFI_flag),\"N\")","v":"N"},{"$f":"IF('AER CF'!$C32=\"Vic\",\"Y\",\"N\")","v":"N"}]
[null,"TasNetworks (T)","Tas","Electricity","Transmission",null,"N",null,null,null,"N","N","N","N","N","-",{"$f":"IFERROR(IF(dms_MAIFI_flag=\"Yes\",\"N\",\"Y\"),\"Y\")","v":"Y"},"N","N","Y","Y","N",{"$f":"IFERROR(LEFT(dms_MAIFI_flag),\"N\")","v":"N"},{"$f":"IF('AER CF'!$C33=\"Vic\",\"Y\",\"N\")","v":"N"}]
[null,"TransGrid","NSW","Electricity","Transmission",null,"N",null,null,null,"N","N","N","N","N","-",{"$f":"IFERROR(IF(dms_MAIFI_flag=\"Yes\",\"N\",\"Y\"),\"Y\")","v":"Y"},"N","N","Y","Y","N",{"$f":"IFERROR(LEFT(dms_MAIFI_flag),\"N\")","v":"N"},{"$f":"IF('AER CF'!$C34=\"Vic\",\"Y\",\"N\")","v":"N"}]
[null,"United Energy","Vic","Electricity","Distribution",null,"N","N",null,null,"N","N","N","N","N","N",{"$f":"IFERROR(IF(dms_MAIFI_flag=\"Yes\",\"N\",\"Y\"),\"Y\")","v":"Y"},"N","N","N","Y","N",{"$f":"IFERROR(LEFT(dms_MAIFI_flag),\"N\")","v":"N"},{"$f":"IF('AER CF'!$C35=\"Vic\",\"Y\",\"N\")","v":"Y"}]
[]
[]
[null,"Confidential"]
[null,"Amended"]
[]
[null,"Worksheet 6.2 STPIS reliability"]
[null,"Formula",null,null,null,"Applied to:"]
[]
[null,"=INDEX(dms_CBD_flag,MATCH(dms_TradingName,dms_TradingName_List))=\"NO\"",null,null,null,"$D$11,$D$17,$D$23,$D$33,$D$39,$D$45,$D$55,$D$61,$D$67,$D$77,$D$83,$D$89"]
[null,"=INDEX(dms_Urban_flag,MATCH(dms_TradingName,dms_TradingName_List))=\"NO\"",null,null,null,"$D$12,$D$18,$D$24,$D$56,$D$62,$D$78,$D$68,$D$84"]
[null,"=INDEX(dms_ShortRural_flag,MATCH(dms_TradingName,dms_TradingName_List))=\"NO\"",null,null,null,"$D$13,$D$19,$D$25,$D$57,$D$63,$D$69,$D$79,$D$85"]
[null,"=INDEX(dms_LongRural_flag,MATCH(dms_TradingName,dms_TradingName_List))=\"NO\"",null,null,null,"$D$14,$D$20,$D$26,$D$58,$D$64,$D$65,$D$70,$D$71,$D$80,$D$86"]
[null,"=INDEX(dms_FeederType_5_flag,MATCH(dms_TradingName,dms_TradingName_List))=\"NO\"",null,null,null,"$D$87,$D$81,$D$71,$D$65,$D$59,$D$49,$D$43,$D$37,$D$21,$D$15"]
[null,"=dms_MAIFI_Flag=\"No\"",null,null,null,"$D$55:$D$72"]
[]
[]
[null,"Business & other details"]
[null,"=(INDEX(dms_Model_Span,MATCH(dms_Model,dms_Model_List))>1)"]
[null,"=(INDEX(dms_Model_Span,MATCH(dms_Model,dms_Model_List))=1)"]
[]
[]
[null,"STYLES IN USE"]
[null,"HEADING ONE","dms_1"]
[null,"HEADING TWO","dms_2"]
[null,"HEADING THREE","dms_3"]
[null,"HEADING FOUR","dms_4"]
[null,"HEADING FIVE","dms_5"]
[null,5.1109999999999998,"dms_NUM"]
[null,5.45E-2,"dms_NUM%"]
[null,5.5555000000000003,"dms_NUM3d"]
[null,"Text description","dms_Row_Locked"]
[null,"Text description","dms_Row1"]
[null,"Text description","dms_Row2"]
[null,"Total","dms_T1"]
[null,"Total","dms_T2"]
[null,"EXPENSES","dms_BH"]
[null,2019,"dms_BY1"]
[null,2019,"dms_BY2"]
[null,"VOLUMES","dms_GH"]
[null,2019,"dms_GY1"]
[null,2019,"dms_GY2"]

{"sheet":"AER NRs","index":29,"n_rows":232,"n_cols":16,"rows_kept":232,"cut":false,"hidden":true,"merged":[[195,1,196,1],[199,1,200,1],[208,1,213,1],[135,1,150,1],[152,1,158,1],[160,1,174,1],[176,1,177,1],[179,1,184,1],[191,1,192,1],[65,1,78,1],[84,1,97,1],[100,1,107,1],[110,1,115,1],[118,1,132,1],[4,1,28,1],[32,1,55,1],[33,10,35,10],[33,36,33,57],[33,67,33,88],[34,36,34,57],[34,67,34,88],[35,36,35,57],[35,67,35,88],[36,10,40,10],[44,10,45,10]]}
[null,"AER NAMED RANGES"]
[]
[null,"DROP DOWN SELECTORS USED IN WORKBOOKS"]
[]
[null,"COVER SHEET","dms_DataQuality_List","dms_Confid_status_List"]
[null,null,"-- select --","-- select --"]
[null,null,"Actual","Public"]
[null,null,"Estimate","Confidential"]
[null,null,"Consolidated"]
[]
[]
[null,null,"For all files either AER or business needs to be able to specify the type of submission","For PTRM & RFM templates we must provide a choice in case they change their form of control - otherwise it is drawn from the business specific lookup table above."]
[null,null,"dms_SourceList","dms_FormControl_Choices"]
[null,null,"-- select --","Revenue cap"]
[null,null,"After appeal","Revenue yield"]
[null,null,"Draft decision","Tariff cap"]
[null,null,"Final decision","Weighted average price cap"]
[null,null,"PTRM update 1"]
[null,null,"PTRM update 2"]
[null,null,"PTRM update 3"]
[null,null,"PTRM update 4"]
[null,null,"PTRM update 5"]
[null,null,"PTRM update 6"]
[null,null,"PTRM update 7"]
[null,null,"Reallocated"]
[null,null,"Recast"]
[null,null,"Regulatory proposal"]
[null,null,"Reporting"]
[null,null,"Revised regulatory proposal"]
[]
[]
[null,null,null,null,null,null,null,null,null,null,"This is used to create an image to insert on 6.3 STPIS sheet - not for dropdown lists.",null,null,"GAS"]
[null,"CA & RESET RINS \nDNSP","dms_DNSP_020301_SubstationType","dms_DNSP_020301_ProjectType","dms_DNSP_020301_ProjectTrigger","dms_DNSP_020302_ProjectType","dms_DNSP_020302_ProjectTrigger","dms_STPIS_Exclusion_List","dms_Reason_Interruption","dms_Reason_Interruption_Detailed","Reason for interruption",null,null,"dms_N0205_AssetType"]
[null,null,"Subtransmission substation","New substation establishment","Demand growth","New line on new route - single circuit","Demand growth","Weather","Animal","Animal impact","Animal","Animal impact",null,"Cast Iron"]
[null,null,"Zone substation","Substation upgrade - capacity"," Voltage issues","New line on new route - dual circuit"," Voltage issues","Equipment failure","Asset failure","Animal nesting/burrowing, etc and other",null,"Animal nesting/burrowing, etc and other",null,"PVC"]
[null,null,"Switching station","Substation upgrade - voltage"," Reactive power issue","New line on new route - other"," Reactive power issue","Operational error","Other","Other",null,"Other",null,"Polyamide"]
[null,null,"Other","Other"," Fault level issues","Line rebuild over existing route - single circuit"," Fault level issues","Vegetation","Overloads","LV","Asset failure","LV",null,"High density polyethylene (80)"]
[null,null,null,null," Safety","Line rebuild over existing route - dual circuit"," Net market benefit","Animals","Planned","Distribution substation",null,"Distribution substation",null,"High density polyethylene (100)"]
[null,null,null,null," Environment","Reconductor - Single circuit"," Safety","Third party impacts","Network business","HV",null,"HV",null,"High density polyethylene (250)"]
[null,null,null,null," Other","Reconductor - Dual circuit"," Environment","Transmission failure","Third party","Zone substation",null,"Zone substation",null,"High density polyethylene (575)"]
[null,null,null,null,null,"Reconductor - Other"," Other","Load shedding","Unknown","Subtransmission",null,"Subtransmission",null,"Medium density polyethylene"]
[null,null,null,null,null,"Line upgrade - raising/retensoring",null,"Inter-distributor connection failure","Vegetation","insert description of 'other'","Other","insert description of 'other'",null,"Unprotected steel"]
[null,null,null,null,null,"Line upgrade - voltage upgrade",null,"Other","Weather","Network error","Overloads",null,null,"Protected steel"]
[null,null,null,null,null,"Line upgrade - capacity",null,null,"2 - STPIS Exclusion (3.3)(a)","Switching and protection error","Planned",null,null,"Other"]
[null,null,null,null,null,"String spare circuit",null,null,"3 - STPIS Exclusion (3.3)(a)","Fire","Network business","Network error"]
[null,null,null,null,null,"Other",null,null,"4 - STPIS Exclusion (3.3)(a)","Other",null,"Switching and protection error"]
[null,null,null,null,null,null,null,null,"5 - STPIS Exclusion (3.3)(a)","Dig-in","Third party","Fire"]
[null,null,null,null,null,null,null,null,"6 - STPIS Exclusion (3.3)(a)","Unauthorised access",null,"Other"]
[null,null,null,null,null,null,null,null,"7 - STPIS Exclusion (3.3)(a)","Vehicle impact",null,"Dig-in"]
[null,null,null,null,null,null,null,null,null,"Unknown",null,"Unauthorised access"]
[null,null,null,null,null,null,null,null,null,"Blow-in/Fall-in - NSP responsibility",null,"Vehicle impact"]
[null,null,null,null,null,null,null,null,null,"Grow-in - NSP responsibility","Unknown","Unknown"]
[null,null,null,null,null,null,null,null,null,"Blow-in/Fall-in - Other responsible party","Vegetation","Blow-in/Fall-in - NSP responsibility"]
[null,null,null,null,null,null,null,null,null,"Grow-in - Other responsible party",null,"Grow-in - NSP responsibility"]
[null,null,null,null,null,null,null,null,null,null,null,"Blow-in/Fall-in - Other responsible party"]
[null,null,null,null,null,null,null,null,null,null,null,"Grow-in - Other responsible party"]
[null,null,null,null,null,null,null,null,null,null,"Weather"]
[null,null,null,null,null,null,null,null,null,null,"2 - STPIS Exclusion (3.3)(a)"]
[null,null,null,null,null,null,null,null,null,null,"3 - STPIS Exclusion (3.3)(a)"]
[null,null,null,null,null,null,null,null,null,null,"4 - STPIS Exclusion (3.3)(a)"]
[null,null,null,null,null,null,null,null,null,null,"5 - STPIS Exclusion (3.3)(a)"]
[null,null,null,null,null,null,null,null,null,null,"6 - STPIS Exclusion (3.3)(a)"]
[null,null,null,null,null,null,null,null,null,null,"7 - STPIS Exclusion (3.3)(a)"]
[]
[]
[null,"CA & RESET RINS \nTNSP ","dms_TNSP_0203_SubstationType","dms_TNSP_020301_ProjectType","dms_TNSP_020301_ProjectTrigger","dms_TNSP_020302_ProjectType","dms_TNSP_0203_ProjectTrigger"]
[null,null,"Terminal station","New substation establishment","Demand growth","New line on new route - single circuit","Demand growth"]
[null,null,"Switching station","Capacity upgrade"," Voltage issues","New line on new route - dual circuit"," Voltage issues"]
[null,null,"Transmission substation","Voltage upgrade"," Reactive power issue","New line on new route - other"," Reactive power issue"]
[null,null,"Other","Other"," Fault level issues","Line rebuild over existing route - single circuit"," Fault level issues"]
[null,null,null,null,"Net market benefit","Line rebuild over existing route - dual circuit"," Net market benefit"]
[null,null,null,null," Safety","Reconductor - Single circuit"," Safety"]
[null,null,null,null," Environment","Reconductor - Dual circuit"," Environment"]
[null,null,null,null," Other","Reconductor - Other"," Other"]
[null,null,null,null,null,"Line upgrade - raising/retensoring"]
[null,null,null,null,null,"Line upgrade - voltage upgrade"]
[null,null,null,null,null,"Line upgrade - capacity"]
[null,null,null,null,null,"String spare circuit"]
[null,null,null,null,null,"Other"]
[]
[]
[]
[null,"NAMED RANGES USED IN ETL PROCESS"]
[null,null,null,null,null,null,null,null,null,null,null,null,"GAS ARR & RESET"]
[null,"CA & RESET RINS \nDNSP ONLY","dms_020303_01_UOM","dms_020501_01_UOM","dms_020501_02_UOM","dms_020501_03_UOM","dms_020501_04_UOM","dms_020701_01_UOM","dms_020701_02_UOM","dms_020701_01_Rows","dms_040102_01_UOM","dms_040102_04_UOM","dms_S140101_UOM","dms_S140201_UOM","dms_E050201_UOM","dms_E050202_UOM"]
[null,null,"Circuit line length in km","0's","0's","0's","0's","km","km","Route line length within zone","0's","days","number","number per km","per metre per connection","metres per connection"]
[null,null,"Circuit line length in km","0's","0's","0's","0's","0's","0's","Number of maintenance spans","0's","0's","number","number","per service per connection","number per connection"]
[null,null,"Circuit line length in km","MVA added","MVA added","MVA added","MVA added","km","km","Total length of maintenance spans","0's","$0s","number","number","number per connection","number per connection"]
[null,null,"Circuit line length in km","0's","0's","0's","0's","km","km","Length of vegetation corridors","$0s","0's","km"]
[null,null,"Number","total spend $0s","total spend $0s","total spend $0s","total spend $0s","0's","0's","Average number of trees per maintenance span"]
[null,null,"Number","net circuit km added","net circuit km added","net circuit km added","net circuit km added","years","years","Average frequency of cutting cycle"]
[null,null,"Number","total spend $0s","total spend $0s","total spend $0s","total spend $0s"]
[null,null,null,"net circuit km added","net circuit km added","net circuit km added","net circuit km added"]
[null,null,null,"total spend $0s","total spend $0s","total spend $0s","total spend $0s"]
[null,null,null,"0's",null,"$0s"]
[null,null,null,"0's"]
[null,null,null,"0's"]
[null,null,null,"$0s"]
[]
[]
[null,"CA & RESET RINS \nTNSP ONLY","dms_020701_01_UOM"]
[null,null,"km"]
[null,null,"0's"]
[null,null,"km"]
[null,null,"0's"]
[null,null,"km"]
[null,null,"metres"]
[null,null,"years"]
[]
[]
[null,"CA & RESET RINS \nDNSP & TNSP","dms_020603_01_UOM"]
[null,null,"0's"]
[null,null,"0's"]
[null,null,"0's"]
[null,null,"0's"]
[null,null,"(per cent)"]
[]
[]
[null,"EB & RESET RINS \nDNSP ONLY","dms_030601_01_UOM","dms_030601_02_UOM","dms_030701_01_UOM","dms_030702_01_UOM","dms_030703_01_UOM"]
[null,null,"minutes/customer","minutes/customer","Customer / km","%","km"]
[null,null,"minutes/customer","minutes/customer","MWh/customer","Number of spans"]
[null,null,"interruptions/customer","interruptions/customer","kVA / customer","Number of spans"]
[null,null,"interruptions/customer","interruptions/customer",null,"Number of spans"]
[null,null,null,null,null,"Number of spans"]
[null,null,null,null,null,"Years"]
[null,null,null,null,null,"Years"]
[null,null,null,null,null,"Trees"]
[null,null,null,null,null,"Trees"]
[null,null,null,null,null,"Defects"]
[null,null,null,null,null,"Defects"]
[null,null,null,null,null,"Spans"]
[null,null,null,null,null,"km"]
[null,null,null,null,null,"Spans"]
[]
[null,null,"WHEN INSERTING COVER SHEET INTO A TNSP FILE - APPLY THESE NAMED RANGES"]
[null,"EB & RESET RINS \nTNSP ONLY","dms_030601_01_UOM",null,"dms_030701_01_UOM","dms_030702_01_UOM"]
[null,null,"%",null,"Number of spans","km"]
[null,null,"number",null,"Years","%"]
[null,null,"number",null,"Trees","km"]
[null,null,"%",null,"Defects","number"]
[null,null,"number",null,"Number of spans"]
[null,null,"number",null,"km"]
[null,null,"%",null,"km"]
[null,null,"number",null,"Number of spans"]
[null,null,"number"]
[null,null,"%"]
[null,null,"number"]
[null,null,"%"]
[null,null,"number"]
[null,null,"%"]
[null,null,"number"]
[]
[null,"EB & RESET RINS \nDNSP & TNSP","dms_EB_RAB_PIT"]
[null,null,"Beginning of year"]
[null,null,"End of year"]
[null,null,"End of year"]
[null,null,"End of year"]
[null,null,"End of year"]
[null,null,"End of year"]
[]
[null,"ARR \nDNSP ONLY","dms_030605_UOM","dms_03060703_UOM","dms_E020202_UOM","Spare"]
[null,null,"number","number","Length of mains replaced"]
[null,null,"number","number","Number of services replaced"]
[null,null,"number","number"]
[null,null,"number","number"]
[null,null,"number","(per cent)"]
[null,null,"number"]
[null,null,"number"]
[null,null,"number"]
[null,null,"number"]
[null,null,"number"]
[null,null,"number"]
[null,null,"number"]
[null,null,"(per cent)"]
[null,null,"(per cent)",""]
[]
[null,"RFM","dms_Beg","dms_Mid","dms_End"]
[null,null,"Beginning of year","Mid year","End of Year"]
[]
[null,"PTRM","dms_PTRM_RAB_PIT","dms_PTRM_TAB_PIT","DMS_Xfactor"]
[null,null,"Beginning of year","Beginning of year","x factors"]
[null,null,"End of year","End of year"]
[null,null,"End of year","End of year"]
[null,null,"End of year","End of year"]
[null,null,"End of year"]
[]
[]
[null,"STPIS & MIC NAMED RANGES "]
[]
[null,"These \"row descriptions\" are the column headings in the various templates but become row descriptions in the ETL process"]
[]
[null,"Table 6.3 sustained interruptions - row descriptions","dms_060301_CustNo_Affected_Row","dms_060301_Avg_Duration_Sustained_Int_Row","dms_060301_Effect_unplanned_SAIDI_Row","dms_060301_Effect_unplanned_SAIFI_Row"]
[null,null,"Number of customers affected by the interruption","Average duration of sustained customer interruption","Effect on unplanned SAIDI","Effect on unplanned SAIFI"]
[]
[]
[null,"Table 6.1 telephone answering - row descriptions and start date","dms_060101_Rows","dms_060102_Rows","dms_060101_StartDateTxt"]
[null,null,"Total number of calls \n(after removing excluded events)","Number of calls answered within 30 seconds \n(after excluding excluded events) ",{"$f":"dms_060701_StartDateTxt","v":"1-Jul-2017"}]
[]
[]
[null,"Table 6.8.1 - row descriptions","dms_060801_01_Rows","dms_060801_02_Rows","dms_060801_03_Rows","dms_060801_04_Rows"]
[null,null,"Number of interruptions","Duration of interruptions","Total unplanned minutes off supply","Effect on unplanned MAIFI"]
[]
[]
[null,"Table 7.9.4 - market impact component - row descriptions","dms_070904_01_Rows","without exclusions","with exclusions"]
[]
[]
[null,"These headings (Lists) are determined from the INDEX/MATCH function on the NSP selected on the Business & other details sheet"]
[]
[null,"Table 6.7.1 - daily performance data - unplanned - MAIFI  -- row descriptions and header named range values","dms_060701_Feeder_Header_Lvl4",{"$f":"INDEX(dms_FeederName_1,MATCH(dms_TradingName,dms_TradingName_List))","v":"CBD"},{"$f":"INDEX(dms_FeederName_1,MATCH(dms_TradingName,dms_TradingName_List))","v":"CBD"},{"$f":"INDEX(dms_FeederName_2,MATCH(dms_TradingName,dms_TradingName_List))","v":"Urban"},{"$f":"INDEX(dms_FeederName_2,MATCH(dms_TradingName,dms_TradingName_List))","v":"Urban"},{"$f":"INDEX(dms_FeederName_3,MATCH(dms_TradingName,dms_TradingName_List))","v":"Short rural"},{"$f":"INDEX(dms_FeederName_3,MATCH(dms_TradingName,dms_TradingName_List))","v":"Short rural"},{"$f":"INDEX(dms_FeederName_4,MATCH(dms_TradingName,dms_TradingName_List))","v":"Long rural"},{"$f":"INDEX(dms_FeederName_4,MATCH(dms_TradingName,dms_TradingName_List))","v":"Long rural"},{"$f":"IF((INDEX(dms_FeederName_5,MATCH(dms_TradingName,dms_TradingName_List))=0),\"Network\",(INDEX(dms_FeederName_5,MATCH(dms_TradingName,dms_TradingName_List))))","v":"Network"},{"$f":"IF((INDEX(dms_FeederName_5,MATCH(dms_TradingName,dms_TradingName_List))=0),\"Network\",(INDEX(dms_FeederName_5,MATCH(dms_TradingName,dms_TradingName_List))))","v":"Network"},"Network","Network"]
[]
[null,null,"dms_060701_Rows","All events","After removing excluded events","All events","After removing excluded events","All events","After removing excluded events","All events","After removing excluded events","All events","After removing excluded events","All events","After removing excluded events"]
[null,null,null,"the number of column headings changes from 10 to 12 depending on the number of feeder categories for the NSP"]
[]
[null,null,"dms_0603_FeederList",{"$f":"INDEX(dms_FeederName_1,MATCH(dms_TradingName,dms_TradingName_List))","v":"CBD"},{"$f":"INDEX(dms_FeederName_2,MATCH(dms_TradingName,dms_TradingName_List))","v":"Urban"},{"$f":"INDEX(dms_FeederName_3,MATCH(dms_TradingName,dms_TradingName_List))","v":"Short rural"},{"$f":"INDEX(dms_FeederName_4,MATCH(dms_TradingName,dms_TradingName_List))","v":"Long rural"}]
[]
[]
[null,"Use these to add to specific worksheets in existing files","Use these to add to specific worksheets in existing files"]
[]
[]
[null,"ARRs 6.7 STPIS daily performance","dms_060101_Values","dms_060102_Values","dms_060701_Values"]
[null,null,"dms_LeapYear"]
[]
[]
[null,"ARR's  6.8 STPIS exclusions","dms_060801_Event_Date","dms_060801_OutageID","dms_060801_FeederID","dms_060801_FeederClass","dms_060801_CauseID","dms_060801_01_Values","dms_060801_02_Values","dms_060801_03_Values","dms_060801_Excl_Cat","dms_060801_04_Values"]
[null,null,"dms_060801_StartCell"]
[]
[]
[null,"CA 6.3 sustained interruptions","dms_060301_Event_Date","dms_060301_Event_Time","dms_060301_AssetID","dms_060301_FeederClass","dms_060301_Reason","dms_060301_DetailedReason","dms_060301_CustNo_Affected_Values","dms_060301_Avg_Duration_Sustained_Int_Values","dms_060301_Effect_unplanned_SAIDI_Values","dms_060301_Effect_unplanned_SAIFI_Values","dms_060301_MED"]
[]
[]
[]
[null,"PTRM input sheet","DMS_50_01_01a","DMS_50_01_01aa","DMS_50_01_01b","DMS_50_01_01bb","DMS_50_01_01c","DMS_50_01_01d","DMS_50_01_01dd"]

{"sheet":"AER lookups","index":30,"n_rows":97,"n_cols":36,"rows_kept":97,"cut":false,"hidden":true,"merged":[[18,1,18,4],[4,24,4,34],[5,24,5,27],[5,29,5,33],[5,34,7,34]]}
[null,"AER LOOKUP TABLES"]
[]
[null,"Template number",5]
[]
[null,null,null,null,null,null,null,null,null,null,null,null,null,null,null,null,null,null,null,null,null,null,null,null,"FOR ELECTRICITY BUSINESSES ONLY"]
[null,null,null,null,null,null,null,null,null,null,null,null,null,null,null,null,null,null,null,null,null,null,null,null,"Feeder Types",null,null,null,"TasNetworks (D)","Feeder Names"]
[]
[null,null,null,null,null,null,null,null,null,null,null,null,null,null,null,null,null,null,null,null,null,null,null,null,"CBD","Urban","Short rural","long rural","EXTRA"]
[null,"dms_TradingName_List","dms_TradingNameFull_List","dms_ABN_List","dms_JurisdictionList","dms_Sector_List","dms_Segment_List","dms_FormControl_List","dms_RPT_List","dms_RPTMonth_List","dms_CRCPlength_List","dms_FRCPlength_List","dms_PRCPlength_List","dms_663_List","dms_Addr1_List","dms_Addr2_List","dms_Suburb_List","dms_State_List","dms_PostCode_List","dms_PAddr1_List","dms_PAddr2_List","dms_PSuburb_List","dms_PState_List","dms_PPostCode_List","dms_CBD_flag","dms_Urban_flag","dms_ShortRural_flag","dms_LongRural_flag","dms_FeederType_5_flag","dms_FeederName_1","dms_FeederName_2","dms_FeederName_3","dms_FeederName_4","dms_FeederName_5","dms_Public_Lighting_List","Name"]
[null,"Australian Transmission Co.","Australian Transmission Co.",11222333444,"NSW","Electricity","Transmission","Revenue cap","Financial","June",5,5,5,5,"123 Straight Street",null,"SYDNEY","NSW",2000,"PO Box 123",null,"SYDNEY","NSW",2000,"NO","NO","NO","NO","NO","CBD","Urban","Short rural","Long rural",null,"NO",{"$f":"B10","v":"Australian Transmission Co."}]
[null,"Directlink","Directlink",16779340889,"Qld","Electricity","Transmission","Revenue cap","Financial","June",5,5,5,5,"Level 25","580 George Street","SYDNEY","NSW",2000,"PO Box R41",null,"ROYAL EXCHANGE","NSW",1225,"NO","NO","NO","NO","NO","CBD","Urban","Short rural","Long rural",null,"NO",{"$f":"B11","v":"Directlink"}]
[null,"Murraylink","Murraylink",79181207909,"SA","Electricity","Transmission","Revenue cap","Financial","June",5,5,5,5,"Level 19","580 George Street","SYDNEY","NSW",2000,"PO Box R41",null,"ROYAL EXCHANGE","NSW",1225,"NO","NO","NO","NO","NO","CBD","Urban","Short rural","Long rural",null,"NO",{"$f":"B12","v":"Murraylink"}]
[null,"TasNetworks (T)","TasNetworks (T)",24167357299,"Tas","Electricity","Transmission","Revenue cap","Financial","June",5,5,5,5,"1-7 Maria Street",null,"LENAH VALLEY","Tas",7008,"PO Box 606",null,"MOONAH","Tas",7009,"NO","NO","NO","NO","NO","CBD","Urban","Short rural","Long rural",null,"NO",{"$f":"B13","v":"TasNetworks (T)"}]
[null,"TransGrid","NSW Electricity Networks Operations Pty Ltd trading as TransGrid","70 250 995 390","NSW","Electricity","Transmission","Revenue cap","Financial","June",5,5,4,5,"180 Thomas Street",null,"SYDNEY","NSW",2000,"PO Box A1000",null,"SYDNEY SOUTH","NSW",1235,"NO","NO","NO","NO","NO","CBD","Urban","Short rural","Long rural",null,"NO",{"$f":"B14","v":"TransGrid"}]
[]
[]
[]
[]
[null,"The Reg Year Ending (dms_RYE) must be set to the last year of the regulatory period. For forecast data is is usually (FRCP_y5) for actual it is a single year (CRY). For historical actual data the RYE will need to be set manually in the business details sheet by setting the dms_Multiyear_flag to 1 and putting the correct value in 'dms_Specified_FinalYear. See cells C67:C68"]
[null,"dms_Model_List ","dms_Model_Name_Format1","dms_Worksheet_List","dms_Model_Span_List"]
[null,"ARR","Annual Reporting",{"$f":"IF(dms_MultiYear_ResponseFlag=\"yes\",\"NEW HISTORICAL ANNUAL REPORTING\",\"ANNUAL REPORTING\")","v":"ANNUAL REPORTING"},1]
[null,"CA","Category Analysis",{"$f":"IF(dms_MultiYear_ResponseFlag=\"yes\",\"NEW HISTORICAL CATEGORY ANALYSIS\",\"CATEGORY ANALYSIS\")","v":"CATEGORY ANALYSIS"},1]
[null,"CESS","Capitlal Expenditure","CAPITLAL EXPENDITURE SHARING SCHEMING",5]
[null,"CPI","CPI","CPI",5]
[null,"EB","Economic Benchmarking",{"$f":"IF(dms_MultiYear_ResponseFlag=\"yes\",\"NEW HISTORICAL ECONOMIC BENCHMARKING\",\"ECONOMIC BENCHMARKING\")","v":"ECONOMIC BENCHMARKING"},1]
[null,"EBSS","Efficiency Benefit Sharing Scheme","EFFICIENCY BENEFIT SHARING SCHEME",5]
[null,"Pricing","Pricing Proposal","PRICING PROPOSAL",5]
[null,"Profitability","Profitability","PROFITABILITY",5]
[null,"PTRM","Post Tax Revenue Model","POST TAX REVENUE MODEL",5]
[null,"Reset","Regulatory Reporting (Reset)","REGULATORY REPORTING STATEMENT",5]
[null,"RFM","Roll Forward Model","ROLL FORWARD MODEL",5]
[null,"WACC","Weighted Average Cost of Capital","WEIGHTED AVERAGE COST OF CAPITAL",1]
[]
[]
[]
[null,"Financial","Calendar",null,"PREVIOUS",null,"CURRENT",null,"FORTHCOMING"]
[null,"1987-88",1988,"PRCP_y1",{"$f":"INDEX(INDIRECT(dms_RPT),dms_PRCP_start_row)","v":"2014-15"},"CRCP_y1",{"$f":"INDEX(INDIRECT(dms_RPT),dms_CRCP_start_row)","v":"2019-20"},{"$f":"FRCP_y1","v":"2024-25"},{"$f":"INDEX(INDIRECT(dms_RPT),dms_FRCP_start_row)","v":"2024-25"}]
[null,"1988-89",1989,"PRCP_y2",{"$f":"INDEX(INDIRECT(dms_RPT),dms_PRCP_start_row+1)","v":"2015-16"},"CRCP_y2",{"$f":"INDEX(INDIRECT(dms_RPT),dms_CRCP_start_row+1)","v":"2020-21"},"FRCP_y2",{"$f":"INDEX(INDIRECT(dms_RPT),dms_FRCP_start_row+1)","v":"2025-26"}]
[null,"1989-90",1990,"PRCP_y3",{"$f":"INDEX(INDIRECT(dms_RPT),dms_PRCP_start_row+2)","v":"2016-17"},"CRCP_y3",{"$f":"INDEX(INDIRECT(dms_RPT),dms_CRCP_start_row+2)","v":"2021-22"},"FRCP_y3",{"$f":"INDEX(INDIRECT(dms_RPT),dms_FRCP_start_row+2)","v":"2026-27"}]
[null,"1990-91",1991,"PRCP_y4",{"$f":"INDEX(INDIRECT(dms_RPT),dms_PRCP_start_row+3)","v":"2017-18"},"CRCP_y4",{"$f":"INDEX(INDIRECT(dms_RPT),dms_CRCP_start_row+3)","v":"2022-23"},"FRCP_y4",{"$f":"INDEX(INDIRECT(dms_RPT),dms_FRCP_start_row+3)","v":"2027-28"}]
[null,"1991-92",1992,"PRCP_y5",{"$f":"INDEX(INDIRECT(dms_RPT),dms_PRCP_start_row+4)","v":"2018-19"},"CRCP_y5",{"$f":"INDEX(INDIRECT(dms_RPT),dms_CRCP_start_row+4)","v":"2023-24"},"FRCP_y5",{"$f":"INDEX(INDIRECT(dms_RPT),dms_FRCP_start_row+4)","v":"2028-29"}]
[null,"1992-93",1993,"PRCP_y6",{"$f":"INDEX(INDIRECT(dms_RPT),dms_PRCP_start_row+5)","v":"2019-20"},"CRCP_y6",{"$f":"INDEX(INDIRECT(dms_RPT),dms_CRCP_start_row+5)","v":"2024-25"},"FRCP_y6",{"$f":"INDEX(INDIRECT(dms_RPT),dms_FRCP_start_row+5)","v":"2029-30"}]
[null,"1993-94",1994,"PRCP_y7",{"$f":"INDEX(INDIRECT(dms_RPT),dms_PRCP_start_row+6)","v":"2020-21"},"CRCP_y7",{"$f":"INDEX(INDIRECT(dms_RPT),dms_CRCP_start_row+6)","v":"2025-26"},"FRCP_y7",{"$f":"INDEX(INDIRECT(dms_RPT),dms_FRCP_start_row+6)","v":"2030-31"}]
[null,"1994-95",1995,"PRCP_y8",{"$f":"INDEX(INDIRECT(dms_RPT),dms_PRCP_start_row+7)","v":"2021-22"},"CRCP_y8",{"$f":"INDEX(INDIRECT(dms_RPT),dms_CRCP_start_row+7)","v":"2026-27"},"FRCP_y8",{"$f":"INDEX(INDIRECT(dms_RPT),dms_FRCP_start_row+7)","v":"2031-32"}]
[null,"1995-96",1996,"PRCP_y9",{"$f":"INDEX(INDIRECT(dms_RPT),dms_PRCP_start_row+8)","v":"2022-23"},"CRCP_y9",{"$f":"INDEX(INDIRECT(dms_RPT),dms_CRCP_start_row+8)","v":"2027-28"},"FRCP_y9",{"$f":"INDEX(INDIRECT(dms_RPT),dms_FRCP_start_row+8)","v":"2032-33"}]
[null,"1996-97",1997,"PRCP_y10",{"$f":"INDEX(INDIRECT(dms_RPT),dms_PRCP_start_row+9)","v":"2023-24"},"CRCP_y10",{"$f":"INDEX(INDIRECT(dms_RPT),dms_CRCP_start_row+9)","v":"2028-29"},"FRCP_y10",{"$f":"INDEX(INDIRECT(dms_RPT),dms_FRCP_start_row+9)","v":"2033-34"}]
[null,"1997-98",1998,"PRCP_y11",{"$f":"INDEX(INDIRECT(dms_RPT),dms_PRCP_start_row+10)","v":"2024-25"},"CRCP_y11",{"$f":"INDEX(INDIRECT(dms_RPT),dms_CRCP_start_row+10)","v":"2029-30"},"FRCP_y11",{"$f":"INDEX(INDIRECT(dms_RPT),dms_FRCP_start_row+10)","v":"2034-35"}]
[null,"1998-99",1999,"PRCP_y12",{"$f":"INDEX(INDIRECT(dms_RPT),dms_PRCP_start_row+11)","v":"2025-26"},"CRCP_y12",{"$f":"INDEX(INDIRECT(dms_RPT),dms_CRCP_start_row+11)","v":"2030-31"},"FRCP_y12",{"$f":"INDEX(INDIRECT(dms_RPT),dms_FRCP_start_row+11)","v":"2035-36"}]
[null,"1999-00",2000,"PRCP_y13",{"$f":"INDEX(INDIRECT(dms_RPT),dms_PRCP_start_row+12)","v":"2026-27"},"CRCP_y13",{"$f":"INDEX(INDIRECT(dms_RPT),dms_CRCP_start_row+12)","v":"2031-32"},"FRCP_y13",{"$f":"INDEX(INDIRECT(dms_RPT),dms_FRCP_start_row+12)","v":"2036-37"}]
[null,"2000-01",2001,"PRCP_y14",{"$f":"INDEX(INDIRECT(dms_RPT),dms_PRCP_start_row+13)","v":"2027-28"},"CRCP_y14",{"$f":"INDEX(INDIRECT(dms_RPT),dms_CRCP_start_row+13)","v":"2032-33"},"FRCP_y14",{"$f":"INDEX(INDIRECT(dms_RPT),dms_FRCP_start_row+13)","v":"2037-38"}]
[null,"2001-02",2002,"PRCP_y15",{"$f":"INDEX(INDIRECT(dms_RPT),dms_PRCP_start_row+14)","v":"2028-29"},"CRCP_y15",{"$f":"INDEX(INDIRECT(dms_RPT),dms_CRCP_start_row+14)","v":"2033-34"},"FRCP_y15",{"$f":"INDEX(INDIRECT(dms_RPT),dms_FRCP_start_row+14)","v":"2038-39"}]
[null,"2002-03",2003,"PRCP_y16",{"$f":"INDEX(INDIRECT(dms_RPT),dms_PRCP_start_row+15)","v":"2029-30"},"CRCP_y16",{"$f":"INDEX(INDIRECT(dms_RPT),dms_CRCP_start_row+15)","v":"2034-35"},"FRCP_y16",{"$f":"INDEX(INDIRECT(dms_RPT),dms_FRCP_start_row+15)","v":"2039-40"}]
[null,"2003-04",2004]
[null,"2004-05",2005]
[null,"2005-06",2006,null,"CRY - FRY"]
[null,"2006-07",2007,"dms_y1",{"$f":"IFERROR(INDEX(INDIRECT(dms_RPT),dms_CRY_start_row),0)","v":"2022-23"}]
[null,"2007-08",2008,"dms_y2",{"$f":"IFERROR(INDEX(INDIRECT(dms_RPT),dms_CRY_start_row+1),0)","v":"2023-24"}]
[null,"2008-09",2009,"dms_y3",{"$f":"IFERROR(INDEX(INDIRECT(dms_RPT),dms_CRY_start_row+2),0)","v":"2024-25"}]
[null,"2009-10",2010,"dms_y4",{"$f":"IFERROR(INDEX(INDIRECT(dms_RPT),dms_CRY_start_row+3),0)","v":"2025-26"}]
[null,"2010-11",2011,"dms_y5",{"$f":"IFERROR(INDEX(INDIRECT(dms_RPT),dms_CRY_start_row+4),0)","v":"2026-27"}]
[null,"2011-12",2012,"dms_y6",{"$f":"IFERROR(INDEX(INDIRECT(dms_RPT),dms_CRY_start_row+5),0)","v":"2027-28"}]
[null,"2012-13",2013,"dms_y7",{"$f":"IFERROR(INDEX(INDIRECT(dms_RPT),dms_CRY_start_row+6),0)","v":"2028-29"}]
[null,"2013-14",2014,"dms_y8",{"$f":"IFERROR(INDEX(INDIRECT(dms_RPT),dms_CRY_start_row+7),0)","v":"2029-30"}]
[null,"2014-15",2015,"dms_y9",{"$f":"IFERROR(INDEX(INDIRECT(dms_RPT),dms_CRY_start_row+8),0)","v":"2030-31"}]
[null,"2015-16",2016,"dms_y10",{"$f":"IFERROR(INDEX(INDIRECT(dms_RPT),dms_CRY_start_row+9),0)","v":"2031-32"}]
[null,"2016-17",2017,"dms_y11",{"$f":"IFERROR(INDEX(INDIRECT(dms_RPT),dms_CRY_start_row+10),0)","v":"2032-33"}]
[null,"2017-18",2018,"dms_y12",{"$f":"IFERROR(INDEX(INDIRECT(dms_RPT),dms_CRY_start_row+11),0)","v":"2033-34"}]
[null,"2018-19",2019,"dms_y13",{"$f":"IFERROR(INDEX(INDIRECT(dms_RPT),dms_CRY_start_row+12),0)","v":"2034-35"}]
[null,"2019-20",2020,"dms_y14",{"$f":"IFERROR(INDEX(INDIRECT(dms_RPT),dms_CRY_start_row+13),0)","v":"2035-36"}]
[null,"2020-21",2021,"dms_y15",{"$f":"IFERROR(INDEX(INDIRECT(dms_RPT),dms_CRY_start_row+14),0)","v":"2036-37"}]
[null,"2021-22",2022,"dms_y16",{"$f":"IFERROR(INDEX(INDIRECT(dms_RPT),dms_CRY_start_row+15),0)","v":"2037-38"}]
[null,"2022-23",2023]
[null,"2023-24",2024]
[null,"2024-25",2025]
[null,"2025-26",2026]
[null,"2026-27",2027]
[null,"2027-28",2028]
[null,"2028-29",2029]
[null,"2029-30",2030]
[null,"2030-31",2031]
[null,"2031-32",2032]
[null,"2032-33",2033]
[null,"2033-34",2034]
[null,"2034-35",2035]
[null,"2035-36",2036]
[null,"2036-37",2037]
[null,"2037-38",2038]
[null,"2038-39",2039]
[null,"2039-40",2040]
[null,"2040-41",2041]
[null,"2041-42",2042]
[null,"2042-43",2043]
[null,"2043-44",2044]
[null,"2044-45",2045]
[null,"2045-46",2046]
[null,"2046-47",2047]
[null,"2047-28",2048]

{"sheet":"AER ETL","index":31,"n_rows":145,"n_cols":10,"rows_kept":145,"cut":false,"hidden":true,"merged":[[34,0,59,0],[34,37,34,58],[34,68,34,89],[32,37,32,58],[71,1,73,1],[32,68,32,89],[33,37,33,58],[33,68,33,89],[11,0,15,0],[12,4,12,8],[14,2,14,4],[18,0,25,0],[26,0,31,0]]}
[null,"AER ETL INFORMATION"]
[]
[null,"USES NAMED RANGES FLAG","yes","dms_Defined_Names_Used"]
[]
[null,"IF THIS IS AN ABC RIN - make sure the the named range CRY is applied and the named range dms_dollar_nom_UOM is applied"]
[null,"IF THIS IS A RESET RIN - make sure the named ranges CRY and dms_dollar_nom_UOM are NOT present in the workbook"]
[null,"FOR ABC RINS THAT SPAN MULTIPLE YEARS - make sure MultiYear Flag is set and final year entered as required"]
[]
[null,"Full trading name",{"$f":"INDEX(dms_TradingNameFull_List,MATCH(dms_TradingName,dms_TradingName_List))","v":"TasNetworks (T)"},null,"dms_TradingNameFull"]
[null,"Trading name",{"$f":"dms_TradingName","v":"TasNetworks (T)"}]
["Selected here","Model / RIN","Reset","dms_Model"]
["Read from Business & other details","Source","Regulatory proposal","dms_Source",{"$f":"IF(dms_Model=\"Reset\", \"You have chosen Reset - make sure you have set Reg Proposal as source\",\"\")","v":"You have chosen Reset - make sure you have set Reg Proposal as source"}]
[null,"Data quality","Consolidated","For DB purposes this is always Consoldiated"]
[null,"Data status","Public","\"See \"& \" - For DB purposes this is always Public\""]
[null,"Amendment reason",{"$f":"dms_Amendment_Text","v":"."},null,null,"dms_AmendmentReason"]
[null,"Submission date",{"$f":"dms_Typed_Submission_Date","v":"2023-01-31"},"dms_SubmissionDate"]
[]
["Redundant","EBSS - First application of scheme in forthcoming period?","No"]
["Pre-populated from lookup table","Data ingestion data quality","Consolidated","dms_DataQuality","Always Consolidated"]
[null,"Sector",{"$f":"INDEX(dms_Sector_List,MATCH(dms_TradingName,dms_TradingName_List))","v":"Electricity"},"dms_Sector","=INDEX(dms_Sector_List,MATCH(dms_TradingName,dms_TradingName_List))"]
[null,"Segment",{"$f":"INDEX(dms_Segment_List,MATCH(dms_TradingName,dms_TradingName_List))","v":"Transmission"},"dms_Segment","=INDEX(dms_Segment_List,MATCH(dms_TradingName,dms_TradingName_List))"]
[null,"Regulatory Year Ending",{"$f":"IF(dms_MultiYear_Flag=1,LEFT(dms_Specified_FinalYear,2)&RIGHT(dms_Specified_FinalYear,2),dms_RYE_result)","v":"2029"},"dms_RYE","=IF(dms_MultiYear_Flag=1,LEFT(dms_Specified_FinalYear,2)&RIGHT(dms_Specified_FinalYear,2),dms_RYE_result)"]
[null,"Reporting Period Type",{"$f":"INDEX(dms_RPT_List,MATCH(dms_TradingName,dms_TradingName_List))","v":"Financial"},"dms_RPT","=INDEX(dms_RPT_List,MATCH(dms_TradingName,dms_TradingName_List))"]
[null,"EB/CA Unit of Measure for Monetary Values","$0s","dms_dollar_nom_UOM",{"$f":"IF(dms_SingleYearModel=\"yes\",\"This is set to an historical template (EB, CA or ARR), apply UOM Named Range to cell !\",\"This is not an historical template, make sure UOM Named Range is not applied\")","v":"This is not an historical template, make sure UOM Named Range is not applied"},null,null,null,null,{"$f":"IFERROR(dms_dollar_nom_UOM, \"NR not applied\")","v":"NR not applied"}]
[null,"Security Classification","Public","dms_Classification","Always Public"]
[null,"Jurisdiction",{"$f":"INDEX(dms_JurisdictionList,MATCH(dms_TradingName,dms_TradingName_List))","v":"Tas"},"dms_Jurisdiction","=INDEX(dms_JurisdictionList,MATCH(dms_TradingName,dms_TradingName_List))"]
["Relevant for PTRM, RFMs and Reset RINS","$ REAL REFERENCES"]
[null,"Does the named range CRY exist in this file? ",{"$f":"IFERROR(CRY,\"NO\")","v":"2022-23"}]
[null,"CRY-1  (last full calendar year before CRY)",{"$f":"IFERROR(IF(dms_RPT=\"calendar\",CRY-1,LEFT(CRY,4)),\"CRY not present\")","v":"2022"},"dms_Cal_Year_B4_CRY","'=IF(dms_RPT=\"financial\",VALUE(LEFT(dms_SingleYear_FinalYear_Result,4)),VALUE(LEFT(dms_SingleYear_FinalYear_Result,4)-1))"]
[null,"Dollar $ real month",{"$f":"INDEX(dms_RPTMonth_List,MATCH(dms_TradingName,dms_TradingName_List))","v":"June"},"dms_RPTMonth","=INDEX(dms_RPTMonth_List,MATCH(dms_TradingName,dms_TradingName_List))"]
[null,"Dollar $ real  (the last month before the FRCP_y1)",{"$f":"IF(dms_Model=\"RFM\",dms_DollarReal_Prev, IF(dms_SingleYearModel=\"yes\",CONCATENATE(dms_RPTMonth)&\" \"&VALUE((LEFT(dms_CRY_start_year,2)&RIGHT(dms_CRY_start_year,2))),CONCATENATE(dms_RPTMonth)&\" \"&dms_DollarReal_year))","v":"June 2024"},"dms_DollarReal","=IF(dms_Model=\"RFM\",dms_DollarReal_Prev, IF(dms_SingleYearModel=\"yes\",CONCATENATE(dms_RPTMonth)&\" \"&VALUE((LEFT(dms_CRY_start_year,2)&RIGHT(dms_CRY_start_year,2))),CONCATENATE(dms_RPTMonth)&\" \"&dms_DollarReal_year))"]
[null,"Dollar $ real previous year (PRCP_y5)",{"$f":"CONCATENATE(dms_RPTMonth)&\" \"&dms_Previous_DollarReal_year","v":"June 2019"},"dms_DollarReal_Prev","=IF(SUM(dms_SingleYear_Model)>0,CONCATENATE(dms_RPTMonth)&\" \"&VALUE(((LEFT(CRY,2))&RIGHT(CRY,2))-1),CONCATENATE(dms_RPTMonth)&\" \"&VALUE(((LEFT(dms_CRCP_FirstYear_Result,2)&RIGHT(dms_CRCP_FirstYear_Result,2))))-1)"]
[null,"PTRM/ RFMs"]
[null,"Form of control",{"$f":"INDEX(dms_FormControl_List,MATCH(dms_TradingName,dms_TradingName_List))","v":"Revenue cap"},"dms_FormControl","=INDEX(dms_FormControl_List,MATCH(dms_TradingName,dms_TradingName_List))"]
["All potential values for Regulatory Years or RYEs as calculated","This block works out the various RYE's for ALL RIN types and MODELS"]
[null,"dms_start_year",{"$f":"FRCP_y1","v":"2024-25"},"=FRCP_y1","FRCP_y1 from cover sheet"]
[null,"dms_CRY_start_year",{"$f":"IFERROR(CRY,CRCP_y4)","v":"2022-23"},"=IFERROR(CRY,CRCP_y4)"]
[null,"dms_CRY_start_row",{"$f":"IFERROR(MATCH(dms_CRY_start_year,INDIRECT(dms_RPT),0),0)","v":36},"=IFERROR(MATCH(dms_CRY_start_year,INDIRECT(dms_RPT),0),0)"]
[null,"dms_FRCP_start_row",{"$f":"MATCH(dms_start_year,INDIRECT(dms_RPT),0)","v":38},"=MATCH(dms_start_year,INDIRECT(dms_RPT),0)","Uses FRCP_y1 as a start reference"]
[null,"dms_CRCP_start_row",{"$f":"dms_FRCP_start_row-dms_CRCPlength_Num","v":33},"=dms_FRCP_start_row-dms_CRCPlength_Num","Uses the value in dms_CRCPlength_Num"]
[null,"dms_PRCP_start_row",{"$f":"dms_FRCP_start_row-dms_CRCPlength_Num-dms_PRCPlength_Num","v":28},"=dms_FRCP_start_row-dms_CRCPlength_Num-dms_PRCPlength_Num","Uses the value in dms_CRCPlength_Num and dms_PRCPlength_Num"]
[null,"dms_RYE_start_row",{"$f":"dms_FRCP_start_row+(dms_FRCPlength_Num-1)","v":42},"=dms_FRCP_start_row+(dms_FRCPlength_Num-1)","Uses the value in dms_FRCPlength_Num-1"]
[null,"FRCP_start_year",{"$f":"INDEX(INDIRECT(dms_RPT),dms_FRCP_start_row)","v":"2024-25"},"=INDEX(INDIRECT(dms_RPT),dms_FRCP_start_row)","Converts the FRCP start row to display the year"]
[null,"CRCP_start_year",{"$f":"INDEX(INDIRECT(dms_RPT),dms_CRCP_start_row)","v":"2019-20"},"=INDEX(INDIRECT(dms_RPT),dms_CRCP_start_row)","Converts the CRCP start row to display the year"]
[null,"PRCP_start_year",{"$f":"INDEX(INDIRECT(dms_RPT),dms_PRCP_start_row)","v":"2014-15"},"=INDEX(INDIRECT(dms_RPT),dms_PRCP_start_row)","Converts the PRCP start row to display the year"]
[null,"FRCP_final_year",{"$f":"INDEX(INDIRECT(dms_RPT),dms_FRCP_start_row+dms_FRCPlength_Num-1)","v":"2028-29"},"=INDEX(INDIRECT(dms_RPT),dms_FRCP_start_row+dms_FRCPlength_Num-1)","Finds the FRCP final year"]
[null,"CRCP_final_year",{"$f":"INDEX(INDIRECT(dms_RPT),dms_CRCP_start_row+dms_CRCPlength_Num-1)","v":"2023-24"},"=INDEX(INDIRECT(dms_RPT),dms_CRCP_start_row+dms_CRCPlength_Num-1)","Finds the CRCP final year"]
[null,"PRCP_final_year",{"$f":"INDEX(INDIRECT(dms_RPT),dms_PRCP_start_row+dms_FRCPlength_Num-1)","v":"2018-19"},"=INDEX(INDIRECT(dms_RPT),dms_PRCP_start_row+dms_FRCPlength_Num-1)","Finds the PRCP final year"]
[null,"dms_Reset_final_year",{"$f":"INDEX(INDIRECT(dms_RPT),dms_RYE_start_row)","v":"2028-29"},"=INDEX(INDIRECT(dms_RPT),dms_RYE_start_row)","For Resets and PTRM/RFMs (same as FRCP_final_year)"]
[null,"dms_SpecifiedYear_final_year",{"$f":"FRY","v":"2022-23"},"=FRY","FRY from cover sheet"]
[null,"dms_DollarReal_year",{"$f":"LEFT(CRCP_final_year,2)&RIGHT(CRCP_final_year,2)","v":"2024"},"=LEFT(CRCP_final_year,2)&RIGHT(CRCP_final_year,2)","Uses the value in CRCP_final_year"]
[null,"dms_Previous_DollarReal_year",{"$f":"LEFT(PRCP_final_year,2)&RIGHT(PRCP_final_year,2)","v":"2019"},"=LEFT(PRCP_final_year,2)&RIGHT(PRCP_final_year,2)","Uses the value in PRCP_final_year"]
[null,"dms_CRY_RYE",{"$f":"IFERROR(LEFT(CRY,2)&RIGHT(CRY,2),0)","v":"2023"},"=IFERROR(LEFT(CRY,2)&RIGHT(CRY,2),0)","For ABC single year RINS"]
[null,"dms_Reset_RYE",{"$f":"IF(dms_Model_Span>1,IF(dms_Model=\"RFM\",(LEFT(dms_DollarReal_year,2)&RIGHT(dms_DollarReal_year,2)),(LEFT(dms_Reset_final_year,2)&RIGHT(dms_Reset_final_year,2))),0)","v":"2029"},"=IF(dms_Model_Span>1,IF(dms_Model=\"RFM\",(LEFT(dms_DollarReal_year,2)&RIGHT(dms_DollarReal_year,2)),(LEFT(dms_Reset_final_year,2)&RIGHT(dms_Reset_final_year,2))),0)","If model span > 1 then uses dms_Reset_RYE otherwise it's a multi year ABC and uses dms_Specified_RYE"]
[null,"dms_Specified_RYE",{"$f":"IF(dms_MultiYear_ResponseFlag=\"Yes\",(LEFT(dms_Specified_FinalYear,2)&RIGHT(dms_Specified_FinalYear,2)),0)","v":0},"=IF(dms_MultiYear_ResponseFlag=\"Yes\",(LEFT(dms_Specified_FinalYear,2)&RIGHT(dms_Specified_FinalYear,2)),0)","If multi year ABC - uses dms_Specified_FinalYear"]
[null,"dms_Model_Span",{"$f":"INDEX(dms_Model_Span_List,MATCH(dms_Model,dms_Model_List))","v":5},"=INDEX(dms_Model_Span_List,MATCH(dms_Model,dms_Model_List))","A result of 5 is used to signify that it is more than 1 year span"]
[null,"dms_RYE_result",{"$f":"IF(dms_MultiYear_ResponseFlag=\"yes\",dms_Specified_RYE,(IF(dms_Model_Span>1,dms_Reset_RYE,dms_CRY_RYE)))","v":"2029"},"=IF(dms_MultiYear_ResponseFlag=\"yes\",dms_Specified_RYE,(IF(dms_Model_Span>1,dms_Reset_RYE,dms_CRY_RYE)))","Nested IF - feeds into dms_RYE"]
[null,"dms_Reset_Span",{"$f":"IF(dms_Reset_RYE>0,CONCATENATE(FRCP_y1,\" to \",FRCP_final_year),0)","v":"2024-25 to 2028-29"},"=IF(dms_Reset_RYE>0,CONCATENATE(FRCP_y1,\" to \",FRCP_final_year),0)","Reset span of years as text"]
[null,"dms_SpecifiedYear_Span",{"$f":"IF(dms_Specified_RYE>0,CONCATENATE(CRY,\" to \",dms_Specified_FinalYear),0)","v":0},"=IF(dms_Specified_RYE>0,CONCATENATE(CRY,\" to \",dms_Specified_FinalYear),0)","Multi year ABC span of years as text"]
[null,"dms_Header_Span",{"$f":"IF(dms_MultiYear_Flag=1,dms_SpecifiedYear_Span,IF(dms_Model_Span>1,dms_y1&\" to \"&FRCP_final_year,CRY))","v":"2022-23 to 2028-29"},"=IF(dms_MultiYear_Flag=1,dms_SpecifiedYear_Span,IF(dms_Model_Span>1,dms_Reset_Span,CRY))","NESTED IF - for Sheet Headers"]
[null,"ABC RINS THAT SPAN MULTIPLE YEARS"]
[null,"This is a multi year ABC RIN?","No"]
[null,null,{"$f":"IF(dms_MultiYear_ResponseFlag=\"No\",0,1)","v":0},"dms_MultiYear_Flag","This is set from the answer provided above"]
[null,null,{"$f":"IF(dms_MultiYear_Flag=1,FRY,\"not a Multiple year submission\")","v":"not a Multiple year submission"},"dms_Specified_FinalYear","The result here is returned to dms_CRCP_FinalYear_Result if response to Q in C73 is \"yes\" and dms_MultiYear_Flag is set to 1"]
[null," Start year for 5.2 in Multi year ABC RINS",{"$f":"IFERROR(IF(dms_MultiYear_Flag=1,FRY,CRY),\"not an ABC\")","v":"2022-23"},"dms_0502_Inst_Year","=IF(dms_MultiYear_Flag=1,FRY,CRY)",null,"For single year RINS this is CRY - multi year RINS need to start a the end of the span of years (ie. FRY)"]
[null,"WHAT IS THE RYE?"]
[null,"Reg Period Lengths"]
[null,"PRCP length in years",{"$f":"INDEX(dms_PRCPlength_List,MATCH(dms_TradingName,dms_TradingName_List))","v":5},"dms_PRCPlength_Num","=INDEX(dms_PRCPlength_List,MATCH(dms_TradingName,dms_TradingName_List))"]
[null,"CRCP length in years",{"$f":"INDEX(dms_CRCPlength_List,MATCH(dms_TradingName,dms_TradingName_List))","v":5},"dms_CRCPlength_Num","=INDEX(dms_CRCPlength_List,MATCH(dms_TradingName,dms_TradingName_List))"]
[null,"FRCP length in years",{"$f":"INDEX(dms_FRCPlength_List,MATCH(dms_TradingName,dms_TradingName_List))","v":5},"dms_FRCPlength_Num","=INDEX(dms_FRCPlength_List,MATCH(dms_TradingName,dms_TradingName_List))"]
[null,"Single year RIN?"]
[null,"Single Year ABC RIN ?",{"$f":"IF(dms_Model=\"EB\",1,0)","v":0},"dms_EB"]
[null,null,{"$f":"IF(dms_Model=\"CA\",1,0)","v":0},"dms_CA","=dms_SingleYear_Model"]
[null,null,{"$f":"IF(dms_Model=\"ARR\",1,0)","v":0},"dms_ARR"]
[null,"Is this a single Year ABC RIN?",{"$f":"IF(SUM(dms_SingleYear_Model)=1,\"yes\",\"no\")","v":"no"},"dms_SingleYearModel","=IF(SUM(dms_SingleYear_Model)=1,\"yes\",\"no\")"]
[null,"Single Year Final Year Result",{"$f":"IF(AND(dms_SingleYearModel=\"yes\",dms_MultiYear_Flag=0),CRY,0)","v":0},"dms_SingleYear_FinalYear_Result","=IFERROR(IF(SUM(dms_SingleYear_Model)<>0,(INDIRECT(dms_SingleYear_FinalYear_Ref)),\"not a single year RIN\"),\"CRY not present\")"]
[null,"Multi year RIN?"]
[]
[null,"Multi Year Reset/Model?",{"$f":"IF(dms_Model_Span>1,\"yes\",\"no\")","v":"yes"}]
[null,"Final year result for Reset/Model",{"$f":"IF(dms_Model_Span>1,dms_Reset_final_year,0)","v":"2028-29"},"dms_MultiYear_FinalYear_Result","dms_CRCP_FinalYear_Result"]
[]
[null,"Multi Year ABC RIN?",{"$f":"IF(dms_MultiYear_Flag=1,\"yes\",\"no\")","v":"no"},"dms_MultiYear_ABC_RIN"]
[null,"Final year result for ABC multi year",{"$f":"IF(dms_MultiYear_Flag=1,C50,0)","v":0}]
[]
[null,"EB RINS"]
[null,"Calendar Year for table 3.6 data",{"$f":"IFERROR(IF(dms_Segment=\"Transmission\",dms_Cal_Year_B4_CRY,CRY),\"CRY not present\")","v":"2022"},"dms_0306_Year","=IF(dms_Segment=\"Transmission\",dms_Cal_Year_B4_CRY,CRY)"]
[null,"CA RINS"]
[null,"Find how many rows in tables 6.3 sustained interruptions?",null,null,"dms_060301_MaxRows only returns a valid value when cover sheet is attached to a CA file"]
[null,null,{"$f":"IF(dms_Model<>\"CA\",\"not a CA\",\"Is a CA\")","v":"not a CA"},null,"=IF(dms_Model<>\"CA\",\"not a CA\",\"Is a CA\")"]
[null,"dms_060301_Avg_Duration_Sustained_Int_Values present?",{"$f":"IFERROR(IF(INDEX(dms_060301_Avg_Duration_Sustained_Int_Values,1,1)<>\"\",\"yes\",\"no\"),\"no\")","v":"no"},"dms_060301_checkvalue","=IFERROR(IF(INDEX(dms_060301_Avg_Duration_Sustained_Int_Values,1,1)<>\"\",\"yes\",\"no\"),\"no\")"]
[null,null,{"$f":"IF(AND(dms_Model=\"CA\",(dms_060301_checkvalue=\"no\")),\"error - NR not present\",\"no errors\")","v":"no errors"},null,"=IF(AND(dms_Model=\"CA\",(dms_060301_checkvalue=\"no\")),\"error - NR not present\",\"no errors\")"]
[null,"Table 6.3.1 - last row reference",{"$f":"IFERROR(IF(dms_Model=\"CA\",LOOKUP(2,1/(dms_060301_Avg_Duration_Sustained_Int_Values<>\"\"),(ROW(dms_060301_Avg_Duration_Sustained_Int_Values))),\"not a CA\"),\"6.3 not present\")","v":"not a CA"},"dms_060301_LastRow","=IFERROR(IF(dms_Model=\"CA\",LOOKUP(2,1/(dms_060301_Avg_Duration_Sustained_Int_Values<>\"\"),(ROW(dms_060301_Avg_Duration_Sustained_Int_Values))),\"not a CA\"),\"6.3 not present\")"]
[null,"Table 6.3.1 - max number rows",{"$f":"IFERROR(IF(dms_Model=\"CA\",(dms_060301_LastRow-15),\"not a CA\"),\"error\")","v":"not a CA"},"dms_060301_MaxRows","=IFERROR(IF(dms_Model=\"CA\",(dms_060301_LastRow-15),\"not a CA\"),\"error\")"]
[null,"Table 6.6.3 - Public lighting repair - no. business days",{"$f":"INDEX(dms_663_List,MATCH(dms_TradingName,dms_TradingName_List))","v":5},"dms_663","=INDEX(dms_663_List,MATCH(dms_TradingName,dms_TradingName_List))"]
[null,"ARR or RESET RINS"]
[null,"How many rows in tables 6.1 or 6.7?  (leap year?)","insert dms_LeapYear NR if required",null,"'dms_LeapYear is used to determine dms_060701_Max_Rows BUT it is only found on worksheet 6.1 or 6.7 and the date value in the cell is used to determine whether it is a leap year"]
[null,"Is dms_LeapYear named range present?",{"$f":"IFERROR(IF(dms_LeapYear,\"yes\"),\"no\")","v":"no"}]
[null,"Table 6.7.1 - includes a leap year?",{"$f":"\nIFERROR(IF(MONTH(DATE(YEAR(dms_LeapYear),2,29))=2,\"is a leap year\",\"not a leap year\"),\n\"dms_LeapYear not present\")","v":"dms_LeapYear not present"},"dms_LeapYear_Result","=IFERROR(IF(MONTH(DATE(YEAR(dms_LeapYear),2,29))=2,\"is a leap year\",\"not a leap year\"),\"dms_LeapYear not present\")"]
[null,"MaxRows if Reset and leap year",{"$f":"IF(dms_LeapYear_Result=\"is a leap year\",1827,1826)","v":1826},"dms_060701_Reset_MaxRows","=IF(dms_LeapYear_Result=\"is a leap year\",1827,1826)",null,null,"number of days present in Reset RIN table"]
[null,"MaxRows if ARR and leap year",{"$f":"IF(dms_LeapYear_Result=\"is a leap year\",366,365)","v":365},"dms_060701_ARR_MaxRows","=IF(dms_LeapYear_Result=\"is a leap year\",366,365)",null,null,"number of days present in ARR RIN table"]
[null,"Table 6.7.1 - Max Rows (leap year/ non leap year)",{"$f":"IF(dms_Model=\"ARR\",dms_060701_ARR_MaxRows,IF(dms_Model=\"Reset\",dms_060701_Reset_MaxRows,\"not a relevant RIN type\"))","v":1826},"dms_060701_MaxRows","=IF(dms_Model=\"ARR\",dms_060701_ARR_MaxRows,IF(dms_Model=\"Reset\",dms_060701_Reset_MaxRows,\"not a relevant RIN type\"))"]
[null,"How many columns in 6.7?   (4 or 5 feeder categories)",{"$f":"IF(dms_FifthFeeder_flag_NSP=\"NO\",\"This NSP has only 4 feeder categories\",\"This NSP has 5 feeder categories\")","v":"This NSP has only 4 feeder categories"}]
[null,"Table 6.7.1 - Last column (# of feeder categories > 4)",{"$f":"IF(dms_FifthFeeder_flag_NSP=\"NO\",10,12)","v":10},"dms_060701_MaxCols","=IF(dms_FifthFeeder_flag_NSP=\"NO\",8,10)"]
[null,"Table 6.7.1 - Number of offset rows",{"$f":"IF(dms_Model=\"ARR\",15,9)","v":9},"dms_060701_OffsetRows","=IF(dms_Model=\"ARR\",15,9)"]
[null,"Start date for telephone answering in 6.1 or 6.7?",null,null,"Using 060101 as naming standard not 060701 for start dates"]
[null,"Table 6.1.1 and 6.7.1 - Start Date as Text",{"$f":"IF(dms_SingleYearModel=\"yes\",(CONCATENATE(IF(LEN(CRY)=4,\"1-Jan-\",\"1-Jul-\"),LEFT(CRY,4))),(CONCATENATE(IF(LEN(PRCP_y4)=4,\"1-Jan-\",\"1-Jul-\"),LEFT(PRCP_y4,4))))","v":"1-Jul-2017"},"dms_060101_StartDateTxt","=IF(SUM(dms_SingleYear_Model)>1,(CONCATENATE(IF(LEN(CRY)=4,\"1-Jan-\",\"1-Jul-\"),LEFT(CRY,4))),(CONCATENATE(IF(LEN(CRCP_y4)=4,\"1-Jan-\",\"1-Jul-\"),LEFT(CRCP_y4,4))))"]
[null,"Table 6.1.1 and 6.7.1 - Start Date as Date Value",{"$f":"DATEVALUE(dms_060701_StartDateTxt)","v":42917},"dms_060101_StartDateVal","=DATEVALUE(dms_060701_StartDateTxt)"]
[null,"ARRs"]
[null,"How many rows in table 6.8?","insert dms_060801_StartCell NR if required",null,"dms_060801_StartCell is only found on worksheet 6.8 and is used to determine the starting date for the date range"]
[null,"Is dms_060801_StartCell named range present?",{"$f":"IFERROR(IF((ROW(dms_060801_StartCell)-1)=1,\"yes\",\"yes\"),\"no\")","v":"no"},"Must be present for ARRs","=IFERROR(IF((ROW(dms_060801_StartCell)-1)=1,\"yes\",\"yes\"),\"no\")"]
[null,"Table 6.8 - Number of offset rows",12,"dms_0608_OffsetRows","=IFERROR(IF(dms_Model=\"ARR\",(ROW(dms_060801_StartCell)-1),\"not an ARR\"),\"6.8 error\")"]
[null,"Table 6.8 - Last row",{"$f":"IFERROR(IF(dms_060801_StartCell<>\"\",IF(dms_Model=\"ARR\",(LOOKUP(2,1/(dms_060801_01_Values<>\"\"),(ROW(dms_060801_01_Values)))),\"not an ARR\"),0),\"0\")","v":"0"},"dms_0608_LastRow","=IFERROR(IF(dms_060801_StartCell<>\"\",IF(dms_Model=\"ARR\",(LOOKUP(2,1/(dms_060801_01_Values<>\"\"),(ROW(dms_060801_01_Values)))),\"not an ARR\"),0),\"0\")"]
[null,"Table 6.8 - MaxRows",{"$f":"IFERROR(IF(dms_Model=\"ARR\",(MAX(0,dms_0608_LastRow-dms_0608_OffsetRows)),\"not an ARR\"),\"0\")","v":"not an ARR"},"dms_060801_MaxRows","=IFERROR(IF(dms_Model=\"ARR\",(MAX(0,dms_0608_LastRow-dms_0608_OffsetRows)),\"not an ARR\"),\"0\")"]
[null,"TNSP RESET RINS"]
[null,"Table 7.9.4 only appears in TNSPs Reset RIN"]
[null,"Table 7.9.4 - first year",{"$f":"LEFT(PRCP_y3,4)","v":"2016"},"dms_070904_Start_Year","=LEFT(PRCP_y3,4)"]
[]
[null,"MISC"]
[null,"Distribution Determination Reference","-","dms_DeterminationRef"]
[null,"Public lighting NSP?",{"$f":"INDEX(dms_Public_Lighting_List,MATCH(dms_TradingName,dms_TradingName_List))","v":"NO"},"dms_Public_Lighting","=INDEX(dms_Public_Lighting_List,MATCH(dms_TradingName,dms_TradingName_List))"]
[null,"CBD Feeder for this business",{"$f":"INDEX(dms_CBD_flag,MATCH(dms_TradingName,dms_TradingName_List))","v":"NO"},"dms_CBD_flag_NSP"]
[null,"Urban Feeder for this business",{"$f":"INDEX(dms_Urban_flag,MATCH(dms_TradingName,dms_TradingName_List))","v":"NO"},"dms_Urban_flag_NSP"]
[null,"Short rural Feeder for this business",{"$f":"INDEX(dms_ShortRural_flag,MATCH(dms_TradingName,dms_TradingName_List))","v":"NO"},"dms_ShortRural_flag_NSP"]
[null,"Long rural Feeder for this business",{"$f":"INDEX(dms_LongRural_flag,MATCH(dms_TradingName,dms_TradingName_List))","v":"NO"},"dms_LongRural_flag_NSP"]
[null,"Fifth Feeder Category (eg. TasNetworks (D))",{"$f":"INDEX(dms_FeederType_5_flag,MATCH(dms_TradingName,dms_TradingName_List))","v":"NO"},"dms_FifthFeeder_flag_NSP","=INDEX(dms_FeederType_5_flag,MATCH(dms_TradingName,dms_TradingName_List))"]
[]
[null,"DISCARD FILES"]
[null,"discard this record?","NO","dms_DISCARD","If record is to be discarded from DB set this flag to YES"]
[]
[null,"SUBSET FILES"]
[null,"Is this Submission File a Subset File","NO","dms_Partial"]
[]
[]
[null,"REGULATORY YEARS FOR MULTI RYE SUBMISSIONS"]
[null,"Multiple RYE flag","NO","dms_Multi_RYE_flag"]
[null,null,"Manually specify RYE","Named ranges to apply"]
[null,null,2013,"dms_RYE_01"]
[null,null,2014,"dms_RYE_02"]
[null,null,2015,"dms_RYE_03"]
[null,null,2016,"dms_RYE_04"]
[null,null,2017,"dms_RYE_05"]
[null,null,2018,"dms_RYE_06"]
[null,null,2019,"dms_RYE_07"]
[null,null,2020,"dms_RYE_08"]
[null,null,2021,"dms_RYE_09"]