{"text_format":"1","workbook":"xlsx","n_sheets":6,"sheets":["Schema","Setup","MIC Template","Data Definitions","Valid Data Matrix","Data"],"not_rendered":{"charts":0,"images":1,"macros":1,"external_links":5,"defined_names":390,"comments":0,"pivot_tables":0},"unopened":[],"bounds":{"document_bytes":16777216,"sheet_cells":100000,"rows_first":2000,"rows_last":500,"rows_between":2000,"halvings":0,"cell_chars":16384,"cell_head_chars":4096},"cells_cut":0,"cells_raw":0,"read":"whole","date_system":"1900"}

{"sheet":"Schema","index":0,"n_rows":155,"n_cols":1,"rows_kept":155,"cut":false,"hidden":true,"merged":[]}
["<xs:schema xmlns:xs=\"http://www.w3.org/2001/XMLSchema\" xmlns:xdb=\"http://xmlns.oracle.com/xdb\" xdb:storeVarrayAsTable=\"true\">"]
[]
["<!--Define exclusion clause element-->"]
["<xs:simpleType name=\"extype\">"]
["<xs:restriction base=\"xs:string\">"]
["<xs:pattern value=\"[1-7]?|(3[aA])|(8\\([aA-fF]\\))|9|(10)|(11)|(12)|(99)|(INCLUDED)\" />"]
["</xs:restriction>"]
["</xs:simpleType>"]
[]
["<!--Define marginal value element-->"]
["<xs:simpleType name=\"mvtype\">"]
["<xs:restriction base=\"xs:decimal\">"]
["<xs:fractionDigits value=\"5\" />"]
["</xs:restriction>"]
["</xs:simpleType>"]
[]
["<!--Define TNSP element-->"]
["<xs:simpleType name=\"tnsptype\">"]
["<xs:restriction base=\"xs:string\">"]
["<xs:enumeration value=\"ELECTRANET\" />"]
["<xs:enumeration value=\"TRANSGRID\" />"]
["<xs:enumeration value=\"TASNETWORKS\" />"]
["<xs:enumeration value=\"POWERLINK\" />"]
["<xs:enumeration value=\"AUSNET SERVICES\" />"]
["<xs:enumeration value=\"MURRAYLINK\" />"]
["<xs:enumeration value=\"DIRECTLINK\" />"]
["</xs:restriction>"]
["</xs:simpleType>"]
[]
["<!--Define network condition classifications-->"]
{"$rows_left_out":126}
{"sheet":"Setup","index":1,"n_rows":8,"n_cols":8,"rows_kept":8,"cut":false,"hidden":true,"merged":[]}
["TNSP","SCHEME","ENUMERATORS","CDATA","SUBMISSION_ID","TEMPLATEVER","EXCELVER","OSVER"]
["AUSNET SERVICES",2,"NETWORK CONDITION","CONSTRAINTID",{"$f":"'MIC Template'!N15 & \"V\" & TRUNC(TEXT('MIC Template'!N16,\"#.#\"),1) & \"_\" &TEXT(IF(ISBLANK('MIC Template'!N69),NOW(),'MIC Template'!N69),\"YYYYMMDDHHMMSS\")","v":"TASNETWORKSV5_20230130160736"},"AERMIC_VER7",{"$f":"INFO(\"RELEASE\")","v":"16.0"},{"$f":"INFO(\"OSVERSION\")","v":"Windows (32-bit) NT :.00"}]
["DIRECTLINK",3,"CATEGORY","CONSTRAINTSET"]
["ELECTRANET",4,"ASSET CLASS","DESCRIPTION"]
["MURRAYLINK",4.0999999999999996,"OUTAGE TYPE","EQUIPMENT_NAME"]
["POWERLINK",5,"CODE","EXCLUSION_DETAIL"]
["TASNETWORKS",null,null,"TNSP_COMMENT"]
["TRANSGRID"]

{"sheet":"MIC Template","index":2,"n_rows":69,"n_cols":16,"rows_kept":69,"cut":false,"hidden":false,"merged":[[64,13,64,14],[65,13,65,14],[56,13,56,14],[57,13,57,14],[58,13,58,14],[59,13,59,14],[63,13,63,14],[61,13,61,14],[60,13,60,14],[62,13,62,14],[51,13,51,14],[52,13,52,14],[53,13,53,14],[54,13,54,14],[55,13,55,14],[45,13,45,14],[46,13,46,14],[47,13,47,14],[49,13,49,14],[50,13,50,14],[48,13,48,14],[58,10,58,12],[59,10,59,12],[63,10,63,12],[65,10,65,12],[64,10,64,12],[61,10,61,12],[60,10,60,12],[62,10,62,12],[53,10,53,12],[54,10,54,12],[55,10,55,12],[56,10,56,12],[57,10,57,12],[47,10,47,12],[49,10,49,12],[50,10,50,12],[51,10,51,12],[52,10,52,12],[48,10,48,12],[15,10,15,12],[16,10,16,12],[17,10,17,12],[14,13,14,15],[15,13,15,15],[16,13,16,15],[17,14,17,15],[0,5,0,22],[7,5,7,22],[13,13,13,15],[13,10,13,12],[14,10,14,12],[8,10,8,15],[39,10,39,12],[40,10,40,12],[68,10,68,12],[37,13,37,15],[39,13,39,15],[40,13,40,15],[68,13,68,15],[38,13,38,14],[38,10,38,12],[42,10,42,12],[42,13,42,15],[43,10,43,15],[44,10,44,12],[44,13,44,14],[45,10,45,12],[46,10,46,12],[18,14,18,15],[18,10,18,12],[29,11,34,15],[35,10,35,15],[37,10,37,12]]}
[]
[]
[]
[]
[]
[]
[]
[null,null,null,null,null,{"$f":"\"Market Impact Parameter Data Template V\" & RIGHT(Setup!$F$2,LEN(Setup!$F$2)-(FIND(\"VER\",Setup!$F$2)+2))","v":"Market Impact Parameter Data Template V7"}]
[]
[]
[null,null,null,null,null,null,null,null,null,"Steps for filling out this template"]
[null,null,null,null,null,null,null,null,null,1,"Complete  details in Table 1"]
[]
[null,null,null,null,null,null,null,null,null,null,"Table 1",null,null,"INPUT"]
[null,null,null,null,null,null,null,null,null,null,"TNSP",null,null,"TASNETWORKS"]
[null,null,null,null,null,null,null,null,null,null,"Scheme Version",null,null,5]
[null,null,null,null,null,null,null,null,null,null,"Performance Year",null,null,2021]
[null,null,null,null,null,null,null,null,null,null,"Performance Period",null,null,"From","2021-01-01"]
[null,null,null,null,null,null,null,null,null,null,null,null,null,"To","2021-12-31"]
[]
[null,null,null,null,null,null,null,null,null,2,"Enter data into the \"Data\" worksheet."]
[null,null,null,null,null,null,null,null,null,null,"Refer to the ","data definitions ","for valid data formats"]
[]
[null,null,null,null,null,null,null,null,null,3,"Complete the check list to confirm the following:"]
[null,null,null,null,null,null,null,null,null,null,"Data has been sourced from MCC constraint solution table and is on a 5-minute resolution"]
[null,null,null,null,null,null,null,null,null,null,"Evidence has been collated for all exclusion claims to be attached to the submission"]
[null,null,null,null,null,null,null,null,null,null,"All inclusion counts have a code of \"INCLUDED\" and a positive weighting"]
[]
[null,null,null,null,null,null,null,null,null,4,"Click Validate Data button"]
[null,null,null,null,null,null,null,null,null,null,null,"An error message will appear if data is invalid. The rows that contain invalid data will be highlighted yellow.  Errors will need to be amended in accordance with the data field requirements before validation can be completed. Data validation may take some time to complete. During validation, a progress indicator will appear to show progress of validation. "]
{"$rows_left_out":40}
{"sheet":"Data Definitions","index":3,"n_rows":58,"n_cols":4,"rows_kept":58,"cut":false,"hidden":false,"merged":[]}
["Template instructions and data definitions"]
["What must be submitted?","- TNSP must provide performance data in this workbook in the 'Data' tab. "]
[null,"- The data submitted must conform to the data field requirements set out below. "]
[null,"- Data must be validated prior to the data being submitted to the AER for assessment. "]
[null,"- If the data does not conform to the field requirements then the data will not be able to be validated. "]
[null,"- Submit ALL binding constraints with a marginal value > $10/MWh used to manage TNSP network."]
[null,"- The data must be submitted in a 5 minute resolution and sourced from AEMO's Market Management System MCC_CONSTRAINTSOLUTION table (MCC table).   "]
[null,"- For network outage conditions, if an exclusion is applicable, TNSPs may enter the exclusion clause number in the 'CODE' field. Otherwise the code INCLUDED must be used. "]
[null,"-  The data submitted must fall within the performance period defined in the MIC Template tab. The first valid date time is 00:05 of the day defined the ‘from’ input period. "]
[null,"The last valid date time is 00:00 of the following day defined in the ‘to’ input period."]
[]
["Calcuation of performance measure:","All dispatch intervals with a marginal value greater than $10/MWh, classified as an OUTAGE and identified as INCLUDED, will be used to calculate the TNSP's performance measure. "]
[]
["Data field requirements:","Field","Description","Accepted values"]
[null,"SETTLEMENT DATE","Settlement date/time of the binding network constraint as detailed in the AEMO Market Management System MCC_CONSTRAINTSOLUTION table (MCC table)","dd/mm/yyyy hh:mm\nFirst accepted time value for the performance period is 00:05\n"]
[null,"CONSTRAINT ID","Constraint identifier from the MCC table","text"]
[null,"CONSTRAINT SET","Constraint set refers to the GENCONSET for a constraint.  These are the constraint set(s) that contain the relevant constraint ID that were invoked at the time of the binding constraint. ","text. Multiple values allowed, delimit with semi-colon e.g. V_SET1;V_SET2"]
[null,"EFFECTIVE DATE","Effective date of the constraint ID for the settlement date/time","dd/mm/yyyy hh:mm"]
[null,"VERSION NUMBER","Version number of the binding network constraint for the settlement date/time","integer"]
[null,"MARGINAL VALUE","Marginal value up to 5 decimal places (to be consistent with the MCC table) of the  binding network constraint for the settlement date/time","decimal to 5 significant figures"]
[null,"CONSTRAINT DESCRIPTION","Description of the constraint ID from the MCC table","text"]
[null,"NETWORK CONDITION","Classification of the network constraint as \"System Normal\" or \"Outage\" ","SYSTEM NORMAL | OUTAGE"]
[null,"CATEGORY","Additional categorisation of the network constraint as one of:","Note: this field cannot be left blank"]
[null,null,"-negative residues management ","NRM"]
[null,null,"-network support agreement","NSA"]
[null,null,"-ramping constraint","RAMP"]
[null,null,"-frequency control constraint","FCAS "]
[null,null,"-reclassification","RECLASS"]
[null,null,"-non-conformance","NC"]
[null,null,"-AEMO direction","DIRECTION"]
{"$rows_left_out":29}
{"sheet":"Valid Data Matrix","index":4,"n_rows":33,"n_cols":12,"rows_kept":33,"cut":false,"hidden":false,"merged":[[29,0,29,10],[30,0,30,10],[31,0,31,10],[32,0,32,10],[6,0,7,0],[6,1,7,1],[6,2,6,10],[8,0,25,0]]}
["Valid category-code data matrix"]
["This matrix shows the valid entries for a specific category-code combination. For example:"]
["There is no valid entry for category=NRM (network residue management) and code=1 (force-majeure event)"]
["There is a valid combination for category=OTHER and code=1 (force-majeure event) and the weight must be zero. Evidence must be provided."]
["There is a valid combination for category=NRM (network residue management) and code=99 with weight=0"]
[]
["NETWORK CONDITION \n= OUTAGE","FIELD=Code","Field=Category"]
[null,null,"NRM","NSA","RAMP","FCAS","RECLASS","NC","DIRECTION","MII","OTHER","Comments"]
["STPIS exclusion clause",1,null,null,null,null,null,null,null,null,null,"Force majeure event"]
[null,2,null,null,null,null,null,null,null,null,null,"Reclassification must satisfy NER cl 4.2.3A and NER cl 4.2.3B"]
[null,3,null,null,null,null,null,null,null,null,null,"Version 4 and 4.1 allows only CODE=3 with OUTAGE_TYPE=UNPLANNED  \nVersion 2, 3 and 5 allow CODE=3 with both PLANNED or UNPLANNED outages  "]
[null,"3A",null,null,null,null,null,null,null,null,null,"This code is only applicable to version 5. Only allows CODE=3A with OUTAGE_TYPE=PLANNED"]
[null,4,null,null,null,null,null,null,null,null,null,"Outage on NON-REGULATED asset"]
[null,5,null,null,null,null,null,null,null,null,null,"Outage for PERSONAL SAFETY reasons"]
[null,6,null,null,null,null,null,null,null,null,null,"AEMO DIRECTION for operational security reasons"]
[null,7,null,null,null,null,null,null,null,null,null,"Network service agreement"]
[null,"8(a)",null,null,null,null,null,null,null,null,null,"Manifestly incorrect input must satisfy NER cl 3.9.2b"]
[null,"8(b)",null,null,null,null,null,null,null,null,null,"AEMO invoked wrong constraint"]
[null,"8(c)",null,null,null,null,null,null,null,null,null,"AEMO scheduling error"]
[null,"8(d)",null,null,null,null,null,null,null,null,null,"Must satisfy NER cl 3.12(a) "]
[null,"8(e)",null,null,null,null,null,null,null,null,null,"Must satisfy NER cl 3.14.3"]
[null,"8(f)",null,null,null,null,null,null,null,null,null,"Must satisfy NER cl 3.14.2"]
[null,9,null,null,null,null,null,null,null,null,null,"Network reconfiguration. This code is not applicable to version 2 and  3 "]
[null,10,null,null,null,null,null,null,null,null,null,"Ramping constraints. Applies to version 5 only."]
[null,11,null,null,null,null,null,null,null,null,null,"Transmission connection agreements. Applies to version 5 only."]
[null,12,null,null,null,null,null,null,null,null,null,"Internetwork power tests for NCIPAP. Applies to version 5 only."]
["Non-inclusion",99,null,null,null,null,null,null,null,null,null,"Field=FCAS or OTHER may be relevant to other TNSPs. '99' for RAMP category only applies to version 4.x and below"]
["Inclusion","INCLUDED",null,null,null,null,null,null,null,null,null,"The sum of the weights is the inclusion count"]
[]
["category-code combination is NOT valid"]
{"$rows_left_out":4}
{"sheet":"Data","index":5,"n_rows":1443,"n_cols":18,"rows_kept":1443,"cut":false,"hidden":false,"merged":[]}
["OUTAGE ID","SUBMISSION ID","SETTLEMENT DATE","CONSTRAINT ID","CONSTRAINT SET","EFFECTIVE DATE","VERSION NUMBER","MARGINAL VALUE","CONSTRAINT DESCRIPTION","NETWORK CONDITION","CATEGORY","OUTAGE EQUIPMENT","ASSET CLASS","CODE","EXCLUSION DETAIL","OUTAGE TYPE","WEIGHTING","TNSP COMMENT"]
[1,"TASNETWORKSV5_20230126103852","2021-02-02T07:45:00","V:T_SHGT_BL_1","T-GTSH","2014-10-20",1,-12.806380000000001,"Out = Sheffield to George Town 220 kV line, limit Basslink flow VIC to TAS at low TAS fault levels to avoid inverter commutation instability following trip of remaining Sheffield to George Town 220 kV line, Tamar CCGT out of service","OUTAGE","OTHER","Sheffield GeorgeTown 1 220kV LINE","REGULATED","INCLUDED",null,"PLANNED",1]
[2,"TASNETWORKSV5_20230126103852","2021-02-02T07:50:00","V:T_SHGT_BL_1","T-GTSH","2014-10-20",1,-14.022080000000001,"Out = Sheffield to George Town 220 kV line, limit Basslink flow VIC to TAS at low TAS fault levels to avoid inverter commutation instability following trip of remaining Sheffield to George Town 220 kV line, Tamar CCGT out of service","OUTAGE","OTHER","Sheffield GeorgeTown 1 220kV LINE","REGULATED","INCLUDED",null,"PLANNED",1]
[3,"TASNETWORKSV5_20230126103852","2021-02-02T07:55:00","V:T_SHGT_BL_1","T-GTSH","2014-10-20",1,-18.976230000000001,"Out = Sheffield to George Town 220 kV line, limit Basslink flow VIC to TAS at low TAS fault levels to avoid inverter commutation instability following trip of remaining Sheffield to George Town 220 kV line, Tamar CCGT out of service","OUTAGE","OTHER","Sheffield GeorgeTown 1 220kV LINE","REGULATED","INCLUDED",null,"PLANNED",1]
[4,"TASNETWORKSV5_20230126103852","2021-02-02T08:00:00","V:T_SHGT_BL_1","T-GTSH","2014-10-20",1,-18.085909999999998,"Out = Sheffield to George Town 220 kV line, limit Basslink flow VIC to TAS at low TAS fault levels to avoid inverter commutation instability following trip of remaining Sheffield to George Town 220 kV line, Tamar CCGT out of service","OUTAGE","OTHER","Sheffield GeorgeTown 1 220kV LINE","REGULATED","INCLUDED",null,"PLANNED",1]
[5,"TASNETWORKSV5_20230126103852","2021-02-02T08:10:00","V:T_SHGT_BL_1","T-GTSH","2014-10-20",1,-20.59938,"Out = Sheffield to George Town 220 kV line, limit Basslink flow VIC to TAS at low TAS fault levels to avoid inverter commutation instability following trip of remaining Sheffield to George Town 220 kV line, Tamar CCGT out of service","OUTAGE","OTHER","Sheffield GeorgeTown 1 220kV LINE","REGULATED","INCLUDED",null,"PLANNED",1]
[6,"TASNETWORKSV5_20230126103852","2021-02-02T08:20:00","V:T_SHGT_BL_1","T-GTSH","2014-10-20",1,-20.560099999999998,"Out = Sheffield to George Town 220 kV line, limit Basslink flow VIC to TAS at low TAS fault levels to avoid inverter commutation instability following trip of remaining Sheffield to George Town 220 kV line, Tamar CCGT out of service","OUTAGE","OTHER","Sheffield GeorgeTown 1 220kV LINE","REGULATED","INCLUDED",null,"PLANNED",1]
[7,"TASNETWORKSV5_20230126103852","2021-02-02T08:25:00","V:T_SHGT_BL_1","T-GTSH","2014-10-20",1,-27.644279999999998,"Out = Sheffield to George Town 220 kV line, limit Basslink flow VIC to TAS at low TAS fault levels to avoid inverter commutation instability following trip of remaining Sheffield to George Town 220 kV line, Tamar CCGT out of service","OUTAGE","OTHER","Sheffield GeorgeTown 1 220kV LINE","REGULATED","INCLUDED",null,"PLANNED",1]
[8,"TASNETWORKSV5_20230126103852","2021-02-02T08:30:00","V:T_SHGT_BL_1","T-GTSH","2014-10-20",1,-25.735130000000002,"Out = Sheffield to George Town 220 kV line, limit Basslink flow VIC to TAS at low TAS fault levels to avoid inverter commutation instability following trip of remaining Sheffield to George Town 220 kV line, Tamar CCGT out of service","OUTAGE","OTHER","Sheffield GeorgeTown 1 220kV LINE","REGULATED","INCLUDED",null,"PLANNED",1]
[9,"TASNETWORKSV5_20230126103852","2021-02-02T08:35:00","V:T_SHGT_BL_1","T-GTSH","2014-10-20",1,-28.87032,"Out = Sheffield to George Town 220 kV line, limit Basslink flow VIC to TAS at low TAS fault levels to avoid inverter commutation instability following trip of remaining Sheffield to George Town 220 kV line, Tamar CCGT out of service","OUTAGE","OTHER","Sheffield GeorgeTown 1 220kV LINE","REGULATED","INCLUDED",null,"PLANNED",1]
[10,"TASNETWORKSV5_20230126103852","2021-02-02T11:00:00","V:T_SHGT_BL_1","T-GTSH","2014-10-20",1,-32.866930000000004,"Out = Sheffield to George Town 220 kV line, limit Basslink flow VIC to TAS at low TAS fault levels to avoid inverter commutation instability following trip of remaining Sheffield to George Town 220 kV line, Tamar CCGT out of service","OUTAGE","OTHER","Sheffield GeorgeTown 1 220kV LINE","REGULATED","INCLUDED",null,"PLANNED",1]
[11,"TASNETWORKSV5_20230126103852","2021-02-02T11:05:00","V:T_SHGT_BL_1","T-GTSH","2014-10-20",1,-21.522220000000001,"Out = Sheffield to George Town 220 kV line, limit Basslink flow VIC to TAS at low TAS fault levels to avoid inverter commutation instability following trip of remaining Sheffield to George Town 220 kV line, Tamar CCGT out of service","OUTAGE","OTHER","Sheffield GeorgeTown 1 220kV LINE","REGULATED","INCLUDED",null,"PLANNED",1]
[12,"TASNETWORKSV5_20230126103852","2021-02-02T11:10:00","V:T_SHGT_BL_1","T-GTSH","2014-10-20",1,-60.367959999999997,"Out = Sheffield to George Town 220 kV line, limit Basslink flow VIC to TAS at low TAS fault levels to avoid inverter commutation instability following trip of remaining Sheffield to George Town 220 kV line, Tamar CCGT out of service","OUTAGE","OTHER","Sheffield GeorgeTown 1 220kV LINE","REGULATED","INCLUDED",null,"PLANNED",1]
[13,"TASNETWORKSV5_20230126103852","2021-02-02T11:15:00","V:T_SHGT_BL_1","T-GTSH","2014-10-20",1,-18.935839999999999,"Out = Sheffield to George Town 220 kV line, limit Basslink flow VIC to TAS at low TAS fault levels to avoid inverter commutation instability following trip of remaining Sheffield to George Town 220 kV line, Tamar CCGT out of service","OUTAGE","OTHER","Sheffield GeorgeTown 1 220kV LINE","REGULATED","INCLUDED",null,"PLANNED",1]
[14,"TASNETWORKSV5_20230126103852","2021-02-02T11:30:00","V:T_SHGT_BL_1","T-GTSH","2014-10-20",1,-38.585230000000003,"Out = Sheffield to George Town 220 kV line, limit Basslink flow VIC to TAS at low TAS fault levels to avoid inverter commutation instability following trip of remaining Sheffield to George Town 220 kV line, Tamar CCGT out of service","OUTAGE","OTHER","Sheffield GeorgeTown 1 220kV LINE","REGULATED","INCLUDED",null,"PLANNED",1]
[15,"TASNETWORKSV5_20230126103852","2021-02-02T11:35:00","V:T_SHGT_BL_1","T-GTSH","2014-10-20",1,-60.442830000000001,"Out = Sheffield to George Town 220 kV line, limit Basslink flow VIC to TAS at low TAS fault levels to avoid inverter commutation instability following trip of remaining Sheffield to George Town 220 kV line, Tamar CCGT out of service","OUTAGE","OTHER","Sheffield GeorgeTown 1 220kV LINE","REGULATED","INCLUDED",null,"PLANNED",1]
[16,"TASNETWORKSV5_20230126103852","2021-02-02T11:40:00","V:T_SHGT_BL_1","T-GTSH","2014-10-20",1,-38.862879999999997,"Out = Sheffield to George Town 220 kV line, limit Basslink flow VIC to TAS at low TAS fault levels to avoid inverter commutation instability following trip of remaining Sheffield to George Town 220 kV line, Tamar CCGT out of service","OUTAGE","OTHER","Sheffield GeorgeTown 1 220kV LINE","REGULATED","INCLUDED",null,"PLANNED",1]
[17,"TASNETWORKSV5_20230126103852","2021-02-02T11:45:00","V:T_SHGT_BL_1","T-GTSH","2014-10-20",1,-24.57057,"Out = Sheffield to George Town 220 kV line, limit Basslink flow VIC to TAS at low TAS fault levels to avoid inverter commutation instability following trip of remaining Sheffield to George Town 220 kV line, Tamar CCGT out of service","OUTAGE","OTHER","Sheffield GeorgeTown 1 220kV LINE","REGULATED","INCLUDED",null,"PLANNED",1]
[18,"TASNETWORKSV5_20230126103852","2021-02-02T11:50:00","V:T_SHGT_BL_1","T-GTSH","2014-10-20",1,-22.767800000000001,"Out = Sheffield to George Town 220 kV line, limit Basslink flow VIC to TAS at low TAS fault levels to avoid inverter commutation instability following trip of remaining Sheffield to George Town 220 kV line, Tamar CCGT out of service","OUTAGE","OTHER","Sheffield GeorgeTown 1 220kV LINE","REGULATED","INCLUDED",null,"PLANNED",1]
[19,"TASNETWORKSV5_20230126103852","2021-02-02T11:55:00","V:T_SHGT_BL_1","T-GTSH","2014-10-20",1,-67.223789999999994,"Out = Sheffield to George Town 220 kV line, limit Basslink flow VIC to TAS at low TAS fault levels to avoid inverter commutation instability following trip of remaining Sheffield to George Town 220 kV line, Tamar CCGT out of service","OUTAGE","OTHER","Sheffield GeorgeTown 1 220kV LINE","REGULATED","INCLUDED",null,"PLANNED",1]
[20,"TASNETWORKSV5_20230126103852","2021-02-02T12:00:00","V:T_SHGT_BL_1","T-GTSH","2014-10-20",1,-65.249600000000001,"Out = Sheffield to George Town 220 kV line, limit Basslink flow VIC to TAS at low TAS fault levels to avoid inverter commutation instability following trip of remaining Sheffield to George Town 220 kV line, Tamar CCGT out of service","OUTAGE","OTHER","Sheffield GeorgeTown 1 220kV LINE","REGULATED","INCLUDED",null,"PLANNED",1]
[21,"TASNETWORKSV5_20230126103852","2021-02-02T12:05:00","V:T_SHGT_BL_1","T-GTSH","2014-10-20",1,-34.417900000000003,"Out = Sheffield to George Town 220 kV line, limit Basslink flow VIC to TAS at low TAS fault levels to avoid inverter commutation instability following trip of remaining Sheffield to George Town 220 kV line, Tamar CCGT out of service","OUTAGE","OTHER","Sheffield GeorgeTown 1 220kV LINE","REGULATED","INCLUDED",null,"PLANNED",1]
[22,"TASNETWORKSV5_20230126103852","2021-02-02T12:10:00","V:T_SHGT_BL_1","T-GTSH","2014-10-20",1,-22.91056,"Out = Sheffield to George Town 220 kV line, limit Basslink flow VIC to TAS at low TAS fault levels to avoid inverter commutation instability following trip of remaining Sheffield to George Town 220 kV line, Tamar CCGT out of service","OUTAGE","OTHER","Sheffield GeorgeTown 1 220kV LINE","REGULATED","INCLUDED",null,"PLANNED",1]
[23,"TASNETWORKSV5_20230126103852","2021-02-02T13:45:00","V:T_SHGT_BL_1","T-GTSH","2014-10-20",1,-46.207180000000001,"Out = Sheffield to George Town 220 kV line, limit Basslink flow VIC to TAS at low TAS fault levels to avoid inverter commutation instability following trip of remaining Sheffield to George Town 220 kV line, Tamar CCGT out of service","OUTAGE","OTHER","Sheffield GeorgeTown 1 220kV LINE","REGULATED","INCLUDED",null,"PLANNED",1]
[24,"TASNETWORKSV5_20230126103852","2021-02-02T13:50:00","V:T_SHGT_BL_1","T-GTSH","2014-10-20",1,-69.055139999999994,"Out = Sheffield to George Town 220 kV line, limit Basslink flow VIC to TAS at low TAS fault levels to avoid inverter commutation instability following trip of remaining Sheffield to George Town 220 kV line, Tamar CCGT out of service","OUTAGE","OTHER","Sheffield GeorgeTown 1 220kV LINE","REGULATED","INCLUDED",null,"PLANNED",1]
[25,"TASNETWORKSV5_20230126103852","2021-02-20T12:05:00","F_T++COGT_TL_L6","F-T-COGT","2016-04-12",1,12.46611,"Out = one Comalco to George Town line, Tasmania Lower 6 sec requirement for the loss of the remaining Comalco to George Town line, Basslink able to transfer FCAS, reduce by very fast response on Basslink","OUTAGE","FCAS","GeorgeTown Comalco 5 220kV LINE","REGULATED","INCLUDED",null,"PLANNED",1]
[26,"TASNETWORKSV5_20230126103852","2021-02-20T12:25:00","F_T++COGT_TL_L6","F-T-COGT","2016-04-12",1,14.991110000000001,"Out = one Comalco to George Town line, Tasmania Lower 6 sec requirement for the loss of the remaining Comalco to George Town line, Basslink able to transfer FCAS, reduce by very fast response on Basslink","OUTAGE","FCAS","GeorgeTown Comalco 5 220kV LINE","REGULATED","INCLUDED",null,"PLANNED",1]
[27,"TASNETWORKSV5_20230126103852","2021-02-28T12:45:00","T::T_HA_GT_PM_4","T-GTHA","2014-07-31",1,-56.22,"Out = Hadspen to George Town or Hadspen to Palmerston 220 kV line, prevent poorly damped TAS North - South oscillations following fault and trip of Palmerston to Sheffield 220 kV line, Tamar CCGT out of service.","OUTAGE","OTHER","Hadspen GeorgeTown 2 220kV LINE","REGULATED","INCLUDED",null,"UNPLANNED",1]
[28,"TASNETWORKSV5_20230126103852","2021-02-28T12:50:00","T::T_HA_GT_PM_4","T-GTHA","2014-07-31",1,-56.22,"Out = Hadspen to George Town or Hadspen to Palmerston 220 kV line, prevent poorly damped TAS North - South oscillations following fault and trip of Palmerston to Sheffield 220 kV line, Tamar CCGT out of service.","OUTAGE","OTHER","Hadspen GeorgeTown 2 220kV LINE","REGULATED","INCLUDED",null,"UNPLANNED",1]
[29,"TASNETWORKSV5_20230126103852","2021-02-28T12:55:00","T::T_HA_GT_PM_4","T-GTHA","2014-07-31",1,-64.991979999999998,"Out = Hadspen to George Town or Hadspen to Palmerston 220 kV line, prevent poorly damped TAS North - South oscillations following fault and trip of Palmerston to Sheffield 220 kV line, Tamar CCGT out of service.","OUTAGE","OTHER","Hadspen GeorgeTown 2 220kV LINE","REGULATED","INCLUDED",null,"UNPLANNED",1]
{"$rows_left_out":1413}