{"text_format":"1","workbook":"xlsx","n_sheets":9,"sheets":["Cover Sheet","Price Comparison","Smoothed Prices with Price Path","Smoothed Prices","Unsmoothed Prices","General Inputs","Volumes Input","RAB Input","Overhead & NonNetwork Input"],"not_rendered":{"charts":0,"images":1,"macros":1,"external_links":1,"defined_names":74,"comments":2,"pivot_tables":0},"unopened":[],"bounds":{"document_bytes":16777216,"sheet_cells":100000,"rows_first":2000,"rows_last":500,"rows_between":2000,"halvings":0,"cell_chars":16384,"cell_head_chars":4096},"cells_cut":0,"cells_raw":0,"read":"whole","date_system":"1900"}

{"sheet":"Cover Sheet","index":0,"n_rows":29,"n_cols":4,"rows_kept":29,"cut":false,"hidden":false,"merged":[[23,1,26,5],[30,1,33,5]]}
[]
[null,null,"Model Details"]
[]
[null,null,"Model Name:","TasNetworks (Public Lighting Model)"]
[]
[null,null,"Created By:"]
[null,null,"Phone Number:"]
[null,null,"Email:"]
[]
[null,null,"Date:"]
[]
[null,null,"Customer Details:"]
[]
[]
[]
[]
[]
[]
[]
[null,"Model Description/Scope"]
[]
[null,"Model Description"]
[]
[]
[]
[]
[]
[]
[null,"Scope/Disclaimer"]

{"sheet":"Price Comparison","index":1,"n_rows":86,"n_cols":17,"rows_kept":86,"cut":false,"hidden":false,"merged":[[1,4,1,6],[1,7,1,16]]}
[]
[null,null,null,null,"Annual Pricing Model Cents per day (Nominal)",null,null,"Annuity Model 2024-2029 cents per day (Nominal)"]
["Light Type","Contract/Public","2019–20","2020–21","2021–22","2022–23","2023–24","2024-25","2025-26","2026-27","2027-28","2028-29","2029-30","2030-31","2031-32","2032-33","2033-34"]
["50W Mercury Vapour","Contract Lighting",18.507999999999999,19.170000000000002,19.66,20.48,21.33,16.952732590315108,17.702564512399793,18.485562055919363,19.303192160880986,20.156986651135163,21.048545104236151,21.979537848238508,22.951709091044112,23.96688018816258,25.02695305500707]
["80W Mercury Vapour","Contract Lighting",18.471,19.13,19.62,20.440000000000001,21.29,16.937573316434648,17.686734732604691,18.46903211323626,19.285931086586626,20.138962106736706,21.029723320885275,21.959883563465695,22.931185482694712,23.945448805410749,25.004573746318453]
["125W Mercury Vapour","Contract Lighting",21.625,22.4,22.98,23.94,24.94,19.832994627602098,20.710222673469229,21.626251165708933,22.582796276810001,23.581650086841851,24.624683940903047,25.713851955072258,26.851194677430062,28.038842911010395,29.279021705844009]
["250W Mercury Vapour","Contract Lighting",21.625,22.4,22.98,23.94,24.94,20.150173281100912,21.041430373797525,21.972108428001551,22.943951062045908,23.958779015794168,25.018493561782964,26.125080067241807,27.28061171366366,28.487253380894852,29.747265703021196]
["400W Mercury Vapour","Contract Lighting",21.760999999999999,22.54,23.12,24.08,25.08,21.134359985339866,22.069148385110321,23.045283168350704,24.064593116233802,25.128987898278559,26.24046165010153,27.401096709414961,28.613067517270842,29.878644691859858,31.200199282497461]
["70W Sodium Vapour","Contract Lighting",18.919,19.600000000000001,20.100000000000001,20.94,21.81,18.022044447882788,18.819172825638933,19.651558782104395,20.520761786106455,21.42841028293396,22.376204745217336,23.365920858751277,24.399412849228689,25.478616956118625,26.60555506019632]
["100W Sodium Vapour","Contract Lighting",22.51,23.31,23.91,24.9,25.94,21.559985751983493,22.51359989474204,23.509393097530133,24.549230971421693,25.635061644850598,26.768919413414654,27.952928551113065,29.189307290157835,30.4803719768151,31.828541411062435]
["150W Sodium Vapour","Contract Lighting",22.748999999999999,23.56,24.17,25.18,26.23,20.753045942346812,21.670968539495053,22.629491533168036,23.63041070898328,24.675601281486617,25.767021407352509,26.906715853975832,28.096819830328243,29.339562987256112,30.637273594714593]
["250W Sodium Vapour","Contract Lighting",22.907,23.73,24.34,25.35,26.4,21.549490870066254,22.502640816422353,23.497949291057218,24.537280996910212,25.622583114113208,26.755888948017891,27.939321738578045,29.175098638223634,30.465534865679214,31.813048043508775]
["400W Sodium Vapour","Contract Lighting",22.960999999999999,23.78,24.39,25.4,26.46,21.852676347675409,22.819236412324397,23.828548144719274,24.882502482797474,25.983074002082329,27.132324615035454,28.332407434034227,29.585570805211631,30.894162520715827,32.260634217281087]
["250W Sodium Vapour - Flood Light","Contract Lighting",22.907,23.73,24.34,25.35,26.4,22.111550101633998,23.089560344209989,24.110828704384573,25.177268520747372,26.290877760271353,27.453742761488918,28.668042143231432,29.936050886255224,31.260144595400934,32.642803950271286]
["400W Sodium Vapour - Flood Light","Contract Lighting",22.960999999999999,23.78,24.39,25.4,26.46,21.852676347675409,22.819236412324397,23.828548144719274,24.882502482797474,25.983074002082329,27.132324615035454,28.332407434034227,29.585570805211631,30.894162520715827,32.260634217281087]
["1x20W Fluorescent","Contract Lighting",18.547000000000001,19.21,19.7,20.52,21.37,17.273409537786332,18.037425238834651,18.835233920369618,19.668330270954055,20.538275090333279,21.446698213581655,22.395301564586394,23.385862344589107,24.420236361758995,25.500361508035471]
["1x40W Fluorescent","Contract Lighting",18.564,19.22,19.71,20.53,21.38,17.273409537786332,18.037425238834651,18.835233920369618,19.668330270954055,20.538275090333279,21.446698213581655,22.395301564586394,23.385862344589107,24.420236361758995,25.500361508035471]
["2x20W Fluorescent","Contract Lighting",18.809999999999999,19.48,19.98,20.81,21.68,17.273409537786332,18.037425238834651,18.835233920369618,19.668330270954055,20.538275090333279,21.446698213581655,22.395301564586394,23.385862344589107,24.420236361758995,25.500361508035471]
["2x24W Fluorescent","Contract Lighting",18.689,19.36,19.86,20.69,21.55,17.273409537786332,18.037425238834651,18.835233920369618,19.668330270954055,20.538275090333279,21.446698213581655,22.395301564586394,23.385862344589107,24.420236361758995,25.500361508035471]
["2x40W Fluorescent","Contract Lighting",18.844000000000001,19.510000000000002,20.010000000000002,20.84,21.71,17.273409537786332,18.037425238834651,18.835233920369618,19.668330270954055,20.538275090333279,21.446698213581655,22.395301564586394,23.385862344589107,24.420236361758995,25.500361508035471]
["4x40W Fluorescent","Contract Lighting",22.602,23.41,24.01,25.01,26.05,17.273409537786332,18.037425238834651,18.835233920369618,19.668330270954055,20.538275090333279,21.446698213581655,22.395301564586394,23.385862344589107,24.420236361758995,25.500361508035471]
["32W Compact Fluorescent","Contract Lighting",18.667000000000002,19.34,19.84,20.67,21.53,17.273409537786332,18.037425238834651,18.835233920369618,19.668330270954055,20.538275090333279,21.446698213581655,22.395301564586394,23.385862344589107,24.420236361758995,25.500361508035471]
["42W Compact Fluorescent","Contract Lighting",18.667000000000002,19.34,19.84,20.67,21.53,17.273409537786332,18.037425238834651,18.835233920369618,19.668330270954055,20.538275090333279,21.446698213581655,22.395301564586394,23.385862344589107,24.420236361758995,25.500361508035471]
["60W Incandescent","Contract Lighting",18.396000000000001,19.059999999999999,19.55,20.36,21.21,18.022044447882788,18.819172825638933,19.651558782104395,20.520761786106455,21.42841028293396,22.376204745217336,23.365920858751277,24.399412849228689,25.478616956118625,26.60555506019632]
["100W Incandescent","Contract Lighting",21.594999999999999,22.37,22.95,23.9,24.89,21.573978927873146,22.528211999168288,23.524651506160691,24.565164270770339,25.651699685833794,26.786293367277004,27.971070967826432,29.208252159403436,30.500154791662947,31.849199234467317]
["100W Metal Halide","Contract Lighting",22.75,23.56,24.17,25.18,26.23,21.156515847165153,22.09228421711855,23.069442315349086,24.089820840202492,25.155331463168611,26.267970410383583,27.429822202544457,28.64306356024305,29.909967482035619,31.232907502888523]
["150W Metal Halide","Contract Lighting",22.562000000000001,23.37,23.97,24.97,26.01,23.140048529523526,24.163550019539244,25.232321738730487,26.348366022872629,27.513773772535849,28.73072837037159,30.001509771663564,31.328498775806803,32.714181486717443,34.161153970529661]
["250W Metal Halide","Contract Lighting",22.562000000000001,23.37,23.97,24.97,26.01,22.195509156971916,23.177232970767477,24.202379156167911,25.272868316839226,26.390706006170493,27.557986484663012,28.776896643511606,30.04972010172882,31.378841484487996,32.766750890700543]
["400W Metal Halide","Contract Lighting",23.187000000000001,24.02,24.64,25.67,26.74,21.659104081201871,22.617102301094633,23.617473491996581,24.662091841807914,25.752914435148202,26.891984919939627,28.081437336166051,29.323500113980835,30.620500248653993,31.974867660180305]
["400W Metal Halide - Flood Light","Contract Lighting",23.187000000000001,24.02,24.64,25.67,26.74,21.659104081201871,22.617102301094633,23.617473491996581,24.662091841807914,25.752914435148202,26.891984919939627,28.081437336166051,29.323500113980835,30.620500248653993,31.974867660180305]
["LED 18","Contract Lighting",13.471,13.95,14.31,14.91,15.53,11.607339400467504,12.120740621572949,12.656849959046728,13.216671809699363,13.801254995556434,14.411694728818729,15.049134663734085,15.714769039225008,16.40984491628631,17.135664514344505]
["LED 20","Contract Lighting",0,0,0,0,0,11.607339400467504,12.120740621572949,12.656849959046728,13.216671809699363,13.801254995556434,14.411694728818729,15.049134663734085,15.714769039225008,16.40984491628631,17.135664514344505]
["LED 200","Contract Lighting",0,0,0,0,0,12.578699026807612,13.135064203828351,13.716037824817869,14.322708339484334,14.9562123404729,15.617736692763474,16.308520757253319,17.029858712690388,17.783101980307453,18.569661755699631]
["LED 240","Contract Lighting",0,0,0,0,0,12.578699026807612,13.135064203828351,13.716037824817869,14.322708339484334,14.9562123404729,15.617736692763474,16.308520757253319,17.029858712690388,17.783101980307453,18.569661755699631]
["LED 25","Contract Lighting",13.471,13.95,14.31,14.91,15.53,11.607339400467504,12.120740621572949,12.656849959046728,13.216671809699363,13.801254995556434,14.411694728818729,15.049134663734085,15.714769039225008,16.40984491628631,17.135664514344505]
["LED 265","Contract Lighting",0,0,0,0,0,12.578699026807612,13.135064203828351,13.716037824817869,14.322708339484334,14.9562123404729,15.617736692763474,16.308520757253319,17.029858712690388,17.783101980307453,18.569661755699631]
["LED 30","Contract Lighting",13.471,13.95,14.31,14.91,15.53,11.607339400467504,12.120740621572949,12.656849959046728,13.216671809699363,13.801254995556434,14.411694728818729,15.049134663734085,15.714769039225008,16.40984491628631,17.135664514344505]
["LED 75","Contract Lighting",0,0,0,0,0,12.104097144550201,12.639470328704764,13.198523465431487,13.782303936576188,14.391905450459689,15.028470090932124,15.693190457058446,16.387311897443794,17.112134843384759,17.869017245217595]
["LED 155","Contract Lighting",0,0,0,0,0,12.578699026807612,13.135064203828351,13.716037824817869,14.322708339484334,14.9562123404729,15.617736692763474,16.308520757253319,17.029858712690388,17.783101980307453,18.569661755699631]
["LED 14","Contract Lighting",13.07,13.54,13.89,14.47,15.07,11.607339400467504,12.120740621572949,12.656849959046728,13.216671809699363,13.801254995556434,14.411694728818729,15.049134663734085,15.714769039225008,16.40984491628631,17.135664514344505]
["LED 17","Contract Lighting",13.471,13.95,14.31,14.91,15.53,11.607339400467504,12.120740621572949,12.656849959046728,13.216671809699363,13.801254995556434,14.411694728818729,15.049134663734085,15.714769039225008,16.40984491628631,17.135664514344505]
["LED 175","Contract Lighting",0,0,0,0,0,12.578699026807612,13.135064203828351,13.716037824817869,14.322708339484334,14.9562123404729,15.617736692763474,16.308520757253319,17.029858712690388,17.783101980307453,18.569661755699631]
["LED 14 New Tech","Contract Lighting",13.07,13.54,13.89,14.47,15.07,11.607339400467504,12.120740621572949,12.656849959046728,13.216671809699363,13.801254995556434,14.411694728818729,15.049134663734085,15.714769039225008,16.40984491628631,17.135664514344505]
["LED 75 New Tech","Contract Lighting",13.743,14.23,14.6,15.21,15.84,12.104097144550201,12.639470328704764,13.198523465431487,13.782303936576188,14.391905450459689,15.028470090932124,15.693190457058446,16.387311897443794,17.112134843384759,17.869017245217595]
[]
["50W Mercury Vapour","Public Lighting",37.039000000000001,38.36,39.35,40.99,42.7,39.978503516739792,41.746782345791338,43.593273457500302,45.521436239073033,47.534883088974965,49.637386184731902,51.832884550076294,54.125491434678537,56.519502020289316,59.019401467730269]
["80W Mercury Vapour","Public Lighting",37.024999999999999,38.35,39.340000000000003,40.98,42.69,39.963344242859336,41.730952565996233,43.576743514817196,45.504175164778673,47.516858544576507,49.618564401381022,51.813230265303474,54.10496782632913,56.498070637537481,58.997022159041641]
["125W Mercury Vapour","Public Lighting",45.521999999999998,47.15,48.36,50.37,52.47,43.264567654826735,45.17819153522197,47.176456417576013,49.263106036112696,51.442049713194166,53.717369683406915,56.093328741597546,58.574378229186877,61.165166373724595,63.870546997308594]
["250W Mercury Vapour","Public Lighting",45.912999999999997,47.55,48.77,50.8,52.91,43.581746308325549,45.509399235550276,47.522313679868638,49.624260821348606,51.819178642146483,54.111179304286829,56.504556853767085,59.003795265420457,61.613576843609039,64.338790994485777]
["400W Mercury Vapour","Public Lighting",47.292000000000002,48.98,50.24,52.33,54.51,47.464852617704366,49.564258213834172,51.7565220748481,54.045751390597033,56.436235014981818,58.932451501088757,61.539077491725152,64.2609964810744,67.103307963885655,70.071336989338818]
["70W Sodium Vapour","Public Lighting",39.271999999999998,40.67,41.72,43.46,45.27,41.017496826546555,42.831731099440269,44.726210298319124,46.70448371570977,48.770257631976833,50.927402259011316,53.179958991043428,55.532147976164296,57.988376022741683,60.553244855542275]
["100W Sodium Vapour","Public Lighting",45.517000000000003,47.15,48.36,50.37,52.47,45.470825053428754,47.482033333093781,49.582198844993776,51.775256233415398,54.065314174877173,56.456663075703965,58.953783110070994,61.56135261357641,64.284256848067912,67.127597154143984]
["150W Sodium Vapour","Public Lighting",47.847000000000001,49.56,50.84,52.96,55.16,45.681888789764358,47.702432574856367,49.812346508504675,52.015583498590772,54.316271293040302,56.718720213127746,59.227431228830881,61.847104391364219,64.582647638689565,67.439185990500874]
["250W Sodium Vapour","Public Lighting",48.945999999999998,50.7,52.01,54.17,56.42,47.175660315984871,49.262274722358377,51.441181629816604,53.716463204058421,56.092382167995886,58.573389787933543,61.164134212982333,63.869469183332008,66.694463123696892,69.644408638971399]
["400W Sodium Vapour","Public Lighting",49.493000000000002,51.26,52.58,54.77,57.05,48.001257693474415,50.124388883507024,52.341427739019444,54.656527865628355,57.074026586004116,59.598453065812144,62.234536799070703,64.987216468822382,67.861649199719665,70.863220219859045]
["250W Sodium Vapour - Flood Light","Public Lighting",52.247,54.12,55.51,57.82,60.23,48.939966576072003,51.104617555434508,53.365012651319276,55.72538669693315,58.190161835293139,60.763955804078066,63.451590586925427,66.258101447381364,69.188746362429157,72.249015873269457]
["400W Sodium Vapour - Flood Light","Public Lighting",51.67,53.52,54.9,57.18,59.56,48.001257693474415,50.124388883507024,52.341427739019444,54.656527865628355,57.074026586004116,59.598453065812144,62.234536799070703,64.987216468822382,67.861649199719665,70.863220219859045]
["1x20W Fluorescent","Public Lighting",40.720999999999997,42.17,43.26,45.06,46.94,42.189425307305029,44.055494845138568,46.004102021128254,48.038897536158629,50.163693564319047,52.382470894983086,54.699386390787545,57.118780775483295,59.645186766248614,62.283337565700634]
["1x40W Fluorescent","Public Lighting",39.768000000000001,41.19,42.25,44.01,45.84,42.189425307305029,44.055494845138568,46.004102021128254,48.038897536158629,50.163693564319047,52.382470894983086,54.699386390787545,57.118780775483295,59.645186766248614,62.283337565700634]
["2x20W Fluorescent","Public Lighting",40.984000000000002,42.44,43.53,45.34,47.23,42.189425307305029,44.055494845138568,46.004102021128254,48.038897536158629,50.163693564319047,52.382470894983086,54.699386390787545,57.118780775483295,59.645186766248614,62.283337565700634]
["2x24W Fluorescent","Public Lighting",40.951000000000001,42.41,43.5,45.31,47.2,42.189425307305029,44.055494845138568,46.004102021128254,48.038897536158629,50.163693564319047,52.382470894983086,54.699386390787545,57.118780775483295,59.645186766248614,62.283337565700634]
["2x40W Fluorescent","Public Lighting",40.048999999999999,41.48,42.55,44.32,46.16,42.189425307305029,44.055494845138568,46.004102021128254,48.038897536158629,50.163693564319047,52.382470894983086,54.699386390787545,57.118780775483295,59.645186766248614,62.283337565700634]
["4x40W Fluorescent","Public Lighting",47.491999999999997,49.19,50.46,52.56,54.75,42.189425307305029,44.055494845138568,46.004102021128254,48.038897536158629,50.163693564319047,52.382470894983086,54.699386390787545,57.118780775483295,59.645186766248614,62.283337565700634]
["32W Compact Fluorescent","Public Lighting",39.01,40.4,41.44,43.16,44.96,42.189425307305029,44.055494845138568,46.004102021128254,48.038897536158629,50.163693564319047,52.382470894983086,54.699386390787545,57.118780775483295,59.645186766248614,62.283337565700634]
["42W Compact Fluorescent","Public Lighting",39.03,40.42,41.46,43.19,44.99,42.189425307305029,44.055494845138568,46.004102021128254,48.038897536158629,50.163693564319047,52.382470894983086,54.699386390787545,57.118780775483295,59.645186766248614,62.283337565700634]
["60W Incandescent","Public Lighting",36.548999999999999,37.86,38.83,40.450000000000003,42.13,41.017496826546555,42.831731099440269,44.726210298319124,46.70448371570977,48.770257631976833,50.927402259011316,53.179958991043428,55.532147976164296,57.988376022741683,60.553244855542275]
["100W Incandescent","Public Lighting",42.463000000000001,43.98,45.11,46.99,48.95,44.974067309346061,46.96330362596197,49.040525338609015,51.209624106538577,53.474663719973918,55.839887713590578,58.309727316746638,60.888809755357627,63.581966920969478,66.394244423270919]
["100W Metal Halide","Public Lighting",45.884999999999998,47.53,48.75,50.78,52.89,44.631234500049551,46.605307067518893,48.666694327160386,50.819258272496832,53.067031715885769,55.414225843963024,57.865238107269263,60.424660458840442,63.09728795719731,65.888127749851463]
["150W Metal Halide","Public Lighting",48.006999999999998,49.72,51,53.12,55.33,47.968606949731893,50.090293973179108,52.30582478554814,54.619350167148184,57.035204490376671,59.557913840133331,62.192204493406187,64.943011773915984,67.815489298408025,70.815018631914342]
["250W Metal Halide","Public Lighting",48.831000000000003,50.57,51.87,54.03,56.28,46.963430481658456,49.040657805226942,51.209762432253157,53.474808163937332,55.840038546417503,58.309884821021242,60.888974226163,63.582138666440407,66.394423765171254,69.33109831733077]
["400W Metal Halide","Public Lighting",53.069000000000003,54.97,56.39,58.74,61.18,56.024011870209037,58.501995421222695,61.089582020538572,63.791619492183663,66.613170083033282,69.559519946892394,72.63618904806512,75.848941502966241,79.20379637915002,82.707038971987856]
["400W Metal Halide - Flood Light","Public Lighting",53.069000000000003,54.97,56.39,58.74,61.18,47.628106336416991,49.73473276547373,51.934536842204594,54.231639882997868,56.630345493119044,59.13514762948283,61.750739020047703,64.48201995560639,67.334107470443826,70.312344929062363]
["LED 18","Public Lighting",37.241999999999997,38.57,39.56,41.21,42.92,37.757086844257309,39.427110768124415,41.171001087399425,42.992024967475949,44.893594082893472,46.879271009083929,48.952775896829984,51.117993441939539,53.3789801631941,55.739972002206187]
["LED 20","Public Lighting",0,0,0,0,0,53.638175381023132,56.010631616547364,58.488023349028666,61.074991953240037,63.776384095399315,66.597260813361842,69.542906998436848,72.618841296591498,75.830826447592685,79.184880081456541]
["LED 200","Public Lighting",0,0,0,0,0,52.709961380342783,55.041362022939559,57.475882243201745,60.018083096446716,62.672727376847682,65.444788540492667,68.339460023117141,71.362164969966713,74.518566396019054,77.814577795599774]
["LED 240","Public Lighting",0,0,0,0,0,52.709961380342783,55.041362022939559,57.475882243201745,60.018083096446716,62.672727376847682,65.444788540492667,68.339460023117141,71.362164969966713,74.518566396019054,77.814577795599774]
["LED 25","Public Lighting",37.442,38.78,39.78,41.44,43.16,49.720086131920176,51.919242377197847,54.215668932472802,56.613668135619989,59.117732620105997,61.732553731904034,64.463030318695374,67.314277907823552,70.291638290196445,73.400689528091291]
["LED 265","Public Lighting",0,0,0,0,0,48.660103058278928,50.812375466909536,53.059844478708136,55.40672070996029,57.857401015629321,60.416476726831078,63.088742252658164,65.879204062469356,68.793090065472285,71.835859405171945]
["LED 30","Public Lighting",37.442,38.78,39.78,41.44,43.16,37.832883213659606,39.50625966709994,41.25365080081496,43.078330338947779,44.983716804885773,46.973379925838344,49.05104732069406,51.220611483686568,53.486137076953291,55.851868545649296]
["LED 75","Public Lighting",0,0,0,0,0,47.116189318453841,49.200173278546821,51.376333393136733,53.64874668182668,56.021670493817318,58.499550484018549,61.087028941950535,63.788953489038207,66.610386160593549,69.556612889500656]
["LED 155","Public Lighting",0,0,0,0,0,36.011438152023054,37.604250740949951,39.2675146107375,41.004345873732746,42.817998470240482,44.711870264755866,46.689509411838046,48.754621003550987,50.911074010925631,53.162908532447943]
["LED 14","Public Lighting",36.883000000000003,38.200000000000003,39.18,40.81,42.51,36.547843227793095,38.164381410622802,39.85242027490883,41.615122348764061,43.45579004126278,45.377871829479254,47.384968719183597,49.480840991298969,51.669415246759634,53.954791762968178]
["LED 17","Public Lighting",37.241999999999997,38.57,39.56,41.21,42.92,43.319374260394547,45.235422277558115,47.236218518045696,49.325511458561543,51.507215373711659,53.785417669367774,56.16438654039154,58.648578967065461,61.242649065211971,63.951456805644355]
["LED 175","Public Lighting",0,0,0,0,0,47.542981183088266,49.645842463547389,51.841714856368711,54.134712311960293,56.529130743804636,59.029456076820203,61.640372651708084,64.366772001028991,67.213762013452779,70.186676503349375]
["LED 14 New Tech","Public Lighting",36.883000000000003,38.200000000000003,39.18,40.81,42.51,37.274322276064275,38.922993165418859,40.644585989645229,42.442326139947774,44.319581668973406,46.279869600832882,48.326862520218988,50.464395452966357,52.69647305094351,55.02727709473799]
["LED 75 New Tech","Public Lighting",47.323999999999998,49.01,50.27,52.36,54.54,47.116189318453841,49.200173278546821,51.376333393136733,53.64874668182668,56.021670493817318,58.499550484018549,61.087028941950535,63.788953489038207,66.610386160593549,69.556612889500656]

{"sheet":"Smoothed Prices with Price Path","index":2,"n_rows":160,"n_cols":82,"rows_kept":160,"cut":false,"hidden":false,"merged":[[84,72,84,76],[84,77,84,81],[9,15,9,19],[9,26,9,30],[9,37,9,41],[9,48,9,52],[9,60,9,64],[9,72,9,76],[84,2,84,7],[84,26,84,30],[84,37,84,41],[84,48,84,52],[84,60,84,64],[7,3,7,7],[7,8,7,12],[9,3,9,7],[9,8,9,12],[9,77,9,81]]}
[]
[]
[null,null,null,null,null,null,null,null,null,null,null,null,null,null,null,"THIS TAKES 21/22 SMOOTHED PRICES ADDS CPI",null,null,null,null,null,null,null,null,null,null,null,null,null,null,null,null,null,null,null,null,null,"THIS TAKES 21/22 SMOOTHED PRICES  and multiplys by no.days in year/100 to convert $s into cents",null,null,null,null,null,null,null,null,null,null,"THIS TAKES nominal and multiplys by no days in year/100"]
[null,"Private Contract Lights"]
[null,null,null,null,null,"Adjustment ('A')",null,null,null,null,"Adjustment ('A')"]
[null,null,"Adjustment CL",0,0,0,0,0,0,0,0,0,0]
[null,null,"Adjustment PL",0,0,0,0,0,0,0,0,0,0]
[null,null,null,"X Factor",null,null,null,null,"X Factor",null,null,null,null,null,"Days",365,365,365,366,365,365,365,366,365,365,null,null,null,null,null,null,null,null,null,null,null,null,365,365,365,366,365,365,365,366,365,365,null,365,365,365,366,365,365,365,366,365,365]
[null,null,null,1.04E-2,1.04E-2,1.04E-2,1.04E-2,1.04E-2,1.04E-2,1.04E-2,1.04E-2,1.04E-2,1.04E-2,null,"CPI",1.1660979908044509,1.2051418931651063,1.2454930838699401,1.287195334230514,1.3302938811323202,1.3748354761058921,1.4208684360409423,1.4684426955985361,1.5176098613781586,1.5684232678984287]
[null,"Private Contract Lights",null,"Price (cents) per Light per day Real 2021/22 Smoothed",null,null,null,null,"Price (cents) per Light per day Real 2021/22 Smoothed",null,null,null,null,null,null,"Price (cents) per Light per day Nominal Smoothed",null,null,null,null,null,null,null,null,null,null,"Volumes",null,null,null,null,null,null,null,null,null,null,"Smooth Real 2021/22 Cost Dollars Per  Year",null,null,null,null,null,null,null,null,null,null,"Smooth Nominal Cost Dollars Per Year",null,null,null,null,null,null,null,null,null,null,null,"Revenue Real Real Dollars Per Year",null,null,null,null,null,null,null,null,null,null,null,"Revenue Nominal Dollars Per Year",null,null,null,null,"Revenue Nominal Dollars Per Year"]
[null,null,"Offered / No Longer Offered / NA","2024-25","2025-26","2026-27","2027-28","2028-29","2029-30","2030-31","2031-32","2032-33","2033-34",null,null,"2024-25","2025-26","2026-27","2027-28","2028-29","2029-30","2030-31","2031-32","2032-33","2033-34",null,"2024-25","2025-26","2026-27","2027-28","2028-29","2029-30","2030-31","2031-32","2032-33","2033-34",null,"2024-25","2025-26","2026-27","2027-28","2028-29","2029-30","2030-31","2031-32","2032-33","2033-34",null,"2024-25","2025-26","2026-27","2027-28","2028-29","2029-30","2030-31","2031-32","2032-33","2033-34",null,null,"2028-29","2029-30","2030-31","2031-32","2032-33","2033-34","2034-35","2035-36",{"$error":"#REF!"},{"$error":"#REF!"},null,null,"2028-29","2029-30","2030-31","2031-32","2032-33","2033-34","2034-35","2035-36",{"$error":"#REF!"},{"$error":"#REF!"}]
[null,"50W Mercury Vapour","Obsolete, no new Connections",14.538,14.6891952,14.84196283008,14.996319243512831,15.152280963645364,15.309864685667275,15.469087278398215,15.629965786093555,15.792517430268928,15.956759611543724,null,null,16.952732590315108,17.702564512399793,18.485562055919363,19.303192160880986,20.156986651135163,21.048545104236151,21.979537848238508,22.951709091044112,23.96688018816258,25.02695305500707,null,68.400000000000006,34.200000000000003,0,0,0,0,0,0,0,0,null,53.063699999999997,53.615562480000001,54.173164329792002,54.886528431256963,55.305825517305578,55.881006102685554,56.462168566153487,57.205674777102416,57.642688620481586,58.242172582134593,null,61.877473954650142,64.614360470259243,67.472301504105673,70.649683308824407,73.573001276643339,76.827189630461959,80.225313146070548,84.003255273221455,87.479112686793414,91.348378650775814,null,null,3629.55708,1833.6522368160001,0,0,0,0,0,0,0,0,null,null,4232.4192184980702,2209.8111280828662,0,0,0,0,0,0,0,0]
[null,"80W Mercury Vapour","Obsolete, no new Connections",14.525,14.67606,14.828691023999999,14.982909410649599,15.138731668520354,15.296174477872965,15.455254692442843,15.615989341244248,15.778395630393188,15.942490944949277,null,null,16.937573316434648,17.686734732604691,18.46903211323626,19.285931086586626,20.138962106736706,21.029723320885275,21.959883563465695,22.931185482694712,23.945448805410749,25.004573746318453,null,97.9,48.95,0,0,0,0,0,0,0,0,null,53.016249999999999,53.567618999999993,54.124722237599997,54.837448442977532,55.256370590099294,55.831036844236323,56.411679627416376,57.154520988953948,57.591144050935135,58.190091949064865,null,61.822142604986468,64.556581774007114,67.411967213312352,70.586507776907041,73.507211689588971,76.758490121231247,80.153575006649788,83.92813886666265,87.400888139749242,91.266694174062366,null,null,5190.2908750000006,2622.13495005,0,0,0,0,0,0,0,0,null,null,6052.3877610281752,3160.0446778376486,0,0,0,0,0,0,0,0]
[null,"125W Mercury Vapour","Obsolete, no new Connections",17.007999999999999,17.184883199999998,17.363605985279996,17.544187487526909,17.726647037397189,17.911004166586121,18.097278609918614,18.285490307461767,18.475659406659368,18.667806264488625,null,null,19.832994627602098,20.710222673469229,21.626251165708933,22.582796276810001,23.581650086841851,24.624683940903047,25.713851955072258,26.851194677430062,28.038842911010395,29.279021705844009,null,138.80000000000001,69.400000000000006,0,0,0,0,0,0,0,0,null,62.0792,62.724823679999993,63.377161846271981,64.211726204348494,64.702261686499739,65.375165208039348,66.05506692620294,66.924894525310066,67.436156834306701,68.137492865383479,null,72.390430390747667,75.592312758162691,78.935816754837603,82.653034373124612,86.073022816972752,89.880096384296124,93.855559636013751,98.275372519394026,102.34177662518795,106.86842922633063,null,null,8616.5929599999999,4353.1027633920003,0,0,0,0,0,0,0,0,null,null,10047.791738235777,5246.106505416491,0,0,0,0,0,0,0,0]
[null,"250W Mercury Vapour","Obsolete, no new Connections",17.28,17.459712,17.641293004799998,17.824762452049917,18.010139981551237,18.19744543735937,18.386698869907907,18.577920538154949,18.771130911751758,18.966350673233975,null,null,20.150173281100912,21.041430373797525,21.972108428001551,22.943951062045908,23.958779015794168,25.018493561782964,26.125080067241807,27.28061171366366,28.487253380894852,29.747265703021196,null,11.200000000000001,5.6000000000000005,0,0,0,0,0,0,0,0,null,63.07200000000001,63.727948799999993,64.39071946752,65.238630574502693,65.737010932662017,66.420675846361704,67.111450875163854,67.995189169647105,68.514627827893918,69.227179957304003,null,73.548132476018324,76.801220864360971,80.198195762205657,83.974860887088013,87.449543407648704,91.317501500507831,95.356542245432593,99.847038872008994,103.9784748402662,108.57751981602736,null,null,706.40640000000019,356.87651327999998,0,0,0,0,0,0,0,0,null,null,823.73908373140534,430.08683684042148,0,0,0,0,0,0,0,0]
[null,0,"NA","","","","","","","","","","",null,null,"","","","","","","","","","",null,0,0,0,0,0,0,0,0,0,0,null,"","","","","","","","","","",null,"","","","","","","","","","",null,null,0,0,0,0,0,0,0,0,0,0,null,null,0,0,0,0,0,0,0,0,0,0]
[null,"400W Mercury Vapour","Obsolete, no new Connections",18.123999999999999,18.312489599999999,18.502939491839999,18.695370062555135,18.889801911205709,19.086255851082246,19.284752911933502,19.48531434221761,19.687961611376672,19.892716412134988,null,null,21.134359985339866,22.069148385110321,23.045283168350704,24.064593116233802,25.128987898278559,26.24046165010153,27.401096709414961,28.613067517270842,29.878644691859858,31.200199282497461,null,10.4,5.2,0,0,0,0,0,0,0,0,null,66.152599999999993,66.840587040000003,67.535729145215996,68.425054428951796,68.947776975900837,69.664833856450201,70.389348128557288,71.316250492516446,71.861059881524852,72.608414904292701,null,77.140413946490511,80.552391605652673,84.115283564480066,88.076410805415705,91.720805828716749,95.777685022870585,100.01400298936461,104.72382711321129,109.05705312528848,113.88072738111573,null,null,687.98703999999998,347.571052608,0,0,0,0,0,0,0,0,null,null,802.26030504350138,418.87243634939392,0,0,0,0,0,0,0,0]
[null,"70W Sodium Vapour","Offered",15.455,15.615732,15.778135612799998,15.942228223173117,16.108027396694116,16.275550881619733,16.444816610788578,16.615842703540778,16.788647467657601,16.963249401321239,null,null,18.022044447882788,18.819172825638933,19.651558782104395,20.520761786106455,21.42841028293396,22.376204745217336,23.365920858751277,24.399412849228689,25.478616956118625,26.60555506019632,null,32.666666666666671,16.333333333333336,0,0,0,0,0,0,0,0,null,56.41075,56.997421800000005,57.590194986719986,58.348555296813608,58.794299997933521,59.405760717912024,60.023580629378309,60.813984294959248,61.27856325695025,61.915860314822524,null,65.780462234772173,68.68998081358211,71.728189554681038,75.105988137149623,78.213697532708963,81.673147320043284,85.285611134442163,89.301851028177012,92.996951889832985,97.110275969716568,null,null,1842.7511666666669,930.95788940000023,0,0,0,0,0,0,0,0,null,null,2148.8284330025581,1121.9363532885079,0,0,0,0,0,0,0,0]
[null,0,"NA","","","","","","","","","","",null,null,"","","","","","","","","","",null,0,0,0,0,0,0,0,0,0,0,null,"","","","","","","","","","",null,"","","","","","","","","","",null,null,0,0,0,0,0,0,0,0,0,0,null,null,0,0,0,0,0,0,0,0,0,0]
[null,"100W Sodium Vapour","Offered",18.489000000000001,18.681285599999999,18.875570970239998,19.071876908330495,19.27022442817713,19.470634762230173,19.673129363757365,19.877729909140442,20.0844583001955,20.293336666517533,null,null,21.559985751983493,22.51359989474204,23.509393097530133,24.549230971421693,25.635061644850598,26.768919413414654,27.952928551113065,29.189307290157835,30.4803719768151,31.828541411062435,null,0.8,0.4,0,0,0,0,0,0,0,0,null,67.484850000000009,68.186692440000002,68.895834041375991,69.803069484489612,70.336319162846522,71.067816882140136,71.806922177714384,72.752491467454021,73.308272795713577,74.070678832789,null,78.693947994739744,82.174639615808445,85.809284805984987,89.850185355403397,93.567975003704689,97.706555858963497,102.02818921156269,106.83286468197768,111.25335771537512,116.17417615037787,null,null,53.987880000000011,27.274676976000002,0,0,0,0,0,0,0,0,null,null,62.955158395791798,32.869855846323382,0,0,0,0,0,0,0,0]
[null,0,"NA","","","","","","","","","","",null,null,"","","","","","","","","","",null,0,0,0,0,0,0,0,0,0,0,null,"","","","","","","","","","",null,"","","","","","","","","","",null,null,0,0,0,0,0,0,0,0,0,0,null,null,0,0,0,0,0,0,0,0,0,0]
[null,"150W Sodium Vapour","Offered",17.797000000000001,17.9820888,18.169102523519999,18.358061189764605,18.548985026138155,18.741894470409992,18.936810172902256,19.133752998700437,19.332744029886921,19.533804567797745,null,null,20.753045942346812,21.670968539495053,22.629491533168036,23.63041070898328,24.675601281486617,25.767021407352509,26.906715853975832,28.096819830328243,29.339562987256112,30.637273594714593,null,66.400000000000006,33.200000000000003,0,0,0,0,0,0,0,0,null,64.959050000000005,65.634624119999998,66.317224210847996,67.190503954538457,67.703795345404274,68.407914816996467,69.119357131093224,70.029535975243604,70.56451570908726,71.29838667246176,null,75.748617689565862,79.099035169156934,82.59764409606332,86.487303194878805,90.06594467742616,94.04962813683666,98.209512867011782,102.83436057900137,107.08940490348481,111.82604862070826,null,null,4313.2809200000011,2179.0695207839999,0,0,0,0,0,0,0,0,null,null,5029.7082145871736,2626.0879676160102,0,0,0,0,0,0,0,0]
[null,0,"NA","","","","","","","","","","",null,null,"","","","","","","","","","",null,0,0,0,0,0,0,0,0,0,0,null,"","","","","","","","","","",null,"","","","","","","","","","",null,null,0,0,0,0,0,0,0,0,0,0,null,null,0,0,0,0,0,0,0,0,0,0]
[null,0,"NA","","","","","","","","","","",null,null,"","","","","","","","","","",null,0,0,0,0,0,0,0,0,0,0,null,"","","","","","","","","","",null,"","","","","","","","","","",null,null,0,0,0,0,0,0,0,0,0,0,null,null,0,0,0,0,0,0,0,0,0,0]
[null,0,"NA","","","","","","","","","","",null,null,"","","","","","","","","","",null,0,0,0,0,0,0,0,0,0,0,null,"","","","","","","","","","",null,"","","","","","","","","","",null,null,0,0,0,0,0,0,0,0,0,0,null,null,0,0,0,0,0,0,0,0,0,0]
[null,"250W Sodium Vapour","Offered",18.48,18.672191999999999,18.8663827968,19.062593177886718,19.260844146936741,19.461156926064881,19.663552958095956,19.868053908860151,20.074681669512294,20.283458358875222,null,null,21.549490870066254,22.502640816422353,23.497949291057218,24.537280996910212,25.622583114113208,26.755888948017891,27.939321738578045,29.175098638223634,30.465534865679214,31.813048043508775,null,69.7,34.85,0,0,0,0,0,0,0,0,null,67.451999999999998,68.153500799999989,68.862297208320001,69.769091031065386,70.302081136319103,71.033222780136811,71.771968297050236,72.717077306428152,73.272588093719875,74.03462300989456,null,78.655641675741833,82.134638979941599,85.767514912358834,89.80644844869137,93.522428366513211,97.658994660265307,101.97852434580986,106.78086101589849,111.19920225972913,116.11762535880703,null,null,4701.4044000000004,2375.1495028799995,0,0,0,0,0,0,0,0,null,null,5482.2982247992059,2862.3921684509646,0,0,0,0,0,0,0,0]
[null,0,"NA","","","","","","","","","","",null,null,"","","","","","","","","","",null,0,0,0,0,0,0,0,0,0,0,null,"","","","","","","","","","",null,"","","","","","","","","","",null,null,0,0,0,0,0,0,0,0,0,0,null,null,0,0,0,0,0,0,0,0,0,0]
[null,0,"NA","","","","","","","","","","",null,null,"","","","","","","","","","",null,0,0,0,0,0,0,0,0,0,0,null,"","","","","","","","","","",null,"","","","","","","","","","",null,null,0,0,0,0,0,0,0,0,0,0,null,null,0,0,0,0,0,0,0,0,0,0]
[null,0,"NA","","","","","","","","","","",null,null,"","","","","","","","","","",null,0,0,0,0,0,0,0,0,0,0,null,"","","","","","","","","","",null,"","","","","","","","","","",null,null,0,0,0,0,0,0,0,0,0,0,null,null,0,0,0,0,0,0,0,0,0,0]
[null,"400W Sodium Vapour","Offered",18.739999999999998,18.934895999999998,19.131818918399997,19.330789835151357,19.53183004943693,19.734961081951074,19.940204677203365,20.14758280584628,20.357117667027079,20.56883169076416,null,null,21.852676347675409,22.819236412324397,23.828548144719274,24.882502482797474,25.983074002082329,27.132324615035454,28.332407434034227,29.585570805211631,30.894162520715827,32.260634217281087,null,38,19,0,0,0,0,0,0,0,0,null,68.400999999999996,69.112370399999989,69.831139052159983,70.75069079665397,71.291179680444799,72.032607949121427,72.781747071792282,73.74015306939738,74.303479484648847,75.076235671289183,null,79.762268669015242,83.29021290498406,86.974200728225355,91.069959087038754,94.838220107600506,99.032984844879408,103.41328713422492,108.28318914707457,112.76369320061278,117.75131489307596,null,null,2599.2379999999998,1313.1350375999998,0,0,0,0,0,0,0,0,null,null,3030.9662094225791,1582.5140451946972,0,0,0,0,0,0,0,0]
[null,0,"NA","","","","","","","","","","",null,null,"","","","","","","","","","",null,0,0,0,0,0,0,0,0,0,0,null,"","","","","","","","","","",null,"","","","","","","","","","",null,null,0,0,0,0,0,0,0,0,0,0,null,null,0,0,0,0,0,0,0,0,0,0]
[null,"250W Sodium Vapour - Flood Light","Offered",18.962,19.159204799999998,19.358460529919999,19.559788519431166,19.763210320033249,19.968747707361594,20.176422683518155,20.386257479426742,20.598274557212779,20.812496612607791,null,null,22.111550101633998,23.089560344209989,24.110828704384573,25.177268520747372,26.290877760271353,27.453742761488918,28.668042143231432,29.936050886255224,31.260144595400934,32.642803950271286,null,0,0,0,0,0,0,0,0,0,0,null,69.211299999999994,69.931097519999994,70.658380934207997,71.588825981118077,72.135717668121359,72.885929131869815,73.643942794841266,74.613702374701873,75.183702133826642,75.965612636018435,null,80.707157870964096,84.276895256366458,88.004524771003688,92.148802785935388,95.961703824990437,100.20616107943455,104.63835382279473,109.56594624369413,114.09952777321341,119.14623441849021,null,null,0,0,0,0,0,0,0,0,0,0,null,null,0,0,0,0,0,0,0,0,0,0]
[null,"400W Sodium Vapour - Flood Light","Offered",18.739999999999998,18.934895999999998,19.131818918399997,19.330789835151357,19.53183004943693,19.734961081951074,19.940204677203365,20.14758280584628,20.357117667027079,20.56883169076416,null,null,21.852676347675409,22.819236412324397,23.828548144719274,24.882502482797474,25.983074002082329,27.132324615035454,28.332407434034227,29.585570805211631,30.894162520715827,32.260634217281087,null,0,0,0,0,0,0,0,0,0,0,null,68.400999999999996,69.112370399999989,69.831139052159983,70.75069079665397,71.291179680444799,72.032607949121427,72.781747071792282,73.74015306939738,74.303479484648847,75.076235671289183,null,79.762268669015242,83.29021290498406,86.974200728225355,91.069959087038754,94.838220107600506,99.032984844879408,103.41328713422492,108.28318914707457,112.76369320061278,117.75131489307596,null,null,0,0,0,0,0,0,0,0,0,0,null,null,0,0,0,0,0,0,0,0,0,0]
[null,"1x20W Fluorescent","Obsolete, no new Connections",14.813000000000001,14.967055200000001,15.122712574079999,15.279988784850431,15.438900668212876,15.599465235162288,15.761699673607975,15.925621350213497,16.091247812255716,16.258596789503176,null,null,17.273409537786332,18.037425238834651,18.835233920369618,19.668330270954055,20.538275090333279,21.446698213581655,22.395301564586394,23.385862344589107,24.420236361758995,25.500361508035471,null,10.8,5.4,0,0,0,0,0,0,0,0,null,54.067450000000001,54.629751480000003,55.197900895391996,55.924758952552573,56.351987438976991,56.938048108342358,57.530203808669114,58.287774141781398,58.733054514733368,59.343878281686592,null,63.047944812920115,65.836602121746466,68.748603809349106,71.986088791691841,74.964704079716469,78.280448479573039,81.742850710740342,85.592256181196134,89.133862720420325,93.076319504329476,null,null,583.92846000000009,295.00065799200001,0,0,0,0,0,0,0,0,null,null,680.91780397953733,355.51765145743093,0,0,0,0,0,0,0,0]
[null,"1x40W Fluorescent","Obsolete, no new Connections",14.813000000000001,14.967055200000001,15.122712574079999,15.279988784850431,15.438900668212876,15.599465235162288,15.761699673607975,15.925621350213497,16.091247812255716,16.258596789503176,null,null,17.273409537786332,18.037425238834651,18.835233920369618,19.668330270954055,20.538275090333279,21.446698213581655,22.395301564586394,23.385862344589107,24.420236361758995,25.500361508035471,null,4,2,0,0,0,0,0,0,0,0,null,54.067450000000001,54.629751480000003,55.197900895391996,55.924758952552573,56.351987438976991,56.938048108342358,57.530203808669114,58.287774141781398,58.733054514733368,59.343878281686592,null,63.047944812920115,65.836602121746466,68.748603809349106,71.986088791691841,74.964704079716469,78.280448479573039,81.742850710740342,85.592256181196134,89.133862720420325,93.076319504329476,null,null,216.2698,109.25950296000001,0,0,0,0,0,0,0,0,null,null,252.19177925168046,131.67320424349293,0,0,0,0,0,0,0,0]
[null,"2x20W Fluorescent","Obsolete, no new Connections",14.813000000000001,14.967055200000001,15.122712574079999,15.279988784850431,15.438900668212876,15.599465235162288,15.761699673607975,15.925621350213497,16.091247812255716,16.258596789503176,null,null,17.273409537786332,18.037425238834651,18.835233920369618,19.668330270954055,20.538275090333279,21.446698213581655,22.395301564586394,23.385862344589107,24.420236361758995,25.500361508035471,null,18.400000000000002,9.2000000000000011,0,0,0,0,0,0,0,0,null,54.067450000000001,54.629751480000003,55.197900895391996,55.924758952552573,56.351987438976991,56.938048108342358,57.530203808669114,58.287774141781398,58.733054514733368,59.343878281686592,null,63.047944812920115,65.836602121746466,68.748603809349106,71.986088791691841,74.964704079716469,78.280448479573039,81.742850710740342,85.592256181196134,89.133862720420325,93.076319504329476,null,null,994.84108000000015,502.59371361600006,0,0,0,0,0,0,0,0,null,null,1160.0821845577302,605.69673952006758,0,0,0,0,0,0,0,0]
[null,"2x24W Fluorescent","Obsolete, no new Connections",14.813000000000001,14.967055200000001,15.122712574079999,15.279988784850431,15.438900668212876,15.599465235162288,15.761699673607975,15.925621350213497,16.091247812255716,16.258596789503176,null,null,17.273409537786332,18.037425238834651,18.835233920369618,19.668330270954055,20.538275090333279,21.446698213581655,22.395301564586394,23.385862344589107,24.420236361758995,25.500361508035471,null,0,0,0,0,0,0,0,0,0,0,null,54.067450000000001,54.629751480000003,55.197900895391996,55.924758952552573,56.351987438976991,56.938048108342358,57.530203808669114,58.287774141781398,58.733054514733368,59.343878281686592,null,63.047944812920115,65.836602121746466,68.748603809349106,71.986088791691841,74.964704079716469,78.280448479573039,81.742850710740342,85.592256181196134,89.133862720420325,93.076319504329476,null,null,0,0,0,0,0,0,0,0,0,0,null,null,0,0,0,0,0,0,0,0,0,0]
[null,"2x40W Fluorescent","Obsolete, no new Connections",14.813000000000001,14.967055200000001,15.122712574079999,15.279988784850431,15.438900668212876,15.599465235162288,15.761699673607975,15.925621350213497,16.091247812255716,16.258596789503176,null,null,17.273409537786332,18.037425238834651,18.835233920369618,19.668330270954055,20.538275090333279,21.446698213581655,22.395301564586394,23.385862344589107,24.420236361758995,25.500361508035471,null,1.2000000000000002,0.60000000000000009,0,0,0,0,0,0,0,0,null,54.067450000000001,54.629751480000003,55.197900895391996,55.924758952552573,56.351987438976991,56.938048108342358,57.530203808669114,58.287774141781398,58.733054514733368,59.343878281686592,null,63.047944812920115,65.836602121746466,68.748603809349106,71.986088791691841,74.964704079716469,78.280448479573039,81.742850710740342,85.592256181196134,89.133862720420325,93.076319504329476,null,null,64.88094000000001,32.777850888000003,0,0,0,0,0,0,0,0,null,null,75.657533775504149,39.501961273047883,0,0,0,0,0,0,0,0]
[null,"4x40W Fluorescent","Obsolete, no new Connections",14.813000000000001,14.967055200000001,15.122712574079999,15.279988784850431,15.438900668212876,15.599465235162288,15.761699673607975,15.925621350213497,16.091247812255716,16.258596789503176,null,null,17.273409537786332,18.037425238834651,18.835233920369618,19.668330270954055,20.538275090333279,21.446698213581655,22.395301564586394,23.385862344589107,24.420236361758995,25.500361508035471,null,0.4,0.2,0,0,0,0,0,0,0,0,null,54.067450000000001,54.629751480000003,55.197900895391996,55.924758952552573,56.351987438976991,56.938048108342358,57.530203808669114,58.287774141781398,58.733054514733368,59.343878281686592,null,63.047944812920115,65.836602121746466,68.748603809349106,71.986088791691841,74.964704079716469,78.280448479573039,81.742850710740342,85.592256181196134,89.133862720420325,93.076319504329476,null,null,21.626980000000003,10.925950296000002,0,0,0,0,0,0,0,0,null,null,25.219177925168047,13.167320424349294,0,0,0,0,0,0,0,0]
[null,"32W Compact Fluorescent","Not Offered",14.813000000000001,14.967055200000001,15.122712574079999,15.279988784850431,15.438900668212876,15.599465235162288,15.761699673607975,15.925621350213497,16.091247812255716,16.258596789503176,null,null,17.273409537786332,18.037425238834651,18.835233920369618,19.668330270954055,20.538275090333279,21.446698213581655,22.395301564586394,23.385862344589107,24.420236361758995,25.500361508035471,null,0,0,0,0,0,0,0,0,0,0,null,54.067450000000001,54.629751480000003,55.197900895391996,55.924758952552573,56.351987438976991,56.938048108342358,57.530203808669114,58.287774141781398,58.733054514733368,59.343878281686592,null,63.047944812920115,65.836602121746466,68.748603809349106,71.986088791691841,74.964704079716469,78.280448479573039,81.742850710740342,85.592256181196134,89.133862720420325,93.076319504329476,null,null,0,0,0,0,0,0,0,0,0,0,null,null,0,0,0,0,0,0,0,0,0,0]
[null,"42W Compact Fluorescent","Offered",14.813000000000001,14.967055200000001,15.122712574079999,15.279988784850431,15.438900668212876,15.599465235162288,15.761699673607975,15.925621350213497,16.091247812255716,16.258596789503176,null,null,17.273409537786332,18.037425238834651,18.835233920369618,19.668330270954055,20.538275090333279,21.446698213581655,22.395301564586394,23.385862344589107,24.420236361758995,25.500361508035471,null,8.3333333333333339,4.166666666666667,0,0,0,0,0,0,0,0,null,54.067450000000001,54.629751480000003,55.197900895391996,55.924758952552573,56.351987438976991,56.938048108342358,57.530203808669114,58.287774141781398,58.733054514733368,59.343878281686592,null,63.047944812920115,65.836602121746466,68.748603809349106,71.986088791691841,74.964704079716469,78.280448479573039,81.742850710740342,85.592256181196134,89.133862720420325,93.076319504329476,null,null,450.56208333333336,227.62396450000003,0,0,0,0,0,0,0,0,null,null,525.39954010766769,274.31917550727695,0,0,0,0,0,0,0,0]
[null,0,"NA","","","","","","","","","","",null,null,"","","","","","","","","","",null,0,0,0,0,0,0,0,0,0,0,null,"","","","","","","","","","",null,"","","","","","","","","","",null,null,0,0,0,0,0,0,0,0,0,0,null,null,0,0,0,0,0,0,0,0,0,0]
[null,"60W Incandescent","Obsolete, no new Connections",15.455,15.615732,15.778135612799998,15.942228223173117,16.108027396694116,16.275550881619733,16.444816610788578,16.615842703540778,16.788647467657601,16.963249401321239,null,null,18.022044447882788,18.819172825638933,19.651558782104395,20.520761786106455,21.42841028293396,22.376204745217336,23.365920858751277,24.399412849228689,25.478616956118625,26.60555506019632,null,4,2,0,0,0,0,0,0,0,0,null,56.41075,56.997421800000005,57.590194986719986,58.348555296813608,58.794299997933521,59.405760717912024,60.023580629378309,60.813984294959248,61.27856325695025,61.915860314822524,null,65.780462234772173,68.68998081358211,71.728189554681038,75.105988137149623,78.213697532708963,81.673147320043284,85.285611134442163,89.301851028177012,92.996951889832985,97.110275969716568,null,null,225.643,113.99484360000001,0,0,0,0,0,0,0,0,null,null,263.12184893908869,137.37996162716422,0,0,0,0,0,0,0,0]
[null,"100W Incandescent","Obsolete, no new Connections",18.501000000000001,18.693410400000001,18.88782186816,19.084255215588865,19.282731469830988,19.483271877117229,19.685897904639248,19.890631242847494,20.097493807773109,20.306507743373949,null,null,21.573978927873146,22.528211999168288,23.524651506160691,24.565164270770339,25.651699685833794,26.786293367277004,27.971070967826432,29.208252159403436,30.500154791662947,31.849199234467317,null,2,1,0,0,0,0,0,0,0,0,null,67.528650000000013,68.230947960000009,68.940549818784007,69.848374089055241,70.381969864883104,71.113942351477874,71.853527351933252,72.799710348821833,73.355852398371837,74.118753263314915,null,78.745023086736978,82.22797379696425,85.864977997486506,89.908501231019443,93.628703853293359,97.769970790561061,102.09440903256647,106.90220290341658,111.32556498956976,116.24957720580571,null,null,135.05730000000003,68.230947960000009,0,0,0,0,0,0,0,0,null,null,157.49004617347396,82.22797379696425,0,0,0,0,0,0,0,0]
[null,"100W Metal Halide","Offered",18.143000000000001,18.331687200000001,18.522336746880001,18.714969049047554,18.909604727157646,19.106264616320086,19.304969768329816,19.505741453920447,19.70860116504122,19.913570617157646,null,null,21.156515847165153,22.09228421711855,23.069442315349086,24.089820840202492,25.155331463168611,26.267970410383583,27.429822202544457,28.64306356024305,29.909967482035619,31.232907502888523,null,0,0,0,0,0,0,0,0,0,0,null,66.221950000000007,66.910658280000007,67.606529126111994,68.496786719514049,69.020057254125405,69.737865849568323,70.463139654403832,71.391013721348841,71.936394252400447,72.684532752625415,null,77.221282842152803,80.636837392482718,84.203464451024161,88.168744275141123,91.816959840565431,95.878091997900086,100.11885103928728,104.83361263048957,109.17138130943,114.0001123855431,null,null,0,0,0,0,0,0,0,0,0,0,null,null,0,0,0,0,0,0,0,0,0,0]
[null,"150W Metal Halide","Offered",19.844000000000001,20.050377600000001,20.258901527039999,20.469594102921214,20.682477881591595,20.897575651560146,21.11491043833637,21.334505506895066,21.556384364166775,21.78057076155411,null,null,23.140048529523526,24.163550019539244,25.232321738730487,26.348366022872629,27.513773772535849,28.73072837037159,30.001509771663564,31.328498775806803,32.714181486717443,34.161153970529661,null,10.8,5.4,0,0,0,0,0,0,0,0,null,72.430599999999998,73.183878239999999,73.944990573695989,74.918714416691643,75.491044267809315,76.276151128194527,77.069423099927747,78.084290155235934,78.680802929208724,79.49908327967249,null,84.461177132760881,88.196957571318237,92.097974346366286,96.435019643713815,100.42527426975585,104.86715855185631,109.50551066657201,114.6623055194529,119.40676242651867,124.68821199243327,null,null,782.25048000000004,395.192942496,0,0,0,0,0,0,0,0,null,null,912.1807130338176,476.2635708851185,0,0,0,0,0,0,0,0]
[null,"250W Metal Halide","Offered",19.033999999999999,19.231953599999997,19.431965917439996,19.634058362981371,19.838252569956378,20.044570396683923,20.253033928809437,20.463665481669054,20.67648760267841,20.891523073746264,null,null,22.195509156971916,23.177232970767477,24.202379156167911,25.272868316839226,26.390706006170493,27.557986484663012,28.776896643511606,30.04972010172882,31.378841484487996,32.766750890700543,null,16,8,0,0,0,0,0,0,0,0,null,69.474099999999993,70.196630639999981,70.92667559865599,71.860653608511825,72.409621880340779,73.162681947896317,73.923573840154447,74.897015662908728,75.469179749776188,76.254059219173854,null,81.013608422947485,84.5969003433013,88.338683920012883,92.498698039631563,96.326076922522304,100.58665066902,105.03567274881736,109.98197557232749,114.53277141838117,119.59864075105698,null,null,1111.5855999999999,561.57304511999985,0,0,0,0,0,0,0,0,null,null,1296.2177347671598,676.7752027464104,0,0,0,0,0,0,0,0]
[null,"400W Metal Halide","Offered",18.574000000000002,18.767169600000003,18.962348163840002,19.159556584743935,19.358815973225273,19.560147659346814,19.763573195004021,19.969114356232062,20.176793145536873,20.386631794250455,null,null,21.659104081201871,22.617102301094633,23.617473491996581,24.662091841807914,25.752914435148202,26.891984919939627,28.081437336166051,29.323500113980835,30.620500248653993,31.974867660180305,null,3.6,1.8,0,0,0,0,0,0,0,0,null,67.795100000000005,68.500169040000003,69.212570798016003,70.123977100162804,70.659678302272241,71.394538956615875,72.137042161764668,73.086958543809345,73.645294981209588,74.411206049014169,null,79.055729896386822,82.552423398995415,86.203778245787532,90.263256141016967,93.998137688290939,98.155744957779646,102.49724627700608,107.32401041716984,111.76482590758707,116.7082669596581,null,null,244.06236000000001,123.30030427200001,0,0,0,0,0,0,0,0,null,null,284.60062762699255,148.59436211819175,0,0,0,0,0,0,0,0]
[null,"400W Metal Halide - Flood Light","Offered",18.574000000000002,18.767169600000003,18.962348163840002,19.159556584743935,19.358815973225273,19.560147659346814,19.763573195004021,19.969114356232062,20.176793145536873,20.386631794250455,null,null,21.659104081201871,22.617102301094633,23.617473491996581,24.662091841807914,25.752914435148202,26.891984919939627,28.081437336166051,29.323500113980835,30.620500248653993,31.974867660180305,null,0.8,0.4,0,0,0,0,0,0,0,0,null,67.795100000000005,68.500169040000003,69.212570798016003,70.123977100162804,70.659678302272241,71.394538956615875,72.137042161764668,73.086958543809345,73.645294981209588,74.411206049014169,null,79.055729896386822,82.552423398995415,86.203778245787532,90.263256141016967,93.998137688290939,98.155744957779646,102.49724627700608,107.32401041716984,111.76482590758707,116.7082669596581,null,null,54.236080000000008,27.400067616000001,0,0,0,0,0,0,0,0,null,null,63.244583917109459,33.020969359598169,0,0,0,0,0,0,0,0]
[null,"LED 18","Offered",9.9540000000000006,10.057521599999999,10.16211982464,10.267805870816256,10.374591051872745,10.482486798812221,10.591504661519869,10.701656309999676,10.812953535623672,10.925408252394158,null,null,11.607339400467504,12.120740621572949,12.656849959046728,13.216671809699363,13.801254995556434,14.411694728818729,15.049134663734085,15.714769039225008,16.40984491628631,17.135664514344505,null,5429.4833333333327,5607.1333333333323,5784.7833333333319,5784.7833333333319,5784.7833333333319,5784.7833333333319,5784.7833333333319,5784.7833333333319,5784.7833333333319,5784.7833333333319,null,36.332099999999997,36.709953839999997,37.091737359935998,37.580169487187497,37.867257339335517,38.261076815664609,38.658992014547522,39.16806209459881,39.467280405026401,39.877740121238674,null,42.366788811706392,44.240703268741264,46.197502350520551,48.37301882349967,50.374580733780988,52.602685760188358,54.929341522629414,57.516054683563524,59.895933944445034,62.545175477357446,null,null,197264.53141499995,205837.60584139195,214567.66408413503,217393.13811332406,219053.87913563239,221332.03947864298,223633.89268922087,226578.75280380022,228309.66589898992,230684.08642433939,null,null,230029.77374001296,248063.52198826804,267242.54163891869,279827.43307320046,291406.03505243064,304295.13987410819,317754.33935108117,332717.91453256679,346485.00041625981,361810.28868182597]
[null,0,"NA","","","","","","","","","","",null,null,"","","","","","","","","","",null,0,0,0,0,0,0,0,0,0,0,null,"","","","","","","","","","",null,"","","","","","","","","","",null,null,0,0,0,0,0,0,0,0,0,0,null,null,0,0,0,0,0,0,0,0,0,0]
[null,0,"NA","","","","","","","","","","",null,null,"","","","","","","","","","",null,0,0,0,0,0,0,0,0,0,0,null,"","","","","","","","","","",null,"","","","","","","","","","",null,null,0,0,0,0,0,0,0,0,0,0,null,null,0,0,0,0,0,0,0,0,0,0]
[null,0,"NA","","","","","","","","","","",null,null,"","","","","","","","","","",null,0,0,0,0,0,0,0,0,0,0,null,"","","","","","","","","","",null,"","","","","","","","","","",null,null,0,0,0,0,0,0,0,0,0,0,null,null,0,0,0,0,0,0,0,0,0,0]
[null,"LED 20","Offered",9.9540000000000006,10.057521599999999,10.16211982464,10.267805870816256,10.374591051872745,10.482486798812221,10.591504661519869,10.701656309999676,10.812953535623672,10.925408252394158,null,null,11.607339400467504,12.120740621572949,12.656849959046728,13.216671809699363,13.801254995556434,14.411694728818729,15.049134663734085,15.714769039225008,16.40984491628631,17.135664514344505,null,2,2,2,2,2,2,2,2,2,2,null,36.332099999999997,36.709953839999997,37.091737359935998,37.580169487187497,37.867257339335517,38.261076815664609,38.658992014547522,39.16806209459881,39.467280405026401,39.877740121238674,null,42.366788811706392,44.240703268741264,46.197502350520551,48.37301882349967,50.374580733780988,52.602685760188358,54.929341522629414,57.516054683563524,59.895933944445034,62.545175477357446,null,null,72.664199999999994,73.419907679999994,74.183474719871995,75.160338974374994,75.734514678671033,76.522153631329218,77.317984029095044,78.336124189197619,78.934560810052801,79.755480242477347,null,null,84.733577623412785,88.481406537482528,92.395004701041103,96.746037646999341,100.74916146756198,105.20537152037672,109.85868304525883,115.03210936712705,119.79186788889007,125.09035095471489]
[null,"LED 200","Offered",10.787000000000001,10.8991848,11.012536321920001,11.127066699667969,11.242788193344515,11.359713190555297,11.477854207737071,11.597223891497537,11.71783501996911,11.839700504176788,null,null,12.578699026807612,13.135064203828351,13.716037824817869,14.322708339484334,14.9562123404729,15.617736692763474,16.308520757253319,17.029858712690388,17.783101980307453,18.569661755699631,null,1,1,1,1,1,1,1,1,1,1,null,39.372550000000004,39.78202452,40.195757575008003,40.725064120784765,41.036176905707478,41.462953145526832,41.894167858240309,42.445839442880988,42.770097822887259,43.214906840245277,null,45.912251447847787,47.942984343973485,50.063538060585223,52.421112522512665,54.590175042726088,57.004738928586676,59.526100763974618,62.329282888446812,64.908322228122202,67.779265408303658,null,null,39.372550000000004,39.78202452,40.195757575008003,40.725064120784765,41.036176905707478,41.462953145526832,41.894167858240309,42.445839442880988,42.770097822887259,43.214906840245277,null,null,45.912251447847787,47.942984343973485,50.063538060585223,52.421112522512665,54.590175042726088,57.004738928586676,59.526100763974618,62.329282888446812,64.908322228122202,67.779265408303658]
[null,"LED 240","Offered",10.787000000000001,10.8991848,11.012536321920001,11.127066699667969,11.242788193344515,11.359713190555297,11.477854207737071,11.597223891497537,11.71783501996911,11.839700504176788,null,null,12.578699026807612,13.135064203828351,13.716037824817869,14.322708339484334,14.9562123404729,15.617736692763474,16.308520757253319,17.029858712690388,17.783101980307453,18.569661755699631,null,6,6,6,6,6,6,6,6,6,6,null,39.372550000000004,39.78202452,40.195757575008003,40.725064120784765,41.036176905707478,41.462953145526832,41.894167858240309,42.445839442880988,42.770097822887259,43.214906840245277,null,45.912251447847787,47.942984343973485,50.063538060585223,52.421112522512665,54.590175042726088,57.004738928586676,59.526100763974618,62.329282888446812,64.908322228122202,67.779265408303658,null,null,236.23530000000002,238.69214712000002,241.17454545004802,244.35038472470859,246.21706143424487,248.77771887316101,251.36500714944185,254.67503665728594,256.62058693732354,259.28944104147166,null,null,275.47350868708673,287.65790606384093,300.38122836351135,314.526675135076,327.54105025635653,342.02843357152005,357.1566045838477,373.97569733068087,389.44993336873324,406.67559244982192]
[null,"LED 25","Offered",9.9540000000000006,10.057521599999999,10.16211982464,10.267805870816256,10.374591051872745,10.482486798812221,10.591504661519869,10.701656309999676,10.812953535623672,10.925408252394158,null,null,11.607339400467504,12.120740621572949,12.656849959046728,13.216671809699363,13.801254995556434,14.411694728818729,15.049134663734085,15.714769039225008,16.40984491628631,17.135664514344505,null,51,51,51,51,51,51,51,51,51,51,null,36.332099999999997,36.709953839999997,37.091737359935998,37.580169487187497,37.867257339335517,38.261076815664609,38.658992014547522,39.16806209459881,39.467280405026401,39.877740121238674,null,42.366788811706392,44.240703268741264,46.197502350520551,48.37301882349967,50.374580733780988,52.602685760188358,54.929341522629414,57.516054683563524,59.895933944445034,62.545175477357446,null,null,1852.9370999999999,1872.2076458399999,1891.6786053567359,1916.5886438465623,1931.2301243061113,1951.3149175988951,1971.6085927419235,1997.5711668245392,2012.8313006563465,2033.7647461831723,null,null,2160.7062293970262,2256.2758667058047,2356.0726198765483,2467.0239599984834,2569.1036174228302,2682.7369737696063,2801.3964176541003,2933.3187888617399,3054.6926311666966,3189.8039493452297]
[null,0,"NA","","","","","","","","","","",null,null,"","","","","","","","","","",null,0,0,0,0,0,0,0,0,0,0,null,"","","","","","","","","","",null,"","","","","","","","","","",null,null,0,0,0,0,0,0,0,0,0,0,null,null,0,0,0,0,0,0,0,0,0,0]
[null,0,"NA","","","","","","","","","","",null,null,"","","","","","","","","","",null,0,0,0,0,0,0,0,0,0,0,null,"","","","","","","","","","",null,"","","","","","","","","","",null,null,0,0,0,0,0,0,0,0,0,0,null,null,0,0,0,0,0,0,0,0,0,0]
[null,0,"NA","","","","","","","","","","",null,null,"","","","","","","","","","",null,0,0,0,0,0,0,0,0,0,0,null,"","","","","","","","","","",null,"","","","","","","","","","",null,null,0,0,0,0,0,0,0,0,0,0,null,null,0,0,0,0,0,0,0,0,0,0]
[null,"LED 265","Offered",10.787000000000001,10.8991848,11.012536321920001,11.127066699667969,11.242788193344515,11.359713190555297,11.477854207737071,11.597223891497537,11.71783501996911,11.839700504176788,null,null,12.578699026807612,13.135064203828351,13.716037824817869,14.322708339484334,14.9562123404729,15.617736692763474,16.308520757253319,17.029858712690388,17.783101980307453,18.569661755699631,null,0.91666666666666663,0.91666666666666663,0.91666666666666663,0.91666666666666663,0.91666666666666663,0.91666666666666663,0.91666666666666663,0.91666666666666663,0.91666666666666663,0.91666666666666663,null,39.372550000000004,39.78202452,40.195757575008003,40.725064120784765,41.036176905707478,41.462953145526832,41.894167858240309,42.445839442880988,42.770097822887259,43.214906840245277,null,45.912251447847787,47.942984343973485,50.063538060585223,52.421112522512665,54.590175042726088,57.004738928586676,59.526100763974618,62.329282888446812,64.908322228122202,67.779265408303658,null,null,36.091504166666667,36.466855809999998,36.846111110423998,37.331308777386035,37.616495496898523,38.007707050066259,38.402987203386949,38.908686155974237,39.20592300431332,39.613664603558171,null,null,42.086230493860469,43.947735648642357,45.891576555536453,48.052686478969939,50.040993789165576,52.254344017871119,54.56559236697673,57.135175981076245,59.499295375778679,62.130993290945014]
[null,"LED 30","Offered",9.9540000000000006,10.057521599999999,10.16211982464,10.267805870816256,10.374591051872745,10.482486798812221,10.591504661519869,10.701656309999676,10.812953535623672,10.925408252394158,null,null,11.607339400467504,12.120740621572949,12.656849959046728,13.216671809699363,13.801254995556434,14.411694728818729,15.049134663734085,15.714769039225008,16.40984491628631,17.135664514344505,null,30,30,30,30,30,30,30,30,30,30,null,36.332099999999997,36.709953839999997,37.091737359935998,37.580169487187497,37.867257339335517,38.261076815664609,38.658992014547522,39.16806209459881,39.467280405026401,39.877740121238674,null,42.366788811706392,44.240703268741264,46.197502350520551,48.37301882349967,50.374580733780988,52.602685760188358,54.929341522629414,57.516054683563524,59.895933944445034,62.545175477357446,null,null,1089.963,1101.2986151999999,1112.7521207980799,1127.4050846156249,1136.0177201800655,1147.8323044699382,1159.7697604364257,1175.0418628379643,1184.0184121507921,1196.3322036371601,null,null,1271.0036643511917,1327.2210980622378,1385.9250705156164,1451.19056470499,1511.2374220134298,1578.0805728056507,1647.8802456788824,1725.4816405069057,1796.8780183333511,1876.3552643207233]
[null,"LED 75","Offered",10.38,10.487952,10.597026700799999,10.707235778488318,10.818591030584596,10.931104377302676,11.044787862826624,11.159653656600021,11.275714054628661,11.392981480796799,null,null,12.104097144550201,12.639470328704764,13.198523465431487,13.782303936576188,14.391905450459689,15.028470090932124,15.693190457058446,16.387311897443794,17.112134843384759,17.869017245217595,null,6.333333333333333,6.333333333333333,6.333333333333333,6.333333333333333,6.333333333333333,6.333333333333333,6.333333333333333,6.333333333333333,6.333333333333333,6.333333333333333,null,37.887,38.281024799999997,38.679147457919996,39.188482949267247,39.487857261633778,39.898530977154763,40.313475699317181,40.844332383156079,41.156356299394609,41.584382404908311,null,44.179954577608235,46.13406669977239,48.174610648824931,50.443232407868848,52.530454894177865,54.853915831902249,57.280145168263324,59.977561544644288,62.459292178354374,65.221912945044224,null,null,239.95099999999999,242.44649039999996,244.96793390015995,248.19372534535921,250.08976265701392,252.69069618864683,255.3186794290088,258.68077175998849,260.65692322949917,263.36775523108594,null,null,279.80637899151878,292.18242243189178,305.10586744255789,319.473805249836,332.69288099645979,347.40813360204754,362.77425273233439,379.85788978274712,395.57551712957769,413.07211531861338]
[null,"LED 155","Offered",10.787000000000001,10.8991848,11.012536321920001,11.127066699667969,11.242788193344515,11.359713190555297,11.477854207737071,11.597223891497537,11.71783501996911,11.839700504176788,null,null,12.578699026807612,13.135064203828351,13.716037824817869,14.322708339484334,14.9562123404729,15.617736692763474,16.308520757253319,17.029858712690388,17.783101980307453,18.569661755699631,null,0,0,0,0,0,0,0,0,0,0,null,39.372550000000004,39.78202452,40.195757575008003,40.725064120784765,41.036176905707478,41.462953145526832,41.894167858240309,42.445839442880988,42.770097822887259,43.214906840245277,null,45.912251447847787,47.942984343973485,50.063538060585223,52.421112522512665,54.590175042726088,57.004738928586676,59.526100763974618,62.329282888446812,64.908322228122202,67.779265408303658,null,null,0,0,0,0,0,0,0,0,0,0,null,null,0,0,0,0,0,0,0,0,0,0]
[null,"LED 14","Offered",9.9540000000000006,10.057521599999999,10.16211982464,10.267805870816256,10.374591051872745,10.482486798812221,10.591504661519869,10.701656309999676,10.812953535623672,10.925408252394158,null,null,11.607339400467504,12.120740621572949,12.656849959046728,13.216671809699363,13.801254995556434,14.411694728818729,15.049134663734085,15.714769039225008,16.40984491628631,17.135664514344505,null,15464.250000000002,15593.9,15723.550000000001,15723.550000000001,15723.550000000001,15723.550000000001,15723.550000000001,15723.550000000001,15723.550000000001,15723.550000000001,null,36.332099999999997,36.709953839999997,37.091737359935998,37.580169487187497,37.867257339335517,38.261076815664609,38.658992014547522,39.16806209459881,39.467280405026401,39.877740121238674,null,42.366788811706392,44.240703268741264,46.197502350520551,48.37301882349967,50.374580733780988,52.602685760188358,54.929341522629414,57.516054683563524,59.895933944445034,62.545175477357446,null,null,561848.677425,572451.34918557596,583213.78696582175,590893.67394026706,595407.714137909,601599.95436494332,607856.59389033879,615860.98274752917,620565.75681245292,627019.64068330242,null,null,655170.61388143071,689885.1027024244,726388.73808352742,760595.58012223826,792067.23889664211,827100.95968460967,863684.24789813976,904356.56161974533,941776.71217217878,983432.19387700374]
[null,0,"NA","","","","","","","","","","",null,null,"","","","","","","","","","",null,0,0,0,0,0,0,0,0,0,0,null,"","","","","","","","","","",null,"","","","","","","","","","",null,null,0,0,0,0,0,0,0,0,0,0,null,null,0,0,0,0,0,0,0,0,0,0]
[null,0,"NA","","","","","","","","","","",null,null,"","","","","","","","","","",null,0,0,0,0,0,0,0,0,0,0,null,"","","","","","","","","","",null,"","","","","","","","","","",null,null,0,0,0,0,0,0,0,0,0,0,null,null,0,0,0,0,0,0,0,0,0,0]
[null,0,"NA","","","","","","","","","","",null,null,"","","","","","","","","","",null,0,0,0,0,0,0,0,0,0,0,null,"","","","","","","","","","",null,"","","","","","","","","","",null,null,0,0,0,0,0,0,0,0,0,0,null,null,0,0,0,0,0,0,0,0,0,0]
[null,"LED 17","Offered",9.9540000000000006,10.057521599999999,10.16211982464,10.267805870816256,10.374591051872745,10.482486798812221,10.591504661519869,10.701656309999676,10.812953535623672,10.925408252394158,null,null,11.607339400467504,12.120740621572949,12.656849959046728,13.216671809699363,13.801254995556434,14.411694728818729,15.049134663734085,15.714769039225008,16.40984491628631,17.135664514344505,null,6,6,6,6,6,6,6,6,6,6,null,36.332099999999997,36.709953839999997,37.091737359935998,37.580169487187497,37.867257339335517,38.261076815664609,38.658992014547522,39.16806209459881,39.467280405026401,39.877740121238674,null,42.366788811706392,44.240703268741264,46.197502350520551,48.37301882349967,50.374580733780988,52.602685760188358,54.929341522629414,57.516054683563524,59.895933944445034,62.545175477357446,null,null,217.99259999999998,220.25972303999998,222.550424159616,225.48101692312497,227.20354403601311,229.56646089398765,231.95395208728513,235.00837256759286,236.8036824301584,239.26644072743204,null,null,254.20073287023837,265.44421961244757,277.18501410312331,290.23811294099801,302.24748440268593,315.61611456113013,329.57604913577649,345.09632810138112,359.3756036666702,375.27105286414468]
[null,"LED 175","Offered",10.787000000000001,10.8991848,11.012536321920001,11.127066699667969,11.242788193344515,11.359713190555297,11.477854207737071,11.597223891497537,11.71783501996911,11.839700504176788,null,null,12.578699026807612,13.135064203828351,13.716037824817869,14.322708339484334,14.9562123404729,15.617736692763474,16.308520757253319,17.029858712690388,17.783101980307453,18.569661755699631,null,9.1666666666666661,9.1666666666666661,9.1666666666666661,9.1666666666666661,9.1666666666666661,9.1666666666666661,9.1666666666666661,9.1666666666666661,9.1666666666666661,9.1666666666666661,null,39.372550000000004,39.78202452,40.195757575008003,40.725064120784765,41.036176905707478,41.462953145526832,41.894167858240309,42.445839442880988,42.770097822887259,43.214906840245277,null,45.912251447847787,47.942984343973485,50.063538060585223,52.421112522512665,54.590175042726088,57.004738928586676,59.526100763974618,62.329282888446812,64.908322228122202,67.779265408303658,null,null,360.9150416666667,364.66855809999998,368.46111110423999,373.31308777386033,376.16495496898517,380.07707050066261,384.02987203386948,389.08686155974237,392.0592300431332,396.13664603558169,null,null,420.86230493860467,439.47735648642356,458.91576555536454,480.5268647896994,500.40993789165577,522.54344017871119,545.65592366976728,571.35175981076236,594.99295375778684,621.30993290945014]
[null,"LED 14 New Tech","Offered",9.9540000000000006,10.057521599999999,10.16211982464,10.267805870816256,10.374591051872745,10.482486798812221,10.591504661519869,10.701656309999676,10.812953535623672,10.925408252394158,null,null,11.607339400467504,12.120740621572949,12.656849959046728,13.216671809699363,13.801254995556434,14.411694728818729,15.049134663734085,15.714769039225008,16.40984491628631,17.135664514344505,null,0,0,0,0,0,0,0,0,0,0,null,36.332099999999997,36.709953839999997,37.091737359935998,37.580169487187497,37.867257339335517,38.261076815664609,38.658992014547522,39.16806209459881,39.467280405026401,39.877740121238674,null,42.366788811706392,44.240703268741264,46.197502350520551,48.37301882349967,50.374580733780988,52.602685760188358,54.929341522629414,57.516054683563524,59.895933944445034,62.545175477357446,null,null,0,0,0,0,0,0,0,0,0,0,null,null,0,0,0,0,0,0,0,0,0,0]
[null,"LED 75 New Tech","Offered",10.38,10.487952,10.597026700799999,10.707235778488318,10.818591030584596,10.931104377302676,11.044787862826624,11.159653656600021,11.275714054628661,11.392981480796799,null,null,12.104097144550201,12.639470328704764,13.198523465431487,13.782303936576188,14.391905450459689,15.028470090932124,15.693190457058446,16.387311897443794,17.112134843384759,17.869017245217595,null,0,0,0,0,0,0,0,0,0,0,null,37.887,38.281024799999997,38.679147457919996,39.188482949267247,39.487857261633778,39.898530977154763,40.313475699317181,40.844332383156079,41.156356299394609,41.584382404908311,null,44.179954577608235,46.13406669977239,48.174610648824931,50.443232407868848,52.530454894177865,54.853915831902249,57.280145168263324,59.977561544644288,62.459292178354374,65.221912945044224,null,null,0,0,0,0,0,0,0,0,0,0,null,null,0,0,0,0,0,0,0,0,0,0]
[null,0,"NA","","","","","","","","","","",null,null,"","","","","","","","","","",null,0,0,0,0,0,0,0,0,0,0,null,"","","","","","","","","","",null,"","","","","","","","","","",null,null,0,0,0,0,0,0,0,0,0,0,null,null,0,0,0,0,0,0,0,0,0,0]
[null,0,"NA","","","","","","","","","","",null,null,"","","","","","","","","","",null,0,0,0,0,0,0,0,0,0,0,null,"","","","","","","","","","",null,"","","","","","","","","","",null,null,0,0,0,0,0,0,0,0,0,0,null,null,0,0,0,0,0,0,0,0,0,0]
[null,0,"NA","","","","","","","","","","",null,null,"","","","","","","","","","",null,0,0,0,0,0,0,0,0,0,0,null,"","","","","","","","","","",null,"","","","","","","","","","",null,null,0,0,0,0,0,0,0,0,0,0,null,null,0,0,0,0,0,0,0,0,0,0]
[null,0,"NA","","","","","","","","","","",null,null,"","","","","","","","","","",null,0,0,0,0,0,0,0,0,0,0,null,"","","","","","","","","","",null,"","","","","","","","","","",null,null,0,0,0,0,0,0,0,0,0,0,null,null,0,0,0,0,0,0,0,0,0,0]
[null,0,"NA","","","","","","","","","","",null,null,"","","","","","","","","","",null,0,0,0,0,0,0,0,0,0,0,null,"","","","","","","","","","",null,"","","","","","","","","","",null,null,0,0,0,0,0,0,0,0,0,0,null,null,0,0,0,0,0,0,0,0,0,0]
[null,0,"NA","","","","","","","","","","",null,null,"","","","","","","","","","",null,0,0,0,0,0,0,0,0,0,0,null,"","","","","","","","","","",null,"","","","","","","","","","",null,null,0,0,0,0,0,0,0,0,0,0,null,null,0,0,0,0,0,0,0,0,0,0]
[null,0,"NA","","","","","","","","","","",null,null,"","","","","","","","","","",null,0,0,0,0,0,0,0,0,0,0,null,"","","","","","","","","","",null,"","","","","","","","","","",null,null,0,0,0,0,0,0,0,0,0,0,null,null,0,0,0,0,0,0,0,0,0,0]
[null,0,"NA","","","","","","","","","","",null,null,"","","","","","","","","","",null,0,0,0,0,0,0,0,0,0,0,null,"","","","","","","","","","",null,"","","","","","","","","","",null,null,0,0,0,0,0,0,0,0,0,0,null,null,0,0,0,0,0,0,0,0,0,0]
[null,0,"NA","","","","","","","","","","",null,null,"","","","","","","","","","",null,0,0,0,0,0,0,0,0,0,0,null,"","","","","","","","","","",null,"","","","","","","","","","",null,null,0,0,0,0,0,0,0,0,0,0,null,null,0,0,0,0,0,0,0,0,0,0]
[null,0,"NA","","","","","","","","","","",null,null,"","","","","","","","","","",null,0,0,0,0,0,0,0,0,0,0,null,"","","","","","","","","","",null,"","","","","","","","","","",null,null,0,0,0,0,0,0,0,0,0,0,null,null,0,0,0,0,0,0,0,0,0,0]
[null,null,null,null,null,null,null,null,null,null,null,null,null,null,null,null,null,null,null,null,null,null,null,null,null,null,21620.750000000004,21620.75,21620.75,21620.75,21620.75,21620.75,21620.75,21620.75,21620.75,21620.75,null,null,null,null,null,null,null,null,null,null,null,null,null,null,null,null,null,null,null,null,null,null,null,null,800485.77202083333,801284.99492978002,802014.261134131,812575.36070869293,818782.90362820507,827298.24582593853,835902.1475825283,846909.49027332466,853379.32342852722,862254.468392184,null,null,933444.85042104369,965662.11575446744,998903.21540761995,1045943.2130149064,1089221.8866723557,1137398.9776816736,1187706.9771188518,1243638.054824943,1295096.8767313543,1352379.9710756917]
[null,null,null,null,null,null,null,null,null,null,null,null,null,null,null,null,null,null,null,null,null,null,null,null,null,null,true,true,true,true,true,true,true,true,true,true]
[null,"Public Road Lights"]
[null,null,"Offered / No Longer Offered / NA","2024-25","2025-26","2026-27","2027-28","2028-29","2029-30","2030-31","2031-32","2032-33","2033-34",null,null,"2024-25","2025-26","2026-27","2027-28","2028-29","2029-30","2030-31","2031-32","2032-33","2033-34",null,"2024-25","2025-26","2026-27","2027-28","2028-29","2029-30","2030-31","2031-32","2032-33","2033-34",null,"2028-29","2029-30","2030-31","2031-32","2032-33","2033-34","2034-35","2035-36",{"$error":"#REF!"},{"$error":"#REF!"},null,"2028-29","2029-30","2030-31","2031-32","2032-33","2033-34","2034-35","2035-36",{"$error":"#REF!"},{"$error":"#REF!"},null,null,"2028-29","2029-30","2030-31","2031-32","2032-33","2033-34","2034-35","2035-36",{"$error":"#REF!"},{"$error":"#REF!"},null,null,"2028-29","2029-30","2030-31","2031-32","2032-33","2033-34","2034-35","2035-36",{"$error":"#REF!"},{"$error":"#REF!"}]
[null,"50W Mercury Vapour","Obsolete, no new Connections",34.283999999999999,34.640553599999997,35.000815357439997,35.364823837157374,35.732618005063813,36.104237232316478,36.479721299532571,36.859110401047708,37.242445149218604,37.629766578770479,null,null,39.978503516739792,41.746782345791338,43.593273457500302,45.521436239073033,47.534883088974965,49.637386184731902,51.832884550076294,54.125491434678537,56.519502020289316,59.019401467730269,null,53.6,26.8,0,0,0,0,0,0,0,0,null,0,0,0,0,0,0,0,0,0,0,null,0,0,0,0,0,0,0,0,0,0,null,null,0,0,0,0,0,0,0,0,0,0,null,null,0,0,0,0,0,0,0,0,0,0]
[null,"80W Mercury Vapour","Obsolete, no new Connections",34.271000000000001,34.627418399999996,34.987543551359998,35.351414004294142,35.719068709938803,36.090547024522166,36.465888713577193,36.845133956198396,37.228323349342858,37.615497912176025,null,null,39.963344242859336,41.730952565996233,43.576743514817196,45.504175164778673,47.516858544576507,49.618564401381022,51.813230265303474,54.10496782632913,56.498070637537481,58.997022159041641,null,1165.5666666666666,582.7833333333333,0,0,0,0,0,0,0,0,null,0,0,0,0,0,0,0,0,0,0,null,0,0,0,0,0,0,0,0,0,0,null,null,0,0,0,0,0,0,0,0,0,0,null,null,0,0,0,0,0,0,0,0,0,0]
[null,"125W Mercury Vapour","Obsolete, no new Connections",37.101999999999997,37.487860799999993,37.877734552319993,38.271662991664122,38.669688286777429,39.071853044959916,39.4782003166275,39.888773599920427,40.303616845359599,40.722774460551335,null,null,43.264567654826735,45.17819153522197,47.176456417576013,49.263106036112696,51.442049713194166,53.717369683406915,56.093328741597546,58.574378229186877,61.165166373724595,63.870546997308594,null,37.6,18.8,0,0,0,0,0,0,0,0,null,0,0,0,0,0,0,0,0,0,0,null,0,0,0,0,0,0,0,0,0,0,null,null,0,0,0,0,0,0,0,0,0,0,null,null,0,0,0,0,0,0,0,0,0,0]
[null,"250W Mercury Vapour","Obsolete, no new Connections",37.374000000000002,37.762689600000002,38.155421571840002,38.552237956187135,38.953181230931477,39.358294315733161,39.767620576616785,40.181203830613597,40.599088350451979,41.021318869296678,null,null,43.581746308325549,45.509399235550276,47.522313679868638,49.624260821348606,51.819178642146483,54.111179304286829,56.504556853767085,59.003795265420457,61.613576843609039,64.338790994485777,null,130.80000000000001,65.400000000000006,0,0,0,0,0,0,0,0,null,0,0,0,0,0,0,0,0,0,0,null,0,0,0,0,0,0,0,0,0,0,null,null,0,0,0,0,0,0,0,0,0,0,null,null,0,0,0,0,0,0,0,0,0,0]
[null,0,"NA","","","","","","","","","","",null,null,"","","","","","","","","","",null,0,0,0,0,0,0,0,0,0,0,null,"","","","","","","","","","",null,"","","","","","","","","","",null,null,0,0,0,0,0,0,0,0,0,0,null,null,0,0,0,0,0,0,0,0,0,0]
[null,"400W Mercury Vapour","Obsolete, no new Connections",40.704000000000001,41.127321600000002,41.555045744639997,41.98721822038425,42.423885289876246,42.865093696890959,43.310890671338626,43.761323934320544,44.216441703237479,44.676292696951144,null,null,47.464852617704366,49.564258213834172,51.7565220748481,54.045751390597033,56.436235014981818,58.932451501088757,61.539077491725152,64.2609964810744,67.103307963885655,70.071336989338818,null,78.400000000000006,39.200000000000003,0,0,0,0,0,0,0,0,null,0,0,0,0,0,0,0,0,0,0,null,0,0,0,0,0,0,0,0,0,0,null,null,0,0,0,0,0,0,0,0,0,0,null,null,0,0,0,0,0,0,0,0,0,0]
[null,"70W Sodium Vapour","Offered",35.174999999999997,35.540819999999997,35.910444527999992,36.283913151091191,36.661265847862538,37.042543012680305,37.427785460012181,37.817034428796305,38.210331586855787,38.607719035359089,null,null,41.017496826546555,42.831731099440269,44.726210298319124,46.70448371570977,48.770257631976833,50.927402259011316,53.179958991043428,55.532147976164296,57.988376022741683,60.553244855542275,null,54.6,27.3,0,0,0,0,0,0,0,0,null,0,0,0,0,0,0,0,0,0,0,null,0,0,0,0,0,0,0,0,0,0,null,null,0,0,0,0,0,0,0,0,0,0,null,null,0,0,0,0,0,0,0,0,0,0]
[null,0,"NA","","","","","","","","","","",null,null,"","","","","","","","","","",null,0,0,0,0,0,0,0,0,0,0,null,"","","","","","","","","","",null,"","","","","","","","","","",null,null,0,0,0,0,0,0,0,0,0,0,null,null,0,0,0,0,0,0,0,0,0,0]
[null,"100W Sodium Vapour","Offered",38.994,39.399537599999995,39.809292791039994,40.223309436066806,40.641631854201897,41.064304825485593,41.491373595670645,41.922883881065616,42.358881873428693,42.799414244912349,null,null,45.470825053428754,47.482033333093781,49.582198844993776,51.775256233415398,54.065314174877173,56.456663075703965,58.953783110070994,61.56135261357641,64.284256848067912,67.127597154143984,null,97.200000000000017,48.600000000000009,0,0,0,0,0,0,0,0,null,0,0,0,0,0,0,0,0,0,0,null,0,0,0,0,0,0,0,0,0,0,null,null,0,0,0,0,0,0,0,0,0,0,null,null,0,0,0,0,0,0,0,0,0,0]
[null,0,"NA","","","","","","","","","","",null,null,"","","","","","","","","","",null,0,0,0,0,0,0,0,0,0,0,null,"","","","","","","","","","",null,"","","","","","","","","","",null,null,0,0,0,0,0,0,0,0,0,0,null,null,0,0,0,0,0,0,0,0,0,0]
[null,"150W Sodium Vapour","Offered",39.174999999999997,39.582419999999999,39.994077167999997,40.410015570547195,40.830279732480882,41.254914641698683,41.683965753972345,42.117478997813656,42.555500779390918,42.998077987496579,null,null,45.681888789764358,47.702432574856367,49.812346508504675,52.015583498590772,54.316271293040302,56.718720213127746,59.227431228830881,61.847104391364219,64.582647638689565,67.439185990500874,null,1605.6000000000001,802.80000000000007,0,0,0,0,0,0,0,0,null,0,0,0,0,0,0,0,0,0,0,null,0,0,0,0,0,0,0,0,0,0,null,null,0,0,0,0,0,0,0,0,0,0,null,null,0,0,0,0,0,0,0,0,0,0]
[null,0,"NA","","","","","","","","","","",null,null,"","","","","","","","","","",null,0,0,0,0,0,0,0,0,0,0,null,"","","","","","","","","","",null,"","","","","","","","","","",null,null,0,0,0,0,0,0,0,0,0,0,null,null,0,0,0,0,0,0,0,0,0,0]
[null,0,"NA","","","","","","","","","","",null,null,"","","","","","","","","","",null,0,0,0,0,0,0,0,0,0,0,null,"","","","","","","","","","",null,"","","","","","","","","","",null,null,0,0,0,0,0,0,0,0,0,0,null,null,0,0,0,0,0,0,0,0,0,0]
[null,0,"NA","","","","","","","","","","",null,null,"","","","","","","","","","",null,0,0,0,0,0,0,0,0,0,0,null,"","","","","","","","","","",null,"","","","","","","","","","",null,null,0,0,0,0,0,0,0,0,0,0,null,null,0,0,0,0,0,0,0,0,0,0]
[null,"250W Sodium Vapour","Offered",40.456000000000003,40.876742400000005,41.301860520960005,41.731399870377984,42.165406429029915,42.603926655891826,43.047007493113099,43.494696371041471,43.947041213300302,44.404090441918626,null,null,47.175660315984871,49.262274722358377,51.441181629816604,53.716463204058421,56.092382167995886,58.573389787933543,61.164134212982333,63.869469183332008,66.694463123696892,69.644408638971399,null,1994.2333333333331,997.11666666666656,0,0,0,0,0,0,0,0,null,0,0,0,0,0,0,0,0,0,0,null,0,0,0,0,0,0,0,0,0,0,null,null,0,0,0,0,0,0,0,0,0,0,null,null,0,0,0,0,0,0,0,0,0,0]
[null,0,"NA","","","","","","","","","","",null,null,"","","","","","","","","","",null,0,0,0,0,0,0,0,0,0,0,null,"","","","","","","","","","",null,"","","","","","","","","","",null,null,0,0,0,0,0,0,0,0,0,0,null,null,0,0,0,0,0,0,0,0,0,0]
[null,0,"NA","","","","","","","","","","",null,null,"","","","","","","","","","",null,0,0,0,0,0,0,0,0,0,0,null,"","","","","","","","","","",null,"","","","","","","","","","",null,null,0,0,0,0,0,0,0,0,0,0,null,null,0,0,0,0,0,0,0,0,0,0]
[null,0,"NA","","","","","","","","","","",null,null,"","","","","","","","","","",null,0,0,0,0,0,0,0,0,0,0,null,"","","","","","","","","","",null,"","","","","","","","","","",null,null,0,0,0,0,0,0,0,0,0,0,null,null,0,0,0,0,0,0,0,0,0,0]
[null,"400W Sodium Vapour","Offered",41.164000000000001,41.592105600000004,42.024663498240002,42.461719998621696,42.903321886607358,43.349516434228072,43.800351405144042,44.255875059757535,44.716136160379016,45.181183976446952,null,null,48.001257693474415,50.124388883507024,52.341427739019444,54.656527865628355,57.074026586004116,59.598453065812144,62.234536799070703,64.987216468822382,67.861649199719665,70.863220219859045,null,174.7,87.35,0,0,0,0,0,0,0,0,null,0,0,0,0,0,0,0,0,0,0,null,0,0,0,0,0,0,0,0,0,0,null,null,0,0,0,0,0,0,0,0,0,0,null,null,0,0,0,0,0,0,0,0,0,0]
[null,0,"NA","","","","","","","","","","",null,null,"","","","","","","","","","",null,0,0,0,0,0,0,0,0,0,0,null,"","","","","","","","","","",null,"","","","","","","","","","",null,null,0,0,0,0,0,0,0,0,0,0,null,null,0,0,0,0,0,0,0,0,0,0]
[null,"250W Sodium Vapour - Flood Light","Offered",41.969000000000001,42.405477599999998,42.846494567039997,43.292098110537211,43.742335930886796,44.197256224568015,44.656907689303523,45.121339529272277,45.590601460376703,46.064743715564617,null,null,48.939966576072003,51.104617555434508,53.365012651319276,55.72538669693315,58.190161835293139,60.763955804078066,63.451590586925427,66.258101447381364,69.188746362429157,72.249015873269457,null,9.1333333333333329,4.5666666666666664,0,0,0,0,0,0,0,0,null,0,0,0,0,0,0,0,0,0,0,null,0,0,0,0,0,0,0,0,0,0,null,null,0,0,0,0,0,0,0,0,0,0,null,null,0,0,0,0,0,0,0,0,0,0]
[null,"400W Sodium Vapour - Flood Light","Offered",41.164000000000001,41.592105600000004,42.024663498240002,42.461719998621696,42.903321886607358,43.349516434228072,43.800351405144042,44.255875059757535,44.716136160379016,45.181183976446952,null,null,48.001257693474415,50.124388883507024,52.341427739019444,54.656527865628355,57.074026586004116,59.598453065812144,62.234536799070703,64.987216468822382,67.861649199719665,70.863220219859045,null,3.7333333333333338,1.8666666666666669,0,0,0,0,0,0,0,0,null,0,0,0,0,0,0,0,0,0,0,null,0,0,0,0,0,0,0,0,0,0,null,null,0,0,0,0,0,0,0,0,0,0,null,null,0,0,0,0,0,0,0,0,0,0]
[null,"1x20W Fluorescent","Obsolete, no new Connections",36.18,36.556272,36.936457228800002,37.32059638397952,37.708730586372909,38.100901384471186,38.497150758869687,38.89752112676193,39.302055346480252,39.710796722083643,null,null,42.189425307305029,44.055494845138568,46.004102021128254,48.038897536158629,50.163693564319047,52.382470894983086,54.699386390787545,57.118780775483295,59.645186766248614,62.283337565700634,null,2.4000000000000004,1.2000000000000002,0,0,0,0,0,0,0,0,null,0,0,0,0,0,0,0,0,0,0,null,0,0,0,0,0,0,0,0,0,0,null,null,0,0,0,0,0,0,0,0,0,0,null,null,0,0,0,0,0,0,0,0,0,0]
[null,"1x40W Fluorescent","Obsolete, no new Connections",36.18,36.556272,36.936457228800002,37.32059638397952,37.708730586372909,38.100901384471186,38.497150758869687,38.89752112676193,39.302055346480252,39.710796722083643,null,null,42.189425307305029,44.055494845138568,46.004102021128254,48.038897536158629,50.163693564319047,52.382470894983086,54.699386390787545,57.118780775483295,59.645186766248614,62.283337565700634,null,16,8,0,0,0,0,0,0,0,0,null,0,0,0,0,0,0,0,0,0,0,null,0,0,0,0,0,0,0,0,0,0,null,null,0,0,0,0,0,0,0,0,0,0,null,null,0,0,0,0,0,0,0,0,0,0]
[null,"2x20W Fluorescent","Obsolete, no new Connections",36.18,36.556272,36.936457228800002,37.32059638397952,37.708730586372909,38.100901384471186,38.497150758869687,38.89752112676193,39.302055346480252,39.710796722083643,null,null,42.189425307305029,44.055494845138568,46.004102021128254,48.038897536158629,50.163693564319047,52.382470894983086,54.699386390787545,57.118780775483295,59.645186766248614,62.283337565700634,null,2,1,0,0,0,0,0,0,0,0,null,0,0,0,0,0,0,0,0,0,0,null,0,0,0,0,0,0,0,0,0,0,null,null,0,0,0,0,0,0,0,0,0,0,null,null,0,0,0,0,0,0,0,0,0,0]
[null,"2x24W Fluorescent","Obsolete, no new Connections",36.18,36.556272,36.936457228800002,37.32059638397952,37.708730586372909,38.100901384471186,38.497150758869687,38.89752112676193,39.302055346480252,39.710796722083643,null,null,42.189425307305029,44.055494845138568,46.004102021128254,48.038897536158629,50.163693564319047,52.382470894983086,54.699386390787545,57.118780775483295,59.645186766248614,62.283337565700634,null,0.4,0.2,0,0,0,0,0,0,0,0,null,0,0,0,0,0,0,0,0,0,0,null,0,0,0,0,0,0,0,0,0,0,null,null,0,0,0,0,0,0,0,0,0,0,null,null,0,0,0,0,0,0,0,0,0,0]
[null,"2x40W Fluorescent","Obsolete, no new Connections",36.18,36.556272,36.936457228800002,37.32059638397952,37.708730586372909,38.100901384471186,38.497150758869687,38.89752112676193,39.302055346480252,39.710796722083643,null,null,42.189425307305029,44.055494845138568,46.004102021128254,48.038897536158629,50.163693564319047,52.382470894983086,54.699386390787545,57.118780775483295,59.645186766248614,62.283337565700634,null,0.8,0.4,0,0,0,0,0,0,0,0,null,0,0,0,0,0,0,0,0,0,0,null,0,0,0,0,0,0,0,0,0,0,null,null,0,0,0,0,0,0,0,0,0,0,null,null,0,0,0,0,0,0,0,0,0,0]
[null,"4x40W Fluorescent","Obsolete, no new Connections",36.18,36.556272,36.936457228800002,37.32059638397952,37.708730586372909,38.100901384471186,38.497150758869687,38.89752112676193,39.302055346480252,39.710796722083643,null,null,42.189425307305029,44.055494845138568,46.004102021128254,48.038897536158629,50.163693564319047,52.382470894983086,54.699386390787545,57.118780775483295,59.645186766248614,62.283337565700634,null,0.4,0.2,0,0,0,0,0,0,0,0,null,0,0,0,0,0,0,0,0,0,0,null,0,0,0,0,0,0,0,0,0,0,null,null,0,0,0,0,0,0,0,0,0,0,null,null,0,0,0,0,0,0,0,0,0,0]
[null,"32W Compact Fluorescent","Not Offered",36.18,36.556272,36.936457228800002,37.32059638397952,37.708730586372909,38.100901384471186,38.497150758869687,38.89752112676193,39.302055346480252,39.710796722083643,null,null,42.189425307305029,44.055494845138568,46.004102021128254,48.038897536158629,50.163693564319047,52.382470894983086,54.699386390787545,57.118780775483295,59.645186766248614,62.283337565700634,null,0,0,0,0,0,0,0,0,0,0,null,0,0,0,0,0,0,0,0,0,0,null,0,0,0,0,0,0,0,0,0,0,null,null,0,0,0,0,0,0,0,0,0,0,null,null,0,0,0,0,0,0,0,0,0,0]
[null,"42W Compact Fluorescent","Offered",36.18,36.556272,36.936457228800002,37.32059638397952,37.708730586372909,38.100901384471186,38.497150758869687,38.89752112676193,39.302055346480252,39.710796722083643,null,null,42.189425307305029,44.055494845138568,46.004102021128254,48.038897536158629,50.163693564319047,52.382470894983086,54.699386390787545,57.118780775483295,59.645186766248614,62.283337565700634,null,971.06666666666672,485.53333333333336,0,0,0,0,0,0,0,0,null,0,0,0,0,0,0,0,0,0,0,null,0,0,0,0,0,0,0,0,0,0,null,null,0,0,0,0,0,0,0,0,0,0,null,null,0,0,0,0,0,0,0,0,0,0]
[null,0,"NA","","","","","","","","","","",null,null,"","","","","","","","","","",null,0,0,0,0,0,0,0,0,0,0,null,"","","","","","","","","","",null,"","","","","","","","","","",null,null,0,0,0,0,0,0,0,0,0,0,null,null,0,0,0,0,0,0,0,0,0,0]
[null,"60W Incandescent","Obsolete, no new Connections",35.174999999999997,35.540819999999997,35.910444527999992,36.283913151091191,36.661265847862538,37.042543012680305,37.427785460012181,37.817034428796305,38.210331586855787,38.607719035359089,null,null,41.017496826546555,42.831731099440269,44.726210298319124,46.70448371570977,48.770257631976833,50.927402259011316,53.179958991043428,55.532147976164296,57.988376022741683,60.553244855542275,null,2.4000000000000004,1.2000000000000002,0,0,0,0,0,0,0,0,null,0,0,0,0,0,0,0,0,0,0,null,0,0,0,0,0,0,0,0,0,0,null,null,0,0,0,0,0,0,0,0,0,0,null,null,0,0,0,0,0,0,0,0,0,0]
[null,"100W Incandescent","Obsolete, no new Connections",38.567999999999998,38.969107199999996,39.374385914879994,39.783879528394742,40.197631875490046,40.615687246995144,41.038090394363891,41.464886534465272,41.896121354423713,42.331841016509721,null,null,44.974067309346061,46.96330362596197,49.040525338609015,51.209624106538577,53.474663719973918,55.839887713590578,58.309727316746638,60.888809755357627,63.581966920969478,66.394244423270919,null,3.6,1.8,0,0,0,0,0,0,0,0,null,0,0,0,0,0,0,0,0,0,0,null,0,0,0,0,0,0,0,0,0,0,null,null,0,0,0,0,0,0,0,0,0,0,null,null,0,0,0,0,0,0,0,0,0,0]
[null,"100W Metal Halide","Offered",38.274000000000001,38.672049600000001,39.074238915839999,39.480611000564735,39.891209354970606,40.306077932262298,40.725261142757823,41.148803858642502,41.576751418772382,42.009149633527613,null,null,44.631234500049551,46.605307067518893,48.666694327160386,50.819258272496832,53.067031715885769,55.414225843963024,57.865238107269263,60.424660458840442,63.09728795719731,65.888127749851463,null,0,0,0,0,0,0,0,0,0,0,null,0,0,0,0,0,0,0,0,0,0,null,0,0,0,0,0,0,0,0,0,0,null,null,0,0,0,0,0,0,0,0,0,0,null,null,0,0,0,0,0,0,0,0,0,0]
[null,"150W Metal Halide","Offered",41.136000000000003,41.563814399999998,41.996078069759996,42.432837281685501,42.874138789415028,43.320029832824943,43.770558143086319,44.225771947774412,44.685719976031265,45.150451463781991,null,null,47.968606949731893,50.090293973179108,52.30582478554814,54.619350167148184,57.035204490376671,59.557913840133331,62.192204493406187,64.943011773915984,67.815489298408025,70.815018631914342,null,6,3,0,0,0,0,0,0,0,0,null,0,0,0,0,0,0,0,0,0,0,null,0,0,0,0,0,0,0,0,0,0,null,null,0,0,0,0,0,0,0,0,0,0,null,null,0,0,0,0,0,0,0,0,0,0]
[null,"250W Metal Halide","Offered",40.274000000000001,40.692849600000002,41.116055235840001,41.543662210292737,41.975716297279781,42.412263746771487,42.853351289737908,43.299026143151181,43.749336015039951,44.204329109596365,null,null,46.963430481658456,49.040657805226942,51.209762432253157,53.474808163937332,55.840038546417503,58.309884821021242,60.888974226163,63.582138666440407,66.394423765171254,69.33109831733077,null,8,4,0,0,0,0,0,0,0,0,null,0,0,0,0,0,0,0,0,0,0,null,0,0,0,0,0,0,0,0,0,0,null,null,0,0,0,0,0,0,0,0,0,0,null,null,0,0,0,0,0,0,0,0,0,0]
[null,"400W Metal Halide","Offered",48.043999999999997,48.543657599999996,49.048511639039994,49.558616160086011,50.074025768150904,50.594795636139672,51.12098151075552,51.652639718467377,52.189827171539434,52.732601374123441,null,null,56.024011870209037,58.501995421222695,61.089582020538572,63.791619492183663,66.613170083033282,69.559519946892394,72.63618904806512,75.848941502966241,79.20379637915002,82.707038971987856,null,0.4,0.2,0,0,0,0,0,0,0,0,null,0,0,0,0,0,0,0,0,0,0,null,0,0,0,0,0,0,0,0,0,0,null,null,0,0,0,0,0,0,0,0,0,0,null,null,0,0,0,0,0,0,0,0,0,0]
[null,"400W Metal Halide - Flood Light","Offered",40.844000000000001,41.2687776,41.697972887039995,42.131631805065211,42.569800775837891,43.012526703906602,43.459856981627226,43.911839494236148,44.368522624976201,44.829955260275952,null,null,47.628106336416991,49.73473276547373,51.934536842204594,54.231639882997868,56.630345493119044,59.13514762948283,61.750739020047703,64.48201995560639,67.334107470443826,70.312344929062363,null,0,0,0,0,0,0,0,0,0,0,null,0,0,0,0,0,0,0,0,0,0,null,0,0,0,0,0,0,0,0,0,0,null,null,0,0,0,0,0,0,0,0,0,0,null,null,0,0,0,0,0,0,0,0,0,0]
[null,"LED 18","Offered",32.378999999999998,32.715741599999994,33.05598531263999,33.399767559891444,33.747125142514314,34.098095243996461,34.452715434534021,34.811023675053171,35.173058321273722,35.538858127814969,null,null,37.757086844257309,39.427110768124415,41.171001087399425,42.992024967475949,44.893594082893472,46.879271009083929,48.952775896829984,51.117993441939539,53.3789801631941,55.739972002206187,null,7295.4833333333345,9319.7833333333347,11344.083333333334,11344.083333333334,11344.083333333334,11344.083333333334,11344.083333333334,11344.083333333334,11344.083333333334,11344.083333333334,null,0,0,0,0,0,0,0,0,0,0,null,0,0,0,0,0,0,0,0,0,0,null,null,0,0,0,0,0,0,0,0,0,0,null,null,0,0,0,0,0,0,0,0,0,0]
[null,0,"NA","","","","","","","","","","",null,null,"","","","","","","","","","",null,0,0,0,0,0,0,0,0,0,0,null,"","","","","","","","","","",null,"","","","","","","","","","",null,null,0,0,0,0,0,0,0,0,0,0,null,null,0,0,0,0,0,0,0,0,0,0]
[null,0,"NA","","","","","","","","","","",null,null,"","","","","","","","","","",null,0,0,0,0,0,0,0,0,0,0,null,"","","","","","","","","","",null,"","","","","","","","","","",null,null,0,0,0,0,0,0,0,0,0,0,null,null,0,0,0,0,0,0,0,0,0,0]
[null,0,"NA","","","","","","","","","","",null,null,"","","","","","","","","","",null,0,0,0,0,0,0,0,0,0,0,null,"","","","","","","","","","",null,"","","","","","","","","","",null,null,0,0,0,0,0,0,0,0,0,0,null,null,0,0,0,0,0,0,0,0,0,0]
[null,"LED 20","Offered",45.997999999999998,46.476379199999997,46.959733543679995,47.448114772534268,47.941575166168626,48.440167547896777,48.9439452903949,49.452962321415008,49.967273129557725,50.48693277010512,null,null,53.638175381023132,56.010631616547364,58.488023349028666,61.074991953240037,63.776384095399315,66.597260813361842,69.542906998436848,72.618841296591498,75.830826447592685,79.184880081456541,null,48.666666666666664,48.666666666666664,48.666666666666664,48.666666666666664,48.666666666666664,48.666666666666664,48.666666666666664,48.666666666666664,48.666666666666664,48.666666666666664,null,0,0,0,0,0,0,0,0,0,0,null,0,0,0,0,0,0,0,0,0,0,null,null,0,0,0,0,0,0,0,0,0,0,null,null,0,0,0,0,0,0,0,0,0,0]
[null,"LED 200","Offered",45.201999999999998,45.672100799999996,46.147090648319995,46.627020391062523,47.11194140312957,47.601905593722115,48.096965411896825,48.597173852180553,49.102584460243229,49.613251338629759,null,null,52.709961380342783,55.041362022939559,57.475882243201745,60.018083096446716,62.672727376847682,65.444788540492667,68.339460023117141,71.362164969966713,74.518566396019054,77.814577795599774,null,4,4,4,4,4,4,4,4,4,4,null,0,0,0,0,0,0,0,0,0,0,null,0,0,0,0,0,0,0,0,0,0,null,null,0,0,0,0,0,0,0,0,0,0,null,null,0,0,0,0,0,0,0,0,0,0]
[null,"LED 240","Offered",45.201999999999998,45.672100799999996,46.147090648319995,46.627020391062523,47.11194140312957,47.601905593722115,48.096965411896825,48.597173852180553,49.102584460243229,49.613251338629759,null,null,52.709961380342783,55.041362022939559,57.475882243201745,60.018083096446716,62.672727376847682,65.444788540492667,68.339460023117141,71.362164969966713,74.518566396019054,77.814577795599774,null,30.833333333333332,30.833333333333332,30.833333333333332,30.833333333333332,30.833333333333332,30.833333333333332,30.833333333333332,30.833333333333332,30.833333333333332,30.833333333333332,null,0,0,0,0,0,0,0,0,0,0,null,0,0,0,0,0,0,0,0,0,0,null,null,0,0,0,0,0,0,0,0,0,0,null,null,0,0,0,0,0,0,0,0,0,0]
[null,"LED 25","Offered",42.637999999999998,43.081435199999994,43.529482126079991,43.982188740191219,44.439603503089209,44.901775379521332,45.368753843468355,45.840588883440425,46.317331007828201,46.799031250309611,null,null,49.720086131920176,51.919242377197847,54.215668932472802,56.613668135619989,59.117732620105997,61.732553731904034,64.463030318695374,67.314277907823552,70.291638290196445,73.400689528091291,null,75,75,75,75,75,75,75,75,75,75,null,0,0,0,0,0,0,0,0,0,0,null,0,0,0,0,0,0,0,0,0,0,null,null,0,0,0,0,0,0,0,0,0,0,null,null,0,0,0,0,0,0,0,0,0,0]
[null,0,"NA","","","","","","","","","","",null,null,"","","","","","","","","","",null,0,0,0,0,0,0,0,0,0,0,null,"","","","","","","","","","",null,"","","","","","","","","","",null,null,0,0,0,0,0,0,0,0,0,0,null,null,0,0,0,0,0,0,0,0,0,0]
[null,0,"NA","","","","","","","","","","",null,null,"","","","","","","","","","",null,0,0,0,0,0,0,0,0,0,0,null,"","","","","","","","","","",null,"","","","","","","","","","",null,null,0,0,0,0,0,0,0,0,0,0,null,null,0,0,0,0,0,0,0,0,0,0]
[null,0,"NA","","","","","","","","","","",null,null,"","","","","","","","","","",null,0,0,0,0,0,0,0,0,0,0,null,"","","","","","","","","","",null,"","","","","","","","","","",null,null,0,0,0,0,0,0,0,0,0,0,null,null,0,0,0,0,0,0,0,0,0,0]
[null,"LED 265","Offered",41.728999999999999,42.162981599999995,42.601476608639992,43.044531965369849,43.492195097809692,43.944513926826907,44.401536871665904,44.863312855131227,45.329891308824592,45.801322178436365,null,null,48.660103058278928,50.812375466909536,53.059844478708136,55.40672070996029,57.857401015629321,60.416476726831078,63.088742252658164,65.879204062469356,68.793090065472285,71.835859405171945,null,44,44,44,44,44,44,44,44,44,44,null,0,0,0,0,0,0,0,0,0,0,null,0,0,0,0,0,0,0,0,0,0,null,null,0,0,0,0,0,0,0,0,0,0,null,null,0,0,0,0,0,0,0,0,0,0]
[null,"LED 30","Offered",32.444000000000003,32.781417600000005,33.122344343040005,33.466816724207618,33.814871618139378,34.166546282968028,34.521878364310894,34.880905899299727,35.243667320652442,35.610201460787223,null,null,37.832883213659606,39.50625966709994,41.25365080081496,43.078330338947779,44.983716804885773,46.973379925838344,49.05104732069406,51.220611483686568,53.486137076953291,55.851868545649296,null,0,0,0,0,0,0,0,0,0,0,null,0,0,0,0,0,0,0,0,0,0,null,0,0,0,0,0,0,0,0,0,0,null,null,0,0,0,0,0,0,0,0,0,0,null,null,0,0,0,0,0,0,0,0,0,0]
[null,"LED 75","Offered",40.405000000000001,40.825212000000001,41.249794204799997,41.678792064529915,42.112251502001023,42.550218917621834,42.992741194365102,43.439865702786499,43.891640306095475,44.348113365278863,null,null,47.116189318453841,49.200173278546821,51.376333393136733,53.64874668182668,56.021670493817318,58.499550484018549,61.087028941950535,63.788953489038207,66.610386160593549,69.556612889500656,null,386,386,386,386,386,386,386,386,386,386,null,0,0,0,0,0,0,0,0,0,0,null,0,0,0,0,0,0,0,0,0,0,null,null,0,0,0,0,0,0,0,0,0,0,null,null,0,0,0,0,0,0,0,0,0,0]
[null,"LED 155","Offered",30.882000000000001,31.203172800000001,31.52768579712,31.855573729410047,32.186871696195908,32.521615161836344,32.859839959519441,33.20158229509844,33.546878750967466,33.895766289977523,null,null,36.011438152023054,37.604250740949951,39.2675146107375,41.004345873732746,42.817998470240482,44.711870264755866,46.689509411838046,48.754621003550987,50.911074010925631,53.162908532447943,null,14,14,14,14,14,14,14,14,14,14,null,0,0,0,0,0,0,0,0,0,0,null,0,0,0,0,0,0,0,0,0,0,null,null,0,0,0,0,0,0,0,0,0,0,null,null,0,0,0,0,0,0,0,0,0,0]
[null,"LED 14","Offered",31.341999999999999,31.667956799999999,31.997303550719998,32.330075507647486,32.66630829292702,33.006037899173457,33.349300693324857,33.696133420535432,34.046573208109002,34.400657569473331,null,null,36.547843227793095,38.164381410622802,39.85242027490883,41.615122348764061,43.45579004126278,45.377871829479254,47.384968719183597,49.480840991298969,51.669415246759634,53.954791762968178,null,15104.133333333333,16289.15,17474.166666666664,17474.166666666664,17474.166666666664,17474.166666666664,17474.166666666664,17474.166666666664,17474.166666666664,17474.166666666664,null,0,0,0,0,0,0,0,0,0,0,null,0,0,0,0,0,0,0,0,0,0,null,null,0,0,0,0,0,0,0,0,0,0,null,null,0,0,0,0,0,0,0,0,0,0]
[null,0,"NA","","","","","","","","","","",null,null,"","","","","","","","","","",null,0,0,0,0,0,0,0,0,0,0,null,"","","","","","","","","","",null,"","","","","","","","","","",null,null,0,0,0,0,0,0,0,0,0,0,null,null,0,0,0,0,0,0,0,0,0,0]
[null,0,"NA","","","","","","","","","","",null,null,"","","","","","","","","","",null,0,0,0,0,0,0,0,0,0,0,null,"","","","","","","","","","",null,"","","","","","","","","","",null,null,0,0,0,0,0,0,0,0,0,0,null,null,0,0,0,0,0,0,0,0,0,0]
[null,0,"NA","","","","","","","","","","",null,null,"","","","","","","","","","",null,0,0,0,0,0,0,0,0,0,0,null,"","","","","","","","","","",null,"","","","","","","","","","",null,null,0,0,0,0,0,0,0,0,0,0,null,null,0,0,0,0,0,0,0,0,0,0]
[null,"LED 17","Offered",37.149000000000001,37.535349599999996,37.925717235839997,38.320144695092729,38.718674199921693,39.121348411600877,39.528210435081526,39.939303823606373,40.35467258337188,40.774361178238948,null,null,43.319374260394547,45.235422277558115,47.236218518045696,49.325511458561543,51.507215373711659,53.785417669367774,56.16438654039154,58.648578967065461,61.242649065211971,63.951456805644355,null,15.666666666666666,15.666666666666666,15.666666666666666,15.666666666666666,15.666666666666666,15.666666666666666,15.666666666666666,15.666666666666666,15.666666666666666,15.666666666666666,null,0,0,0,0,0,0,0,0,0,0,null,0,0,0,0,0,0,0,0,0,0,null,null,0,0,0,0,0,0,0,0,0,0,null,null,0,0,0,0,0,0,0,0,0,0]
[null,"LED 175","Offered",40.771000000000001,41.195018400000002,41.62344659136,42.056330435910141,42.493716272443606,42.935650921677016,43.382181691262453,43.833356380851583,44.289223287212437,44.749831209399446,null,null,47.542981183088266,49.645842463547389,51.841714856368711,54.134712311960293,56.529130743804636,59.029456076820203,61.640372651708084,64.366772001028991,67.213762013452779,70.186676503349375,null,799.58333333333337,799.58333333333337,799.58333333333337,799.58333333333337,799.58333333333337,799.58333333333337,799.58333333333337,799.58333333333337,799.58333333333337,799.58333333333337,null,0,0,0,0,0,0,0,0,0,0,null,0,0,0,0,0,0,0,0,0,0,null,null,0,0,0,0,0,0,0,0,0,0,null,null,0,0,0,0,0,0,0,0,0,0]
[null,"LED 14 New Tech","Offered",31.965,32.297435999999998,32.633329334399996,32.972715959477753,33.315632205456318,33.662114780393061,34.012200774109147,34.365927662159883,34.723333309846346,35.08445597626875,null,null,37.274322276064275,38.922993165418859,40.644585989645229,42.442326139947774,44.319581668973406,46.279869600832882,48.326862520218988,50.464395452966357,52.69647305094351,55.02727709473799,null,1,1,1,1,1,1,1,1,1,1,null,0,0,0,0,0,0,0,0,0,0,null,0,0,0,0,0,0,0,0,0,0,null,null,0,0,0,0,0,0,0,0,0,0,null,null,0,0,0,0,0,0,0,0,0,0]
[null,"LED 75 New Tech","Offered",40.405000000000001,40.825212000000001,41.249794204799997,41.678792064529915,42.112251502001023,42.550218917621834,42.992741194365102,43.439865702786499,43.891640306095475,44.348113365278863,null,null,47.116189318453841,49.200173278546821,51.376333393136733,53.64874668182668,56.021670493817318,58.499550484018549,61.087028941950535,63.788953489038207,66.610386160593549,69.556612889500656,null,1,1,1,1,1,1,1,1,1,1,null,0,0,0,0,0,0,0,0,0,0,null,0,0,0,0,0,0,0,0,0,0,null,null,0,0,0,0,0,0,0,0,0,0,null,null,0,0,0,0,0,0,0,0,0,0]
[null,0,"NA","","","","","","","","","","",null,null,"","","","","","","","","","",null,0,0,0,0,0,0,0,0,0,0,null,"","","","","","","","","","",null,"","","","","","","","","","",null,null,0,0,0,0,0,0,0,0,0,0,null,null,0,0,0,0,0,0,0,0,0,0]
[null,0,"NA","","","","","","","","","","",null,null,"","","","","","","","","","",null,0,0,0,0,0,0,0,0,0,0,null,"","","","","","","","","","",null,"","","","","","","","","","",null,null,0,0,0,0,0,0,0,0,0,0,null,null,0,0,0,0,0,0,0,0,0,0]
[null,0,"NA","","","","","","","","","","",null,null,"","","","","","","","","","",null,0,0,0,0,0,0,0,0,0,0,null,"","","","","","","","","","",null,"","","","","","","","","","",null,null,0,0,0,0,0,0,0,0,0,0,null,null,0,0,0,0,0,0,0,0,0,0]
[null,0,"NA","","","","","","","","","","",null,null,"","","","","","","","","","",null,0,0,0,0,0,0,0,0,0,0,null,"","","","","","","","","","",null,"","","","","","","","","","",null,null,0,0,0,0,0,0,0,0,0,0,null,null,0,0,0,0,0,0,0,0,0,0]
[null,0,"NA","","","","","","","","","","",null,null,"","","","","","","","","","",null,0,0,0,0,0,0,0,0,0,0,null,"","","","","","","","","","",null,"","","","","","","","","","",null,null,0,0,0,0,0,0,0,0,0,0,null,null,0,0,0,0,0,0,0,0,0,0]
[null,0,"NA","","","","","","","","","","",null,null,"","","","","","","","","","",null,0,0,0,0,0,0,0,0,0,0,null,"","","","","","","","","","",null,"","","","","","","","","","",null,null,0,0,0,0,0,0,0,0,0,0,null,null,0,0,0,0,0,0,0,0,0,0]
[null,0,"NA","","","","","","","","","","",null,null,"","","","","","","","","","",null,0,0,0,0,0,0,0,0,0,0,null,"","","","","","","","","","",null,"","","","","","","","","","",null,null,0,0,0,0,0,0,0,0,0,0,null,null,0,0,0,0,0,0,0,0,0,0]
[null,0,"NA","","","","","","","","","","",null,null,"","","","","","","","","","",null,0,0,0,0,0,0,0,0,0,0,null,"","","","","","","","","","",null,"","","","","","","","","","",null,null,0,0,0,0,0,0,0,0,0,0,null,null,0,0,0,0,0,0,0,0,0,0]
[null,0,"NA","","","","","","","","","","",null,null,"","","","","","","","","","",null,0,0,0,0,0,0,0,0,0,0,null,"","","","","","","","","","",null,"","","","","","","","","","",null,null,0,0,0,0,0,0,0,0,0,0,null,null,0,0,0,0,0,0,0,0,0,0]
[null,null,null,null,null,null,null,null,null,null,null,null,null,null,null,null,null,null,null,null,null,null,null,null,null,null,30238,30238,30238,30238,30238,30238,30238,30238,30238,30238,null,null,null,null,null,null,null,null,null,null,null,null,null,null,null,null,null,null,null,null,null,null,null,null,0,0,0,0,0,0,0,0,0,0,null,null,0,0,0,0,0,0,0,0,0,0]
[null,null,null,null,null,null,null,null,null,null,null,null,null,null,null,null,null,null,null,null,null,null,null,null,null,null,true,true,true,true,true,true,true,true,true,true]
[null,"Total",null,null,null,null,null,null,null,null,null,null,null,null,"Price (cents) per Light per day Nominal Smoothed",0,0,0,0,0,0,0,0,0,0,null,51858.75,51858.75,51858.75,51858.75,51858.75,51858.75,51858.75,51858.75,51858.75,51858.75,null,null,null,null,null,null,null,null,null,null,null,null,null,null,null,null,null,null,null,null,null,null,null,null,800485.77202083333,801284.99492978002,802014.261134131,812575.36070869293,818782.90362820507,827298.24582593853,835902.1475825283,846909.49027332466,853379.32342852722,862254.468392184,null,null,933444.85042104369,965662.11575446744,998903.21540761995,1045943.2130149064,1089221.8866723557,1137398.9776816736,1187706.9771188518,1243638.054824943,1295096.8767313543,1352379.9710756917]
[null,null,null,null,null,null,null,null,null,null,null,null,null,null,null,null,null,null,null,null,null,null,null,null,null,null,true,true,true,true,true,true,true,true,true,true]

{"sheet":"Smoothed Prices","index":3,"n_rows":157,"n_cols":82,"rows_kept":157,"cut":false,"hidden":false,"merged":[[82,72,82,76],[82,77,82,81],[9,15,9,19],[9,26,9,30],[9,37,9,41],[9,48,9,52],[9,60,9,64],[9,72,9,76],[82,2,82,7],[82,26,82,30],[82,37,82,41],[82,48,82,52],[82,60,82,64],[7,3,7,7],[7,8,7,12],[9,3,9,7],[9,8,9,12],[9,77,9,81]]}
[]
[]
[null,null,null,null,null,null,null,null,null,null,null,null,null,null,null,"THIS TAKES 21/22 SMOOTHED PRICES ADDS CPI",null,null,null,null,null,null,null,null,null,null,null,null,null,null,null,null,null,null,null,null,null,"THIS TAKES 18/19 SMOOTHED PRICES  and multiplys by no.days in year/100 to convert $s into cents",null,null,null,null,null,null,null,null,null,null,"THIS TAKES nominal and multiplys by no days in year/100"]
[null,"Private Contract Lights"]
[]
[]
[]
[null,null,null,"X Factor",null,null,null,null,"X Factor",null,null,null,null,null,"Days",365,365,365,366,365,365,365,366,365,365,null,null,null,null,null,null,null,null,null,null,null,null,365,365,365,366,365,365,365,366,365,365,null,365,365,365,366,365,365,365,366,365,365]
[null,null,null,1.04E-2,1.04E-2,1.04E-2,1.04E-2,1.04E-2,1.04E-2,1.04E-2,1.04E-2,1.04E-2,1.04E-2,null,"CPI",1.1660979908044509,1.2051418931651063,1.2454930838699401,1.287195334230514,1.3302938811323202,1.3748354761058921,1.4208684360409423,1.4684426955985361,1.5176098613781586,1.5684232678984287]
[null,"Private Contract Lights",null,"Price (cents) per Light per day Real 2021/22 Smoothed",null,null,null,null,"Price (cents) per Light per day Real 2021/22 Smoothed",null,null,null,null,null,null,"Price (cents) per Light per day Nominal Smoothed",null,null,null,null,null,null,null,null,null,null,"Volumes",null,null,null,null,null,null,null,null,null,null,"Smooth Real 2021/22 Cost Dollars Per  Year",null,null,null,null,null,null,null,null,null,null,"Smooth Nominal Cost Dollars Per Year",null,null,null,null,null,null,null,null,null,null,null,"Revenue Real Real Dollars Per Year",null,null,null,null,null,null,null,null,null,null,null,"Revenue Nominal Dollars Per Year",null,null,null,null,"Revenue Nominal Dollars Per Year"]
[null,null,"Offered / No Longer Offered / NA","2024-25","2025-26","2026-27","2027-28","2028-29","2029-30","2030-31","2031-32","2032-33","2033-34",null,null,"2024-25","2025-26","2026-27","2027-28","2028-29","2029-30","2030-31","2031-32","2032-33","2033-34",null,"2024-25","2025-26","2026-27","2027-28","2028-29","2029-30","2030-31","2031-32","2032-33","2033-34",null,"2024-25","2025-26","2026-27","2027-28","2028-29","2029-30","2030-31","2031-32","2032-33","2033-34",null,"2024-25","2025-26","2026-27","2027-28","2028-29","2029-30","2030-31","2031-32","2032-33","2033-34",null,null,"2024-25","2025-26","2026-27","2027-28","2028-29","2029-30","2030-31","2031-32","2032-33","2033-34",null,null,"2024-25","2025-26","2026-27","2027-28","2028-29","2029-30","2030-31","2031-32","2032-33","2033-34"]
[null,"50W Mercury Vapour","Obsolete, no new Connections",14.538,14.6891952,14.84196283008,14.996319243512831,15.152280963645364,15.152280963645364,15.309864685667275,15.469087278398215,15.629965786093555,15.792517430268928,null,null,16.952732590315108,17.702564512399793,18.485562055919363,19.303192160880986,20.156986651135163,20.831893412743618,21.753303491922512,22.715468221540096,23.720190209978803,24.769351796325289,null,68.400000000000006,34.200000000000003,0,0,0,0,0,0,0,0,null,53.063699999999997,53.615562480000001,54.173164329792002,54.886528431256963,55.305825517305578,55.305825517305578,55.881006102685554,56.61685943893746,57.049375119241475,57.642688620481586,null,61.877473954650142,64.614360470259243,67.472301504105673,70.649683308824407,73.573001276643339,76.036410956514203,79.399557745517171,83.138613690836749,86.57869426642263,90.408134056587301,null,null,3629.55708,1833.6522368160001,0,0,0,0,0,0,0,0,null,null,4232.4192184980702,2209.8111280828662,0,0,0,0,0,0,0,0]
[null,"80W Mercury Vapour","Obsolete, no new Connections",14.525,14.67606,14.828691023999999,14.982909410649599,15.138731668520354,15.138731668520354,15.296174477872965,15.455254692442843,15.615989341244248,15.778395630393188,null,null,16.937573316434648,17.686734732604691,18.46903211323626,19.285931086586626,20.138962106736706,20.813265361129528,21.733851507784735,22.695155861732694,23.698979419448484,24.747202836815571,null,97.9,48.95,0,0,0,0,0,0,0,0,null,53.016249999999999,53.567618999999993,54.124722237599997,54.837448442977532,55.256370590099294,55.256370590099294,55.831036844236323,56.566232174340804,56.998361095541505,57.591144050935135,null,61.822142604986468,64.556581774007114,67.411967213312352,70.586507776907041,73.507211689588971,75.968418568122786,79.328558003414287,83.06427045394166,86.501274880986969,90.327290354376842,null,null,5190.2908750000006,2622.13495005,0,0,0,0,0,0,0,0,null,null,6052.3877610281752,3160.0446778376486,0,0,0,0,0,0,0,0]
[null,"125W Mercury Vapour","Obsolete, no new Connections",17.007999999999999,17.184883199999998,17.363605985279996,17.544187487526909,17.726647037397189,17.726647037397189,17.911004166586121,18.097278609918614,18.285490307461767,18.475659406659368,null,null,19.832994627602098,20.710222673469229,21.626251165708933,22.582796276810001,23.581650086841851,24.371223219421065,25.449180478100022,26.574816584946618,27.750240410738716,28.97765410317103,null,138.80000000000001,69.400000000000006,0,0,0,0,0,0,0,0,null,62.0792,62.724823679999993,63.377161846271981,64.211726204348494,64.702261686499739,64.702261686499739,65.375165208039348,66.23603971230213,66.742039622235453,67.436156834306701,null,72.390430390747667,75.592312758162691,78.935816754837603,82.653034373124612,86.073022816972752,88.954964750886887,92.889508745065086,97.263828700904611,101.2883774991963,105.76843747657425,null,null,8616.5929599999999,4353.1027633920003,0,0,0,0,0,0,0,0,null,null,10047.791738235777,5246.106505416491,0,0,0,0,0,0,0,0]
[null,"250W Mercury Vapour","Obsolete, no new Connections",17.28,17.459712,17.641293004799998,17.824762452049917,18.010139981551237,18.010139981551237,18.19744543735937,18.386698869907907,18.577920538154949,18.771130911751758,null,null,20.150173281100912,21.041430373797525,21.972108428001551,22.943951062045908,23.958779015794168,24.760979376269759,25.856175838521189,26.999813651686125,28.194035412603778,29.441078486758904,null,11.200000000000001,5.6000000000000005,0,0,0,0,0,0,0,0,null,63.07200000000001,63.727948799999993,64.39071946752,65.238630574502693,65.737010932662017,65.737010932662017,66.420675846361704,67.295317863862934,67.809409964265555,68.514627827893918,null,73.548132476018324,76.801220864360971,80.198195762205657,83.974860887088013,87.449543407648704,90.377574723384626,94.37504181060234,98.819317965171209,102.90822925600379,107.45993647667001,null,null,706.40640000000019,356.87651327999998,0,0,0,0,0,0,0,0,null,null,823.73908373140534,430.08683684042148,0,0,0,0,0,0,0,0]
[null,0,"NA","","","","","","","","","","",null,null,"","","","","","","","","","",null,0,0,0,0,0,0,0,0,0,0,null,"","","","","","","","","","",null,"","","","","","","","","","",null,null,0,0,0,0,0,0,0,0,0,0,null,null,0,0,0,0,0,0,0,0,0,0]
[null,"400W Mercury Vapour","Obsolete, no new Connections",18.123999999999999,18.312489599999999,18.502939491839999,18.695370062555135,18.889801911205709,18.889801911205709,19.086255851082246,19.284752911933502,19.48531434221761,19.687961611376672,null,null,21.134359985339866,22.069148385110321,23.045283168350704,24.064593116233802,25.128987898278559,25.970369804138489,27.119058501004513,28.318554549951351,29.571105197802712,30.879057088774214,null,10.4,5.2,0,0,0,0,0,0,0,0,null,66.152599999999993,66.840587040000003,67.535729145215996,68.425054428951796,68.947776975900837,68.947776975900837,69.664833856450201,70.582195657676621,71.121397349094281,71.861059881524852,null,77.140413946490511,80.552391605652673,84.115283564480066,88.076410805415705,91.720805828716749,94.791849785105484,98.98456352866647,103.64590965282194,107.9345339719799,112.70855837402588,null,null,687.98703999999998,347.571052608,0,0,0,0,0,0,0,0,null,null,802.26030504350138,418.87243634939392,0,0,0,0,0,0,0,0]
[null,"70W Sodium Vapour","Offered",15.455,15.615732,15.778135612799998,15.942228223173117,16.108027396694116,16.108027396694116,16.275550881619733,16.444816610788578,16.615842703540778,16.788647467657601,null,null,18.022044447882788,18.819172825638933,19.651558782104395,20.520761786106455,21.42841028293396,22.145887515060707,23.12541652687181,24.148270832569963,25.216366742001807,26.331705324818213,null,32.666666666666671,16.333333333333336,0,0,0,0,0,0,0,0,null,56.41075,56.997421800000005,57.590194986719986,58.348555296813608,58.794299997933521,58.794299997933521,59.405760717912024,60.188028795486197,60.647825867923842,61.27856325695025,null,65.780462234772173,68.68998081358211,71.728189554681038,75.105988137149623,78.213697532708963,80.832489429971588,84.407770323082119,88.382671247206076,92.039738608306592,96.110724435586476,null,null,1842.7511666666669,930.95788940000023,0,0,0,0,0,0,0,0,null,null,2148.8284330025581,1121.9363532885079,0,0,0,0,0,0,0,0]
[null,0,"NA","","","","","","","","","","",null,null,"","","","","","","","","","",null,0,0,0,0,0,0,0,0,0,0,null,"","","","","","","","","","",null,"","","","","","","","","","",null,null,0,0,0,0,0,0,0,0,0,0,null,null,0,0,0,0,0,0,0,0,0,0]
[null,"100W Sodium Vapour","Offered",18.489000000000001,18.681285599999999,18.875570970239998,19.071876908330495,19.27022442817713,19.27022442817713,19.470634762230173,19.673129363757365,19.877729909140442,20.0844583001955,null,null,null,null,null,null,null,null,null,null,null,null,null,0.8,0.4,0,0,0,0,0,0,0,0,null,67.484850000000009,68.186692440000002,68.895834041375991,69.803069484489612,70.336319162846522,70.336319162846522,71.067816882140136,72.003653471351953,72.553714168362617,73.308272795713577,null,0,0,0,0,0,0,0,0,0,0,null,null,53.987880000000011,27.274676976000002,0,0,0,0,0,0,0,0,null,null,0,0,0,0,0,0,0,0,0,0]
[null,0,"NA","","","","","","","","","","",null,null,null,null,null,null,null,null,null,null,null,null,null,0,0,0,0,0,0,0,0,0,0,null,"","","","","","","","","","",null,"","","","","","","","","","",null,null,0,0,0,0,0,0,0,0,0,0,null,null,0,0,0,0,0,0,0,0,0,0]
[null,"150W Sodium Vapour","Offered",17.797000000000001,17.9820888,18.169102523519999,18.358061189764605,18.548985026138155,18.548985026138155,18.741894470409992,18.936810172902256,19.133752998700437,19.332744029886921,null,null,null,null,null,null,null,null,null,null,null,null,null,66.400000000000006,33.200000000000003,0,0,0,0,0,0,0,0,null,64.959050000000005,65.634624119999998,66.317224210847996,67.190503954538457,67.703795345404274,67.703795345404274,68.407914816996467,69.308725232822255,69.838198445256594,70.56451570908726,null,0,0,0,0,0,0,0,0,0,0,null,null,4313.2809200000011,2179.0695207839999,0,0,0,0,0,0,0,0,null,null,0,0,0,0,0,0,0,0,0,0]
[null,0,"NA","","","","","","","","","","",null,null,null,null,null,null,null,null,null,null,null,null,null,0,0,0,0,0,0,0,0,0,0,null,"","","","","","","","","","",null,"","","","","","","","","","",null,null,0,0,0,0,0,0,0,0,0,0,null,null,0,0,0,0,0,0,0,0,0,0]
[null,0,"NA","","","","","","","","","","",null,null,null,null,null,null,null,null,null,null,null,null,null,0,0,0,0,0,0,0,0,0,0,null,"","","","","","","","","","",null,"","","","","","","","","","",null,null,0,0,0,0,0,0,0,0,0,0,null,null,0,0,0,0,0,0,0,0,0,0]
[null,0,"NA","","","","","","","","","","",null,null,null,null,null,null,null,null,null,null,null,null,null,0,0,0,0,0,0,0,0,0,0,null,"","","","","","","","","","",null,"","","","","","","","","","",null,null,0,0,0,0,0,0,0,0,0,0,null,null,0,0,0,0,0,0,0,0,0,0]
[null,"250W Sodium Vapour","Offered",18.48,18.672191999999999,18.8663827968,19.062593177886718,19.260844146936741,19.260844146936741,19.461156926064881,19.663552958095956,19.868053908860151,20.074681669512294,null,null,null,null,null,null,null,null,null,null,null,null,null,69.7,34.85,0,0,0,0,0,0,0,0,null,67.451999999999998,68.153500799999989,68.862297208320001,69.769091031065386,70.302081136319103,70.302081136319103,71.033222780136811,71.968603826631195,72.518396767339553,73.272588093719875,null,0,0,0,0,0,0,0,0,0,0,null,null,4701.4044000000004,2375.1495028799995,0,0,0,0,0,0,0,0,null,null,0,0,0,0,0,0,0,0,0,0]
[null,0,"NA","","","","","","","","","","",null,null,null,null,null,null,null,null,null,null,null,null,null,0,0,0,0,0,0,0,0,0,0,null,"","","","","","","","","","",null,"","","","","","","","","","",null,null,0,0,0,0,0,0,0,0,0,0,null,null,0,0,0,0,0,0,0,0,0,0]
[null,0,"NA","","","","","","","","","","",null,null,null,null,null,null,null,null,null,null,null,null,null,0,0,0,0,0,0,0,0,0,0,null,"","","","","","","","","","",null,"","","","","","","","","","",null,null,0,0,0,0,0,0,0,0,0,0,null,null,0,0,0,0,0,0,0,0,0,0]
[null,0,"NA","","","","","","","","","","",null,null,null,null,null,null,null,null,null,null,null,null,null,0,0,0,0,0,0,0,0,0,0,null,"","","","","","","","","","",null,"","","","","","","","","","",null,null,0,0,0,0,0,0,0,0,0,0,null,null,0,0,0,0,0,0,0,0,0,0]
[null,"400W Sodium Vapour","Offered",18.739999999999998,18.934895999999998,19.131818918399997,19.330789835151357,19.53183004943693,19.53183004943693,19.734961081951074,19.940204677203365,20.14758280584628,20.357117667027079,null,null,21.852676347675409,22.819236412324397,23.828548144719274,24.882502482797474,25.983074002082329,26.853052865236993,28.040783287840682,29.281047906979047,30.576170349085345,31.928577016311447,null,38,19,0,0,0,0,0,0,0,0,null,68.400999999999996,69.112370399999989,69.831139052159983,70.75069079665397,71.291179680444799,71.291179680444799,72.032607949121427,72.981149118564318,73.538677241338917,74.303479484648847,null,79.762268669015242,83.29021290498406,86.974200728225355,91.069959087038754,94.838220107600506,98.013642958115028,102.34885900061849,107.1686353395433,111.60302177416152,116.53930610953677,null,null,2599.2379999999998,1313.1350375999998,0,0,0,0,0,0,0,0,null,null,3030.9662094225791,1582.5140451946972,0,0,0,0,0,0,0,0]
[null,0,"NA","","","","","","","","","","",null,null,"","","","","","","","","","",null,0,0,0,0,0,0,0,0,0,0,null,"","","","","","","","","","",null,"","","","","","","","","","",null,null,0,0,0,0,0,0,0,0,0,0,null,null,0,0,0,0,0,0,0,0,0,0]
[null,"250W Sodium Vapour - Flood Light","Offered",18.962,19.159204799999998,19.358460529919999,19.559788519431166,19.763210320033249,19.763210320033249,19.968747707361594,20.176422683518155,20.386257479426742,20.598274557212779,null,null,22.111550101633998,23.089560344209989,24.110828704384573,25.177268520747372,26.290877760271353,27.171162669723792,28.372963324655018,29.627920512920848,30.938385387372268,32.306813094092725,null,0,0,0,0,0,0,0,0,0,0,null,69.211299999999994,69.931097519999994,70.658380934207997,71.588825981118077,72.135717668121359,72.135717668121359,72.885929131869815,73.845707021676446,74.409839799907616,75.183702133826642,null,80.707157870964096,84.276895256366458,88.004524771003688,92.148802785935388,95.961703824990437,99.174743744491849,103.56131613499082,108.4381890772903,112.92510666390878,117.91986779343844,null,null,0,0,0,0,0,0,0,0,0,0,null,null,0,0,0,0,0,0,0,0,0,0]
[null,"400W Sodium Vapour - Flood Light","Offered",18.739999999999998,18.934895999999998,19.131818918399997,19.330789835151357,19.53183004943693,19.53183004943693,19.734961081951074,19.940204677203365,20.14758280584628,20.357117667027079,null,null,21.852676347675409,22.819236412324397,23.828548144719274,24.882502482797474,25.983074002082329,26.853052865236993,28.040783287840682,29.281047906979047,30.576170349085345,31.928577016311447,null,0,0,0,0,0,0,0,0,0,0,null,68.400999999999996,69.112370399999989,69.831139052159983,70.75069079665397,71.291179680444799,71.291179680444799,72.032607949121427,72.981149118564318,73.538677241338917,74.303479484648847,null,79.762268669015242,83.29021290498406,86.974200728225355,91.069959087038754,94.838220107600506,98.013642958115028,102.34885900061849,107.1686353395433,111.60302177416152,116.53930610953677,null,null,0,0,0,0,0,0,0,0,0,0,null,null,0,0,0,0,0,0,0,0,0,0]
[null,"1x20W Fluorescent","Obsolete, no new Connections",14.813000000000001,14.967055200000001,15.122712574079999,15.279988784850431,15.438900668212876,15.438900668212876,15.599465235162288,15.761699673607975,15.925621350213497,16.091247812255716,null,null,17.273409537786332,18.037425238834651,18.835233920369618,19.668330270954055,20.538275090333279,21.225948350734026,22.164787771760089,23.145152755927462,24.168880009658547,25.237887478261552,null,10.8,5.4,0,0,0,0,0,0,0,0,null,54.067450000000001,54.629751480000003,55.197900895391996,55.924758952552573,56.351987438976991,56.351987438976991,56.938048108342358,57.687820805405188,58.128517928279258,58.733054514733368,null,63.047944812920115,65.836602121746466,68.748603809349106,71.986088791691841,74.964704079716469,77.474711480179195,80.901475366924331,84.711259086694511,88.216412035253711,92.118289295654662,null,null,583.92846000000009,295.00065799200001,0,0,0,0,0,0,0,0,null,null,680.91780397953733,355.51765145743093,0,0,0,0,0,0,0,0]
[null,"1x40W Fluorescent","Obsolete, no new Connections",14.813000000000001,14.967055200000001,15.122712574079999,15.279988784850431,15.438900668212876,15.438900668212876,15.599465235162288,15.761699673607975,15.925621350213497,16.091247812255716,null,null,17.273409537786332,18.037425238834651,18.835233920369618,19.668330270954055,20.538275090333279,21.225948350734026,22.164787771760089,23.145152755927462,24.168880009658547,25.237887478261552,null,4,2,0,0,0,0,0,0,0,0,null,54.067450000000001,54.629751480000003,55.197900895391996,55.924758952552573,56.351987438976991,56.351987438976991,56.938048108342358,57.687820805405188,58.128517928279258,58.733054514733368,null,63.047944812920115,65.836602121746466,68.748603809349106,71.986088791691841,74.964704079716469,77.474711480179195,80.901475366924331,84.711259086694511,88.216412035253711,92.118289295654662,null,null,216.2698,109.25950296000001,0,0,0,0,0,0,0,0,null,null,252.19177925168046,131.67320424349293,0,0,0,0,0,0,0,0]
[null,"2x20W Fluorescent","Obsolete, no new Connections",14.813000000000001,14.967055200000001,15.122712574079999,15.279988784850431,15.438900668212876,15.438900668212876,15.599465235162288,15.761699673607975,15.925621350213497,16.091247812255716,null,null,17.273409537786332,18.037425238834651,18.835233920369618,19.668330270954055,20.538275090333279,21.225948350734026,22.164787771760089,23.145152755927462,24.168880009658547,25.237887478261552,null,18.400000000000002,9.2000000000000011,0,0,0,0,0,0,0,0,null,54.067450000000001,54.629751480000003,55.197900895391996,55.924758952552573,56.351987438976991,56.351987438976991,56.938048108342358,57.687820805405188,58.128517928279258,58.733054514733368,null,63.047944812920115,65.836602121746466,68.748603809349106,71.986088791691841,74.964704079716469,77.474711480179195,80.901475366924331,84.711259086694511,88.216412035253711,92.118289295654662,null,null,994.84108000000015,502.59371361600006,0,0,0,0,0,0,0,0,null,null,1160.0821845577302,605.69673952006758,0,0,0,0,0,0,0,0]
[null,"2x24W Fluorescent","Obsolete, no new Connections",14.813000000000001,14.967055200000001,15.122712574079999,15.279988784850431,15.438900668212876,15.438900668212876,15.599465235162288,15.761699673607975,15.925621350213497,16.091247812255716,null,null,17.273409537786332,18.037425238834651,18.835233920369618,19.668330270954055,20.538275090333279,21.225948350734026,22.164787771760089,23.145152755927462,24.168880009658547,25.237887478261552,null,0,0,0,0,0,0,0,0,0,0,null,54.067450000000001,54.629751480000003,55.197900895391996,55.924758952552573,56.351987438976991,56.351987438976991,56.938048108342358,57.687820805405188,58.128517928279258,58.733054514733368,null,63.047944812920115,65.836602121746466,68.748603809349106,71.986088791691841,74.964704079716469,77.474711480179195,80.901475366924331,84.711259086694511,88.216412035253711,92.118289295654662,null,null,0,0,0,0,0,0,0,0,0,0,null,null,0,0,0,0,0,0,0,0,0,0]
[null,"2x40W Fluorescent","Obsolete, no new Connections",14.813000000000001,14.967055200000001,15.122712574079999,15.279988784850431,15.438900668212876,15.438900668212876,15.599465235162288,15.761699673607975,15.925621350213497,16.091247812255716,null,null,17.273409537786332,18.037425238834651,18.835233920369618,19.668330270954055,20.538275090333279,21.225948350734026,22.164787771760089,23.145152755927462,24.168880009658547,25.237887478261552,null,1.2000000000000002,0.60000000000000009,0,0,0,0,0,0,0,0,null,54.067450000000001,54.629751480000003,55.197900895391996,55.924758952552573,56.351987438976991,56.351987438976991,56.938048108342358,57.687820805405188,58.128517928279258,58.733054514733368,null,63.047944812920115,65.836602121746466,68.748603809349106,71.986088791691841,74.964704079716469,77.474711480179195,80.901475366924331,84.711259086694511,88.216412035253711,92.118289295654662,null,null,64.88094000000001,32.777850888000003,0,0,0,0,0,0,0,0,null,null,75.657533775504149,39.501961273047883,0,0,0,0,0,0,0,0]
[null,"4x40W Fluorescent","Obsolete, no new Connections",14.813000000000001,14.967055200000001,15.122712574079999,15.279988784850431,15.438900668212876,15.438900668212876,15.599465235162288,15.761699673607975,15.925621350213497,16.091247812255716,null,null,17.273409537786332,18.037425238834651,18.835233920369618,19.668330270954055,20.538275090333279,21.225948350734026,22.164787771760089,23.145152755927462,24.168880009658547,25.237887478261552,null,0.4,0.2,0,0,0,0,0,0,0,0,null,54.067450000000001,54.629751480000003,55.197900895391996,55.924758952552573,56.351987438976991,56.351987438976991,56.938048108342358,57.687820805405188,58.128517928279258,58.733054514733368,null,63.047944812920115,65.836602121746466,68.748603809349106,71.986088791691841,74.964704079716469,77.474711480179195,80.901475366924331,84.711259086694511,88.216412035253711,92.118289295654662,null,null,21.626980000000003,10.925950296000002,0,0,0,0,0,0,0,0,null,null,25.219177925168047,13.167320424349294,0,0,0,0,0,0,0,0]
[null,"32W Compact Fluorescent","Not Offered",14.813000000000001,14.967055200000001,15.122712574079999,15.279988784850431,15.438900668212876,15.438900668212876,15.599465235162288,15.761699673607975,15.925621350213497,16.091247812255716,null,null,17.273409537786332,18.037425238834651,18.835233920369618,19.668330270954055,20.538275090333279,21.225948350734026,22.164787771760089,23.145152755927462,24.168880009658547,25.237887478261552,null,0,0,0,0,0,0,0,0,0,0,null,54.067450000000001,54.629751480000003,55.197900895391996,55.924758952552573,56.351987438976991,56.351987438976991,56.938048108342358,57.687820805405188,58.128517928279258,58.733054514733368,null,63.047944812920115,65.836602121746466,68.748603809349106,71.986088791691841,74.964704079716469,77.474711480179195,80.901475366924331,84.711259086694511,88.216412035253711,92.118289295654662,null,null,0,0,0,0,0,0,0,0,0,0,null,null,0,0,0,0,0,0,0,0,0,0]
[null,"42W Compact Fluorescent","Offered",14.813000000000001,14.967055200000001,15.122712574079999,15.279988784850431,15.438900668212876,15.438900668212876,15.599465235162288,15.761699673607975,15.925621350213497,16.091247812255716,null,null,17.273409537786332,18.037425238834651,18.835233920369618,19.668330270954055,20.538275090333279,21.225948350734026,22.164787771760089,23.145152755927462,24.168880009658547,25.237887478261552,null,8.3333333333333339,4.166666666666667,0,0,0,0,0,0,0,0,null,54.067450000000001,54.629751480000003,55.197900895391996,55.924758952552573,56.351987438976991,56.351987438976991,56.938048108342358,57.687820805405188,58.128517928279258,58.733054514733368,null,63.047944812920115,65.836602121746466,68.748603809349106,71.986088791691841,74.964704079716469,77.474711480179195,80.901475366924331,84.711259086694511,88.216412035253711,92.118289295654662,null,null,450.56208333333336,227.62396450000003,0,0,0,0,0,0,0,0,null,null,525.39954010766769,274.31917550727695,0,0,0,0,0,0,0,0]
[null,0,"NA","","","","","","","","","","",null,null,"","","","","","","","","","",null,0,0,0,0,0,0,0,0,0,0,null,"","","","","","","","","","",null,"","","","","","","","","","",null,null,0,0,0,0,0,0,0,0,0,0,null,null,0,0,0,0,0,0,0,0,0,0]
[null,"60W Incandescent","Obsolete, no new Connections",15.455,15.615732,15.778135612799998,15.942228223173117,16.108027396694116,16.108027396694116,16.275550881619733,16.444816610788578,16.615842703540778,16.788647467657601,null,null,18.022044447882788,18.819172825638933,19.651558782104395,20.520761786106455,21.42841028293396,22.145887515060707,23.12541652687181,24.148270832569963,25.216366742001807,26.331705324818213,null,4,2,0,0,0,0,0,0,0,0,null,56.41075,56.997421800000005,57.590194986719986,58.348555296813608,58.794299997933521,58.794299997933521,59.405760717912024,60.188028795486197,60.647825867923842,61.27856325695025,null,65.780462234772173,68.68998081358211,71.728189554681038,75.105988137149623,78.213697532708963,80.832489429971588,84.407770323082119,88.382671247206076,92.039738608306592,96.110724435586476,null,null,225.643,113.99484360000001,0,0,0,0,0,0,0,0,null,null,263.12184893908869,137.37996162716422,0,0,0,0,0,0,0,0]
[null,"100W Incandescent","Obsolete, no new Connections",18.501000000000001,18.693410400000001,18.88782186816,19.084255215588865,19.282731469830988,19.282731469830988,19.483271877117229,19.685897904639248,19.890631242847494,20.097493807773109,null,null,21.573978927873146,22.528211999168288,23.524651506160691,24.565164270770339,25.651699685833794,26.510583300947154,27.683166041000032,28.907612984366033,30.186218123181856,31.521376914555933,null,2,1,0,0,0,0,0,0,0,0,null,67.528650000000013,68.230947960000009,68.940549818784007,69.848374089055241,70.381969864883104,70.381969864883104,71.113942351477874,72.050386330979649,72.600804036393356,73.355852398371837,null,78.745023086736978,82.22797379696425,85.864977997486506,89.908501231019443,93.628703853293359,96.763629048457119,101.04355604965012,105.80186352277968,110.17969614961378,115.05302573812916,null,null,135.05730000000003,68.230947960000009,0,0,0,0,0,0,0,0,null,null,157.49004617347396,82.22797379696425,0,0,0,0,0,0,0,0]
[null,"100W Metal Halide","Offered",18.143000000000001,18.331687200000001,18.522336746880001,18.714969049047554,18.909604727157646,18.909604727157646,19.106264616320086,19.304969768329816,19.505741453920447,19.70860116504122,null,null,21.156515847165153,22.09228421711855,23.069442315349086,24.089820840202492,25.155331463168611,25.99759541803601,27.147488323975114,28.348241845054481,29.602105583962409,30.911428644980727,null,0,0,0,0,0,0,0,0,0,0,null,66.221950000000007,66.910658280000007,67.606529126111994,68.496786719514049,69.020057254125405,69.020057254125405,69.737865849568323,70.656189352087125,71.195956306809634,71.936394252400447,null,77.221282842152803,80.636837392482718,84.203464451024161,88.168744275141123,91.816959840565431,94.891223275831436,99.088332382509165,103.75456515289939,108.0476853814628,112.82671455417966,null,null,0,0,0,0,0,0,0,0,0,0,null,null,0,0,0,0,0,0,0,0,0,0]
[null,"150W Metal Halide","Offered",19.844000000000001,20.050377600000001,20.258901527039999,20.469594102921214,20.682477881591595,20.682477881591595,20.897575651560146,21.11491043833637,21.334505506895066,21.556384364166775,null,null,23.140048529523526,24.163550019539244,25.232321738730487,26.348366022872629,27.513773772535849,28.435004325387563,29.692705633079541,31.006036001392328,32.377455944890585,33.809534808521043,null,10.8,5.4,0,0,0,0,0,0,0,0,null,72.430599999999998,73.183878239999999,73.944990573695989,74.918714416691643,75.491044267809315,75.491044267809315,76.276151128194527,77.280572204311113,77.870945100166992,78.680802929208724,null,84.461177132760881,88.196957571318237,92.097974346366286,96.435019643713815,100.42527426975585,103.78776578766461,108.37837556074034,113.48209176509592,118.17771419885062,123.40480205110181,null,null,782.25048000000004,395.192942496,0,0,0,0,0,0,0,0,null,null,912.1807130338176,476.2635708851185,0,0,0,0,0,0,0,0]
[null,"250W Metal Halide","Offered",19.033999999999999,19.231953599999997,19.431965917439996,19.634058362981371,19.838252569956378,19.838252569956378,20.044570396683923,20.253033928809437,20.463665481669054,20.67648760267841,null,null,22.195509156971916,23.177232970767477,24.202379156167911,25.272868316839226,26.390706006170493,27.274333417124915,28.480697390648857,29.740419736469541,31.055860534924783,32.429484254454216,null,16,8,0,0,0,0,0,0,0,0,null,69.474099999999993,70.196630639999981,70.92667559865599,71.860653608511825,72.409621880340779,72.409621880340779,73.162681947896317,74.126104179442535,74.692379008092047,75.469179749776188,null,81.013608422947485,84.5969003433013,88.338683920012883,92.498698039631563,96.326076922522304,99.551316972505944,103.95454547586833,108.84993623547852,113.35389095247545,118.36761752875789,null,null,1111.5855999999999,561.57304511999985,0,0,0,0,0,0,0,0,null,null,1296.2177347671598,676.7752027464104,0,0,0,0,0,0,0,0]
[null,"400W Metal Halide","Offered",18.574000000000002,18.767169600000003,18.962348163840002,19.159556584743935,19.358815973225273,19.358815973225273,19.560147659346814,19.763573195004021,19.969114356232062,20.176793145536873,null,null,21.659104081201871,22.617102301094633,23.617473491996581,24.662091841807914,25.752914435148202,26.615186975395517,27.792396413466005,29.021674697130678,30.305324870005936,31.645751841033558,null,3.6,1.8,0,0,0,0,0,0,0,0,null,67.795100000000005,68.500169040000003,69.212570798016003,70.123977100162804,70.659678302272241,70.659678302272241,71.394538956615875,72.334677893714712,72.887267400247026,73.645294981209588,null,79.055729896386822,82.552423398995415,86.203778245787532,90.263256141016967,93.998137688290939,97.145432460193646,101.44224690915091,106.21932939149829,110.61443577552167,115.50699421977249,null,null,244.06236000000001,123.30030427200001,0,0,0,0,0,0,0,0,null,null,284.60062762699255,148.59436211819175,0,0,0,0,0,0,0,0]
[null,"400W Metal Halide - Flood Light","Offered",18.574000000000002,18.767169600000003,18.962348163840002,19.159556584743935,19.358815973225273,19.358815973225273,19.560147659346814,19.763573195004021,19.969114356232062,20.176793145536873,null,null,21.659104081201871,22.617102301094633,23.617473491996581,24.662091841807914,25.752914435148202,26.615186975395517,27.792396413466005,29.021674697130678,30.305324870005936,31.645751841033558,null,0.8,0.4,0,0,0,0,0,0,0,0,null,67.795100000000005,68.500169040000003,69.212570798016003,70.123977100162804,70.659678302272241,70.659678302272241,71.394538956615875,72.334677893714712,72.887267400247026,73.645294981209588,null,79.055729896386822,82.552423398995415,86.203778245787532,90.263256141016967,93.998137688290939,97.145432460193646,101.44224690915091,106.21932939149829,110.61443577552167,115.50699421977249,null,null,54.236080000000008,27.400067616000001,0,0,0,0,0,0,0,0,null,null,63.244583917109459,33.020969359598169,0,0,0,0,0,0,0,0]
[null,"LED 18","Offered",9.9540000000000006,10.057521599999999,10.16211982464,10.267805870816256,10.374591051872745,10.374591051872745,10.482486798812221,10.591504661519869,10.701656309999676,10.812953535623672,null,null,11.607339400467504,12.120740621572949,12.656849959046728,13.216671809699363,13.801254995556434,14.263355828205393,14.894234623648144,15.553017655606697,16.240939149135304,16.959287919976749,null,5429.4833333333327,5607.1333333333323,5784.7833333333319,5784.7833333333319,5784.7833333333319,5784.7833333333319,5784.7833333333319,5784.7833333333319,5784.7833333333319,5784.7833333333319,null,36.332099999999997,36.709953839999997,37.091737359935998,37.580169487187497,37.867257339335517,37.867257339335517,38.261076815664609,38.764907061162724,39.06104553149882,39.467280405026401,null,42.366788811706392,44.240703268741264,46.197502350520551,48.37301882349967,50.374580733780988,52.061248772949682,54.363956376315727,56.924044619520508,59.279427894343861,61.901400907915132,null,null,197264.53141499995,205837.60584139195,214567.66408413503,217393.13811332406,219053.87913563239,219053.87913563239,221332.03947864298,224246.58828562972,225959.6851731888,228309.66589898992,null,null,230029.77374001296,248063.52198826804,267242.54163891869,279827.43307320046,291406.03505243064,301163.04421427968,314483.70877977152,329293.26458092517,342918.64649273537,358086.19228209223]
[null,0,"NA","","","","","","","","","","",null,null,"","","","","","","","","","",null,0,0,0,0,0,0,0,0,0,0,null,"","","","","","","","","","",null,"","","","","","","","","","",null,null,0,0,0,0,0,0,0,0,0,0,null,null,0,0,0,0,0,0,0,0,0,0]
[null,0,"NA","","","","","","","","","","",null,null,"","","","","","","","","","",null,0,0,0,0,0,0,0,0,0,0,null,"","","","","","","","","","",null,"","","","","","","","","","",null,null,0,0,0,0,0,0,0,0,0,0,null,null,0,0,0,0,0,0,0,0,0,0]
[null,0,"NA","","","","","","","","","","",null,null,"","","","","","","","","","",null,0,0,0,0,0,0,0,0,0,0,null,"","","","","","","","","","",null,"","","","","","","","","","",null,null,0,0,0,0,0,0,0,0,0,0,null,null,0,0,0,0,0,0,0,0,0,0]
[null,"LED 20","Offered",9.9540000000000006,10.057521599999999,10.16211982464,10.267805870816256,10.374591051872745,10.374591051872745,10.482486798812221,10.591504661519869,10.701656309999676,10.812953535623672,null,null,11.607339400467504,12.120740621572949,12.656849959046728,13.216671809699363,13.801254995556434,14.263355828205393,14.894234623648144,15.553017655606697,16.240939149135304,16.959287919976749,null,2,2,2,2,2,2,2,2,2,2,null,36.332099999999997,36.709953839999997,37.091737359935998,37.580169487187497,37.867257339335517,37.867257339335517,38.261076815664609,38.764907061162724,39.06104553149882,39.467280405026401,null,42.366788811706392,44.240703268741264,46.197502350520551,48.37301882349967,50.374580733780988,52.061248772949682,54.363956376315727,56.924044619520508,59.279427894343861,61.901400907915132,null,null,72.664199999999994,73.419907679999994,74.183474719871995,75.160338974374994,75.734514678671033,75.734514678671033,76.522153631329218,77.529814122325448,78.12209106299764,78.934560810052801,null,null,84.733577623412785,88.481406537482528,92.395004701041103,96.746037646999341,100.74916146756198,104.12249754589936,108.72791275263145,113.84808923904102,118.55885578868772,123.80280181583026]
[null,"LED 200","Offered",10.787000000000001,10.8991848,11.012536321920001,11.127066699667969,11.242788193344515,11.242788193344515,11.359713190555297,11.477854207737071,11.597223891497537,11.71783501996911,null,null,12.578699026807612,13.135064203828351,13.716037824817869,14.322708339484334,14.9562123404729,15.456984058554507,16.140657914937968,16.854571172496424,17.600061342347047,18.3785250947146,null,1,1,1,1,1,1,1,1,1,1,null,39.372550000000004,39.78202452,40.195757575008003,40.725064120784765,41.036176905707478,41.036176905707478,41.462953145526832,42.008946400317683,42.329867203966003,42.770097822887259,null,45.912251447847787,47.942984343973485,50.063538060585223,52.421112522512665,54.590175042726088,56.417991813723944,58.913401389523585,61.687730491336914,64.240223899566715,67.081616595708297,null,null,39.372550000000004,39.78202452,40.195757575008003,40.725064120784765,41.036176905707478,41.036176905707478,41.462953145526832,42.008946400317683,42.329867203966003,42.770097822887259,null,null,45.912251447847787,47.942984343973485,50.063538060585223,52.421112522512665,54.590175042726088,56.417991813723944,58.913401389523585,61.687730491336914,64.240223899566715,67.081616595708297]
[null,"LED 240","Offered",10.787000000000001,10.8991848,11.012536321920001,11.127066699667969,11.242788193344515,11.242788193344515,11.359713190555297,11.477854207737071,11.597223891497537,11.71783501996911,null,null,12.578699026807612,13.135064203828351,13.716037824817869,14.322708339484334,14.9562123404729,15.456984058554507,16.140657914937968,16.854571172496424,17.600061342347047,18.3785250947146,null,6,6,6,6,6,6,6,6,6,6,null,39.372550000000004,39.78202452,40.195757575008003,40.725064120784765,41.036176905707478,41.036176905707478,41.462953145526832,42.008946400317683,42.329867203966003,42.770097822887259,null,45.912251447847787,47.942984343973485,50.063538060585223,52.421112522512665,54.590175042726088,56.417991813723944,58.913401389523585,61.687730491336914,64.240223899566715,67.081616595708297,null,null,236.23530000000002,238.69214712000002,241.17454545004802,244.35038472470859,246.21706143424487,246.21706143424487,248.77771887316101,252.0536784019061,253.97920322379602,256.62058693732354,null,null,275.47350868708673,287.65790606384093,300.38122836351135,314.526675135076,327.54105025635653,338.50795088234366,353.48040833714151,370.1263829480215,385.44134339740026,402.48969957424981]
[null,"LED 25","Offered",9.9540000000000006,10.057521599999999,10.16211982464,10.267805870816256,10.374591051872745,10.374591051872745,10.482486798812221,10.591504661519869,10.701656309999676,10.812953535623672,null,null,11.607339400467504,12.120740621572949,12.656849959046728,13.216671809699363,13.801254995556434,14.263355828205393,14.894234623648144,15.553017655606697,16.240939149135304,16.959287919976749,null,51,51,51,51,51,51,51,51,51,51,null,36.332099999999997,36.709953839999997,37.091737359935998,37.580169487187497,37.867257339335517,37.867257339335517,38.261076815664609,38.764907061162724,39.06104553149882,39.467280405026401,null,42.366788811706392,44.240703268741264,46.197502350520551,48.37301882349967,50.374580733780988,52.061248772949682,54.363956376315727,56.924044619520508,59.279427894343861,61.901400907915132,null,null,1852.9370999999999,1872.2076458399999,1891.6786053567359,1916.5886438465623,1931.2301243061113,1931.2301243061113,1951.3149175988951,1977.0102601192989,1992.1133221064399,2012.8313006563465,null,null,2160.7062293970262,2256.2758667058047,2356.0726198765483,2467.0239599984834,2569.1036174228302,2655.1236874204337,2772.5617751921022,2903.1262755955458,3023.2508226115369,3156.9714463036717]
[null,0,"NA","","","","","","","","","","",null,null,"","","","","","","","","","",null,0,0,0,0,0,0,0,0,0,0,null,"","","","","","","","","","",null,"","","","","","","","","","",null,null,0,0,0,0,0,0,0,0,0,0,null,null,0,0,0,0,0,0,0,0,0,0]
[null,0,"NA","","","","","","","","","","",null,null,"","","","","","","","","","",null,0,0,0,0,0,0,0,0,0,0,null,"","","","","","","","","","",null,"","","","","","","","","","",null,null,0,0,0,0,0,0,0,0,0,0,null,null,0,0,0,0,0,0,0,0,0,0]
[null,0,"NA","","","","","","","","","","",null,null,"","","","","","","","","","",null,0,0,0,0,0,0,0,0,0,0,null,"","","","","","","","","","",null,"","","","","","","","","","",null,null,0,0,0,0,0,0,0,0,0,0,null,null,0,0,0,0,0,0,0,0,0,0]
[null,"LED 265","Offered",10.787000000000001,10.8991848,11.012536321920001,11.127066699667969,11.242788193344515,11.242788193344515,11.359713190555297,11.477854207737071,11.597223891497537,11.71783501996911,null,null,12.578699026807612,13.135064203828351,13.716037824817869,14.322708339484334,14.9562123404729,15.456984058554507,16.140657914937968,16.854571172496424,17.600061342347047,18.3785250947146,null,0.91666666666666663,0.91666666666666663,0.91666666666666663,0.91666666666666663,0.91666666666666663,0.91666666666666663,0.91666666666666663,0.91666666666666663,0.91666666666666663,0.91666666666666663,null,39.372550000000004,39.78202452,40.195757575008003,40.725064120784765,41.036176905707478,41.036176905707478,41.462953145526832,42.008946400317683,42.329867203966003,42.770097822887259,null,45.912251447847787,47.942984343973485,50.063538060585223,52.421112522512665,54.590175042726088,56.417991813723944,58.913401389523585,61.687730491336914,64.240223899566715,67.081616595708297,null,null,36.091504166666667,36.466855809999998,36.846111110423998,37.331308777386035,37.616495496898523,37.616495496898523,38.007707050066259,38.508200866957871,38.802378270302171,39.20592300431332,null,null,42.086230493860469,43.947735648642357,45.891576555536453,48.052686478969939,50.040993789165576,51.716492495913613,54.003951273729953,56.547086283725505,58.886871907936154,61.491481879399267]
[null,"LED 30","Offered",9.9540000000000006,10.057521599999999,10.16211982464,10.267805870816256,10.374591051872745,10.374591051872745,10.482486798812221,10.591504661519869,10.701656309999676,10.812953535623672,null,null,11.607339400467504,12.120740621572949,12.656849959046728,13.216671809699363,13.801254995556434,14.263355828205393,14.894234623648144,15.553017655606697,16.240939149135304,16.959287919976749,null,30,30,30,30,30,30,30,30,30,30,null,36.332099999999997,36.709953839999997,37.091737359935998,37.580169487187497,37.867257339335517,37.867257339335517,38.261076815664609,38.764907061162724,39.06104553149882,39.467280405026401,null,42.366788811706392,44.240703268741264,46.197502350520551,48.37301882349967,50.374580733780988,52.061248772949682,54.363956376315727,56.924044619520508,59.279427894343861,61.901400907915132,null,null,1089.963,1101.2986151999999,1112.7521207980799,1127.4050846156249,1136.0177201800655,1136.0177201800655,1147.8323044699382,1162.9472118348817,1171.8313659449645,1184.0184121507921,null,null,1271.0036643511917,1327.2210980622378,1385.9250705156164,1451.19056470499,1511.2374220134298,1561.8374631884903,1630.9186912894718,1707.7213385856153,1778.3828368303159,1857.042027237454]
[null,"LED 75","Offered",10.38,10.487952,10.597026700799999,10.707235778488318,10.818591030584596,10.818591030584596,10.931104377302676,11.044787862826624,11.159653656600021,11.275714054628661,null,null,12.104097144550201,12.639470328704764,13.198523465431487,13.782303936576188,14.391905450459689,14.873782750328706,15.53166118077835,16.218638061603123,16.936000438821019,17.685092285448928,null,6.333333333333333,6.333333333333333,6.333333333333333,6.333333333333333,6.333333333333333,6.333333333333333,6.333333333333333,6.333333333333333,6.333333333333333,6.333333333333333,null,37.887,38.281024799999997,38.679147457919996,39.188482949267247,39.487857261633778,39.487857261633778,39.898530977154763,40.423923577945445,40.732735846590074,41.156356299394609,null,44.179954577608235,46.13406669977239,48.174610648824931,50.443232407868848,52.530454894177865,54.289307038699782,56.690563309840982,59.360215305467428,61.816401601696718,64.550586841888588,null,null,239.95099999999999,242.44649039999996,244.96793390015995,248.19372534535921,250.08976265701392,250.08976265701392,252.69069618864683,256.01818266032114,257.97399369507048,260.65692322949917,null,null,279.80637899151878,292.18242243189178,305.10586744255789,319.473805249836,332.69288099645979,343.83227791176529,359.04023429565956,375.94803026796035,391.50387681074585,408.82038333196101]
[null,"LED 155","Offered",10.787000000000001,10.8991848,11.012536321920001,11.127066699667969,11.242788193344515,11.242788193344515,11.359713190555297,11.477854207737071,11.597223891497537,11.71783501996911,null,null,12.578699026807612,13.135064203828351,13.716037824817869,14.322708339484334,14.9562123404729,15.456984058554507,16.140657914937968,16.854571172496424,17.600061342347047,18.3785250947146,null,0,0,0,0,0,0,0,0,0,0,null,39.372550000000004,39.78202452,40.195757575008003,40.725064120784765,41.036176905707478,41.036176905707478,41.462953145526832,42.008946400317683,42.329867203966003,42.770097822887259,null,45.912251447847787,47.942984343973485,50.063538060585223,52.421112522512665,54.590175042726088,56.417991813723944,58.913401389523585,61.687730491336914,64.240223899566715,67.081616595708297,null,null,0,0,0,0,0,0,0,0,0,0,null,null,0,0,0,0,0,0,0,0,0,0]
[null,"LED 14","Offered",9.9540000000000006,10.057521599999999,10.16211982464,10.267805870816256,10.374591051872745,10.374591051872745,10.482486798812221,10.591504661519869,10.701656309999676,10.812953535623672,null,null,11.607339400467504,12.120740621572949,12.656849959046728,13.216671809699363,13.801254995556434,14.263355828205393,14.894234623648144,15.553017655606697,16.240939149135304,16.959287919976749,null,15464.250000000002,15593.9,15723.550000000001,15723.550000000001,15723.550000000001,15723.550000000001,15723.550000000001,15723.550000000001,15723.550000000001,15723.550000000001,null,36.332099999999997,36.709953839999997,37.091737359935998,37.580169487187497,37.867257339335517,37.867257339335517,38.261076815664609,38.764907061162724,39.06104553149882,39.467280405026401,null,42.366788811706392,44.240703268741264,46.197502350520551,48.37301882349967,50.374580733780988,52.061248772949682,54.363956376315727,56.924044619520508,59.279427894343861,61.901400907915132,null,null,561848.677425,572451.34918557596,583213.78696582175,590893.67394026706,595407.714137909,595407.714137909,601599.95436494332,609521.95442154515,614178.30246679834,620565.75681245292,null,null,655170.61388143071,689885.1027024244,726388.73808352742,760595.58012223826,792067.23889664211,818587.64814391301,854794.38628081919,895048.06177726178,932083.0484681105,973309.77224564902]
[null,0,"NA","","","","","","","","","","",null,null,"","","","","","","","","","",null,0,0,0,0,0,0,0,0,0,0,null,"","","","","","","","","","",null,"","","","","","","","","","",null,null,0,0,0,0,0,0,0,0,0,0,null,null,0,0,0,0,0,0,0,0,0,0]
[null,0,"NA","","","","","","","","","","",null,null,"","","","","","","","","","",null,0,0,0,0,0,0,0,0,0,0,null,"","","","","","","","","","",null,"","","","","","","","","","",null,null,0,0,0,0,0,0,0,0,0,0,null,null,0,0,0,0,0,0,0,0,0,0]
[null,0,"NA","","","","","","","","","","",null,null,"","","","","","","","","","",null,0,0,0,0,0,0,0,0,0,0,null,"","","","","","","","","","",null,"","","","","","","","","","",null,null,0,0,0,0,0,0,0,0,0,0,null,null,0,0,0,0,0,0,0,0,0,0]
[null,"LED 17","Offered",9.9540000000000006,10.057521599999999,10.16211982464,10.267805870816256,10.374591051872745,10.374591051872745,10.482486798812221,10.591504661519869,10.701656309999676,10.812953535623672,null,null,11.607339400467504,12.120740621572949,12.656849959046728,13.216671809699363,13.801254995556434,14.263355828205393,14.894234623648144,15.553017655606697,16.240939149135304,16.959287919976749,null,6,6,6,6,6,6,6,6,6,6,null,36.332099999999997,36.709953839999997,37.091737359935998,37.580169487187497,37.867257339335517,37.867257339335517,38.261076815664609,38.764907061162724,39.06104553149882,39.467280405026401,null,42.366788811706392,44.240703268741264,46.197502350520551,48.37301882349967,50.374580733780988,52.061248772949682,54.363956376315727,56.924044619520508,59.279427894343861,61.901400907915132,null,null,217.99259999999998,220.25972303999998,222.550424159616,225.48101692312497,227.20354403601311,227.20354403601311,229.56646089398765,232.58944236697636,234.36627318899292,236.8036824301584,null,null,254.20073287023837,265.44421961244757,277.18501410312331,290.23811294099801,302.24748440268593,312.36749263769809,326.18373825789433,341.54426771712303,355.67656736606318,371.40840544749079]
[null,"LED 175","Offered",10.787000000000001,10.8991848,11.012536321920001,11.127066699667969,11.242788193344515,11.242788193344515,11.359713190555297,11.477854207737071,11.597223891497537,11.71783501996911,null,null,12.578699026807612,13.135064203828351,13.716037824817869,14.322708339484334,14.9562123404729,15.456984058554507,16.140657914937968,16.854571172496424,17.600061342347047,18.3785250947146,null,9.1666666666666661,9.1666666666666661,9.1666666666666661,9.1666666666666661,9.1666666666666661,9.1666666666666661,9.1666666666666661,9.1666666666666661,9.1666666666666661,9.1666666666666661,null,39.372550000000004,39.78202452,40.195757575008003,40.725064120784765,41.036176905707478,41.036176905707478,41.462953145526832,42.008946400317683,42.329867203966003,42.770097822887259,null,45.912251447847787,47.942984343973485,50.063538060585223,52.421112522512665,54.590175042726088,56.417991813723944,58.913401389523585,61.687730491336914,64.240223899566715,67.081616595708297,null,null,360.9150416666667,364.66855809999998,368.46111110423999,373.31308777386033,376.16495496898517,376.16495496898517,380.07707050066261,385.08200866957873,388.02378270302165,392.0592300431332,null,null,420.86230493860467,439.47735648642356,458.91576555536454,480.5268647896994,500.40993789165577,517.1649249591361,540.03951273729945,565.47086283725503,588.86871907936154,614.91481879399271]
[null,"LED 14 New Tech","Offered",9.9540000000000006,10.057521599999999,10.16211982464,10.267805870816256,10.374591051872745,10.374591051872745,10.482486798812221,10.591504661519869,10.701656309999676,10.812953535623672,null,null,11.607339400467504,12.120740621572949,12.656849959046728,13.216671809699363,13.801254995556434,14.263355828205393,14.894234623648144,15.553017655606697,16.240939149135304,16.959287919976749,null,0,0,0,0,0,0,0,0,0,0,null,36.332099999999997,36.709953839999997,37.091737359935998,37.580169487187497,37.867257339335517,37.867257339335517,38.261076815664609,38.764907061162724,39.06104553149882,39.467280405026401,null,42.366788811706392,44.240703268741264,46.197502350520551,48.37301882349967,50.374580733780988,52.061248772949682,54.363956376315727,56.924044619520508,59.279427894343861,61.901400907915132,null,null,0,0,0,0,0,0,0,0,0,0,null,null,0,0,0,0,0,0,0,0,0,0]
[null,"LED 75 New Tech","Offered",10.38,10.487952,10.597026700799999,10.707235778488318,10.818591030584596,10.818591030584596,10.931104377302676,11.044787862826624,11.159653656600021,11.275714054628661,null,null,12.104097144550201,12.639470328704764,13.198523465431487,13.782303936576188,14.391905450459689,14.873782750328706,15.53166118077835,16.218638061603123,16.936000438821019,17.685092285448928,null,0,0,0,0,0,0,0,0,0,0,null,37.887,38.281024799999997,38.679147457919996,39.188482949267247,39.487857261633778,39.487857261633778,39.898530977154763,40.423923577945445,40.732735846590074,41.156356299394609,null,44.179954577608235,46.13406669977239,48.174610648824931,50.443232407868848,52.530454894177865,54.289307038699782,56.690563309840982,59.360215305467428,61.816401601696718,64.550586841888588,null,null,0,0,0,0,0,0,0,0,0,0,null,null,0,0,0,0,0,0,0,0,0,0]
[null,0,"NA","","","","","","","","","","",null,null,"","","","","","","","","","",null,0,0,0,0,0,0,0,0,0,0,null,"","","","","","","","","","",null,"","","","","","","","","","",null,null,0,0,0,0,0,0,0,0,0,0,null,null,0,0,0,0,0,0,0,0,0,0]
[null,0,"NA","","","","","","","","","","",null,null,"","","","","","","","","","",null,0,0,0,0,0,0,0,0,0,0,null,"","","","","","","","","","",null,"","","","","","","","","","",null,null,0,0,0,0,0,0,0,0,0,0,null,null,0,0,0,0,0,0,0,0,0,0]
[null,0,"NA","","","","","","","","","","",null,null,"","","","","","","","","","",null,0,0,0,0,0,0,0,0,0,0,null,"","","","","","","","","","",null,"","","","","","","","","","",null,null,0,0,0,0,0,0,0,0,0,0,null,null,0,0,0,0,0,0,0,0,0,0]
[null,0,"NA","","","","","","","","","","",null,null,"","","","","","","","","","",null,0,0,0,0,0,0,0,0,0,0,null,"","","","","","","","","","",null,"","","","","","","","","","",null,null,0,0,0,0,0,0,0,0,0,0,null,null,0,0,0,0,0,0,0,0,0,0]
[null,0,"NA","","","","","","","","","","",null,null,"","","","","","","","","","",null,0,0,0,0,0,0,0,0,0,0,null,"","","","","","","","","","",null,"","","","","","","","","","",null,null,0,0,0,0,0,0,0,0,0,0,null,null,0,0,0,0,0,0,0,0,0,0]
[null,0,"NA","","","","","","","","","","",null,null,"","","","","","","","","","",null,0,0,0,0,0,0,0,0,0,0,null,"","","","","","","","","","",null,"","","","","","","","","","",null,null,0,0,0,0,0,0,0,0,0,0,null,null,0,0,0,0,0,0,0,0,0,0]
[null,0,"NA","","","","","","","","","","",null,null,"","","","","","","","","","",null,0,0,0,0,0,0,0,0,0,0,null,"","","","","","","","","","",null,"","","","","","","","","","",null,null,0,0,0,0,0,0,0,0,0,0,null,null,0,0,0,0,0,0,0,0,0,0]
[null,0,"NA","","","","","","","","","","",null,null,"","","","","","","","","","",null,0,0,0,0,0,0,0,0,0,0,null,"","","","","","","","","","",null,"","","","","","","","","","",null,null,0,0,0,0,0,0,0,0,0,0,null,null,0,0,0,0,0,0,0,0,0,0]
[null,null,null,null,null,null,null,null,null,null,null,null,null,null,null,null,null,null,null,null,null,null,null,null,null,null,21620.750000000004,21620.75,21620.75,21620.75,21620.75,21620.75,21620.75,21620.75,21620.75,21620.75,null,null,null,null,null,null,null,null,null,null,null,null,null,null,null,null,null,null,null,null,null,null,null,null,800485.77202083333,801284.99492978002,802014.261134131,812575.36070869293,818782.90362820507,818782.90362820507,827298.24582593853,838192.29045261745,844595.52991738671,853379.32342852722,null,null,922869.8888232616,960140.76576255425,998903.21540761995,1045943.2130149064,1089221.8866723557,1125691.7831370481,1175481.9646861162,1230837.3464221526,1281766.5050785374,1338459.987208721]
[null,null,null,null,null,null,null,null,null,null,null,null,null,null,null,null,null,null,null,null,null,null,null,null,null,null,true,true,true,true,true,true,true,true,true,true]
[null,"Public Road Lights"]
[null,null,"Offered / No Longer Offered / NA","2024-25","2025-26","2026-27","2027-28","2028-29","2029-30","2030-31","2031-32","2032-33","2033-34",null,null,"2024-25","2025-26","2026-27","2027-28","2028-29","2029-30","2030-31","2031-32","2032-33","2033-34",null,"2024-25","2025-26","2026-27","2027-28","2028-29","2029-30","2030-31","2031-32","2032-33","2033-34",null,"2024-25","2025-26","2026-27","2027-28","2028-29","2029-30","2030-31","2031-32","2032-33","2033-34",null,"2024-25","2025-26","2026-27","2027-28","2028-29","2029-30","2030-31","2031-32","2032-33","2033-34",null,null,"2024-25","2025-26","2026-27","2027-28","2028-29","2029-30","2030-31","2031-32","2032-33","2033-34",null,null,"2024-25","2025-26","2026-27","2027-28","2028-29","2029-30","2030-31","2031-32","2032-33","2033-34"]
[null,"50W Mercury Vapour","Obsolete, no new Connections",34.283999999999999,34.640553599999997,35.000815357439997,35.364823837157374,35.732618005063813,36.104237232316478,36.479721299532571,36.859110401047708,37.242445149218604,37.629766578770479,null,null,39.978503516739792,41.746782345791338,43.593273457500302,45.521436239073033,47.534883088974965,49.637386184731902,51.832884550076294,54.125491434678537,56.519502020289316,59.019401467730269,null,53.6,26.8,0,0,0,0,0,0,0,0,null,125.1366,126.43802063999999,127.75297605465599,129.43525524399598,130.42405571848292,131.78046589795514,133.15098274329387,134.90434406783461,135.93492479464791,137.34864801251223,null,145.92153783610024,152.37575556213838,159.11544811987611,166.60845663500731,173.50232327475862,181.17645957427143,189.19002860777849,198.09929865092346,206.296182374056,215.42081535721547,null,null,6707.3217599999998,3388.538953152,0,0,0,0,0,0,0,0,null,null,7821.3944280149735,4083.6702490653088,0,0,0,0,0,0,0,0]
[null,"80W Mercury Vapour","Obsolete, no new Connections",34.271000000000001,34.627418399999996,34.987543551359998,35.351414004294142,35.719068709938803,36.090547024522166,36.465888713577193,36.845133956198396,37.228323349342858,37.615497912176025,null,null,39.963344242859336,41.730952565996233,43.576743514817196,45.504175164778673,47.516858544576507,49.618564401381022,51.813230265303474,54.10496782632913,56.498070637537481,58.997022159041641,null,1165.5666666666666,582.7833333333333,0,0,0,0,0,0,0,0,null,125.08915,126.39007715999998,127.704533962464,129.38617525571655,130.37460079127663,131.7304966395059,133.10049380455675,134.85319027968615,135.88338022510143,137.29656737944251,null,145.86620648643657,152.31797686588624,159.05511382908276,166.54528110308993,173.43653368770424,181.10776006504074,189.11829046835766,198.0241822443646,206.21795782701182,215.33913088050198,null,null,145799.74360166668,73658.030467561985,0,0,0,0,0,0,0,0,null,null,170016.78807370758,88768.378284490725,0,0,0,0,0,0,0,0]
[null,"125W Mercury Vapour","Obsolete, no new Connections",37.101999999999997,37.487860799999993,37.877734552319993,38.271662991664122,38.669688286777429,39.071853044959916,39.4782003166275,39.888773599920427,40.303616845359599,40.722774460551335,null,null,43.264567654826735,45.17819153522197,47.176456417576013,49.263106036112696,51.442049713194166,53.717369683406915,56.093328741597546,58.574378229186877,61.165166373724595,63.870546997308594,null,37.6,18.8,0,0,0,0,0,0,0,0,null,135.42230000000001,136.83069191999996,138.25373111596798,140.07428654949069,141.14436224673761,142.61226361410368,144.09543115569039,145.99291137570876,147.10820148556252,148.63812678101237,null,157.91567194011756,164.9003991035602,172.19406592415245,180.30296809217245,187.7634814531587,196.06839934443525,204.74064990683107,214.38222431882397,223.25285726409479,233.12749654017637,null,null,5091.8784800000003,2572.4170080959993,0,0,0,0,0,0,0,0,null,null,5937.6292649484203,3100.1275031469318,0,0,0,0,0,0,0,0]
[null,"250W Mercury Vapour","Obsolete, no new Connections",37.374000000000002,37.762689600000002,38.155421571840002,38.552237956187135,38.953181230931477,39.358294315733161,39.767620576616785,40.181203830613597,40.599088350451979,41.021318869296678,null,null,43.581746308325549,45.509399235550276,47.522313679868638,49.624260821348606,51.819178642146483,54.111179304286829,56.504556853767085,59.003795265420457,61.613576843609039,64.338790994485777,null,130.80000000000001,65.400000000000006,0,0,0,0,0,0,0,0,null,136.4151,137.83381704000001,139.26728873721601,141.10119091964489,142.17911149289989,143.65777425242604,145.15181510465126,147.06320602004575,148.18667247914973,149.72781387293287,null,159.07337402538826,166.10930720975853,173.45644493152054,181.62479460613591,189.14000204383464,197.50580446064694,206.24163251624984,215.95389067143887,224.889555479173,234.83658712987307,null,null,17843.095079999999,9014.3316344160012,0,0,0,0,0,0,0,0,null,null,20806.797322520786,10863.548691518208,0,0,0,0,0,0,0,0]
[null,0,"NA","","","","","","","","","","",null,null,"","","","","","","","","","",null,0,0,0,0,0,0,0,0,0,0,null,"","","","","","","","","","",null,"","","","","","","","","","",null,null,0,0,0,0,0,0,0,0,0,0,null,null,0,0,0,0,0,0,0,0,0,0]
[null,"400W Mercury Vapour","Obsolete, no new Connections",40.704000000000001,41.127321600000002,41.555045744639997,41.98721822038425,42.423885289876246,42.865093696890959,43.310890671338626,43.761323934320544,44.216441703237479,44.676292696951144,null,null,47.464852617704366,49.564258213834172,51.7565220748481,54.045751390597033,56.436235014981818,58.932451501088757,61.539077491725152,64.2609964810744,67.103307963885655,70.071336989338818,null,78.400000000000006,39.200000000000003,0,0,0,0,0,0,0,0,null,148.56960000000001,150.11472384000001,151.67591696793599,153.67321868660636,154.84718130804831,156.45759199365202,158.084750950386,160.16644559961321,161.39001221681679,163.06846834387167,null,173.24671205462096,180.90954248049474,188.91130557319556,197.80745008958513,205.99225780468365,215.10344797897397,224.61763284479679,235.19524712073232,244.92707406818263,255.76038001108668,null,null,11647.856640000002,5884.4971745280009,0,0,0,0,0,0,0,0,null,null,13582.542225082285,7091.6540652353942,0,0,0,0,0,0,0,0]
[null,"70W Sodium Vapour","Offered",35.174999999999997,35.540819999999997,35.910444527999992,36.283913151091191,36.661265847862538,37.042543012680305,37.427785460012181,37.817034428796305,38.210331586855787,38.607719035359089,null,null,41.017496826546555,42.831731099440269,44.726210298319124,46.70448371570977,48.770257631976833,50.927402259011316,53.179958991043428,55.532147976164296,57.988376022741683,60.553244855542275,null,54.6,27.3,0,0,0,0,0,0,0,0,null,128.38874999999999,129.72399299999998,131.07312252719998,132.79912213299377,133.81362034469828,135.20528199628313,136.61141692904445,138.41034600939446,139.46771029202361,140.91817447906067,null,149.71386341689492,156.33581851295696,163.25066758886479,170.93841039949777,178.01144035671544,185.88501824539128,194.10685031730853,203.24766159276132,211.65757248300713,221.01934372272933,null,null,7010.0257499999998,3541.4650088999997,0,0,0,0,0,0,0,0,null,null,8174.3769425624632,4267.9678454037248,0,0,0,0,0,0,0,0]
[null,0,"NA","","","","","","","","","","",null,null,"","","","","","","","","","",null,0,0,0,0,0,0,0,0,0,0,null,"","","","","","","","","","",null,"","","","","","","","","","",null,null,0,0,0,0,0,0,0,0,0,0,null,null,0,0,0,0,0,0,0,0,0,0]
[null,"100W Sodium Vapour","Offered",38.994,39.399537599999995,39.809292791039994,40.223309436066806,40.641631854201897,41.064304825485593,41.491373595670645,41.922883881065616,42.358881873428693,42.799414244912349,null,null,45.470825053428754,47.482033333093781,49.582198844993776,51.775256233415398,54.065314174877173,56.456663075703965,58.953783110070994,61.56135261357641,64.284256848067912,67.127597154143984,null,97.200000000000017,48.600000000000009,0,0,0,0,0,0,0,0,null,142.32810000000001,143.80831223999996,145.30391868729598,147.21731253600453,148.34195626783693,149.88471261302243,151.44351362419786,153.43775500470016,154.60991883801472,156.21786199393009,null,165.96851144501497,173.30942166579229,180.97502578422728,189.49743781430035,197.33839673830167,206.06682022631946,215.18130835175916,225.31455056568967,234.63753749544787,245.01572961262553,null,null,13834.291320000004,6989.0839748639992,0,0,0,0,0,0,0,0,null,null,16132.139312455458,8422.8378929575065,0,0,0,0,0,0,0,0]
[null,0,"NA","","","","","","","","","","",null,null,"","","","","","","","","","",null,0,0,0,0,0,0,0,0,0,0,null,"","","","","","","","","","",null,"","","","","","","","","","",null,null,0,0,0,0,0,0,0,0,0,0,null,null,0,0,0,0,0,0,0,0,0,0]
[null,"150W Sodium Vapour","Offered",39.174999999999997,39.582419999999999,39.994077167999997,40.410015570547195,40.830279732480882,41.254914641698683,41.683965753972345,42.117478997813656,42.555500779390918,42.998077987496579,null,null,45.681888789764358,47.702432574856367,49.812346508504675,52.015583498590772,54.316271293040302,56.718720213127746,59.227431228830881,61.847104391364219,64.582647638689565,67.439185990500874,null,1605.6000000000001,802.80000000000007,0,0,0,0,0,0,0,0,null,142.98874999999998,144.47583299999999,145.97838166319997,147.90065698820274,149.03052102355522,150.5804384422002,152.14647500199905,154.14997313199797,155.32757784477687,156.9429846543625,null,166.73889408263989,174.11387889822575,181.81506475604203,190.37703560484223,198.25439021959713,207.02332877791628,216.18012398523271,226.36040207239304,235.72666388121692,246.1530288653282,null,null,229582.73699999999,115985.19873240001,0,0,0,0,0,0,0,0,null,null,267715.96833908663,139778.62197949566,0,0,0,0,0,0,0,0]
[null,0,"NA","","","","","","","","","","",null,null,"","","","","","","","","","",null,0,0,0,0,0,0,0,0,0,0,null,"","","","","","","","","","",null,"","","","","","","","","","",null,null,0,0,0,0,0,0,0,0,0,0,null,null,0,0,0,0,0,0,0,0,0,0]
[null,0,"NA","","","","","","","","","","",null,null,"","","","","","","","","","",null,0,0,0,0,0,0,0,0,0,0,null,"","","","","","","","","","",null,"","","","","","","","","","",null,null,0,0,0,0,0,0,0,0,0,0,null,null,0,0,0,0,0,0,0,0,0,0]
[null,0,"NA","","","","","","","","","","",null,null,"","","","","","","","","","",null,0,0,0,0,0,0,0,0,0,0,null,"","","","","","","","","","",null,"","","","","","","","","","",null,null,0,0,0,0,0,0,0,0,0,0,null,null,0,0,0,0,0,0,0,0,0,0]
[null,"250W Sodium Vapour","Offered",40.456000000000003,40.876742400000005,41.301860520960005,41.731399870377984,42.165406429029915,42.603926655891826,43.047007493113099,43.494696371041471,43.947041213300302,44.404090441918626,null,null,47.175660315984871,49.262274722358377,51.441181629816604,53.716463204058421,56.092382167995886,58.573389787933543,61.164134212982333,63.869469183332008,66.694463123696892,69.644408638971399,null,1994.2333333333331,997.11666666666656,0,0,0,0,0,0,0,0,null,147.6644,149.20010976,150.75179090150402,152.73692352558342,153.90373346595919,155.50433229400517,157.12157734986283,159.19058871801178,160.40670042854609,162.07493011300301,null,172.19116015334478,179.80730273660808,187.7603129488306,196.60225532685382,204.73719491318496,213.79287272595741,223.24908987738553,233.76225721099516,243.43479040149367,254.20209153224562,null,null,294477.26862666663,148769.91611019199,0,0,0,0,0,0,0,0,null,null,343389.35128313856,179288.85834705085,0,0,0,0,0,0,0,0]
[null,0,"NA","","","","","","","","","","",null,null,"","","","","","","","","","",null,0,0,0,0,0,0,0,0,0,0,null,"","","","","","","","","","",null,"","","","","","","","","","",null,null,0,0,0,0,0,0,0,0,0,0,null,null,0,0,0,0,0,0,0,0,0,0]
[null,0,"NA","","","","","","","","","","",null,null,"","","","","","","","","","",null,0,0,0,0,0,0,0,0,0,0,null,"","","","","","","","","","",null,"","","","","","","","","","",null,null,0,0,0,0,0,0,0,0,0,0,null,null,0,0,0,0,0,0,0,0,0,0]
[null,0,"NA","","","","","","","","","","",null,null,"","","","","","","","","","",null,0,0,0,0,0,0,0,0,0,0,null,"","","","","","","","","","",null,"","","","","","","","","","",null,null,0,0,0,0,0,0,0,0,0,0,null,null,0,0,0,0,0,0,0,0,0,0]
[null,"400W Sodium Vapour","Offered",41.164000000000001,41.592105600000004,42.024663498240002,42.461719998621696,42.903321886607358,43.349516434228072,43.800351405144042,44.255875059757535,44.716136160379016,45.181183976446952,null,null,48.001257693474415,50.124388883507024,52.341427739019444,54.656527865628355,57.074026586004116,59.598453065812144,62.234536799070703,64.987216468822382,67.861649199719665,70.863220219859045,null,174.7,87.35,0,0,0,0,0,0,0,0,null,150.24860000000001,151.81118544,153.39002176857602,155.4098951949554,156.59712488611686,158.22573498493247,159.87128262877576,161.9765027187126,163.2138969853834,164.91132151403136,null,175.20459058118161,182.95401942480063,191.04621124742098,200.04289198819978,208.32019703891504,217.53435369021435,227.15605931660809,237.85321227588992,247.6950195789768,258.6507538024855,null,null,26248.430420000001,13260.707048184,0,0,0,0,0,0,0,0,null,null,30608.241974532426,15981.033596756335,0,0,0,0,0,0,0,0]
[null,0,"NA","","","","","","","","","","",null,null,"","","","","","","","","","",null,0,0,0,0,0,0,0,0,0,0,null,"","","","","","","","","","",null,"","","","","","","","","","",null,null,0,0,0,0,0,0,0,0,0,0,null,null,0,0,0,0,0,0,0,0,0,0]
[null,"250W Sodium Vapour - Flood Light","Offered",41.969000000000001,42.405477599999998,42.846494567039997,43.292098110537211,43.742335930886796,44.197256224568015,44.656907689303523,45.121339529272277,45.590601460376703,46.064743715564617,null,null,48.939966576072003,51.104617555434508,53.365012651319276,55.72538669693315,58.190161835293139,60.763955804078066,63.451590586925427,66.258101447381364,69.188746362429157,72.249015873269457,null,9.1333333333333329,4.5666666666666664,0,0,0,0,0,0,0,0,null,153.18685000000002,154.77999323999998,156.38970516969599,158.44907908456619,159.65952614773678,161.31998521967324,162.99771306595784,165.14410267713654,166.40569533037498,168.13631456181088,null,178.6308780026628,186.53185407733596,194.78229617731537,203.95491531077533,212.39409069881995,221.78843868488494,231.59830564227781,242.50465129741579,252.5389242228664,263.70890793743348,null,null,1399.1065633333335,706.82863579599984,0,0,0,0,0,0,0,0,null,null,1631.4953524243201,851.82880028650084,0,0,0,0,0,0,0,0]
[null,"400W Sodium Vapour - Flood Light","Offered",41.164000000000001,41.592105600000004,42.024663498240002,42.461719998621696,42.903321886607358,43.349516434228072,43.800351405144042,44.255875059757535,44.716136160379016,45.181183976446952,null,null,48.001257693474415,50.124388883507024,52.341427739019444,54.656527865628355,57.074026586004116,59.598453065812144,62.234536799070703,64.987216468822382,67.861649199719665,70.863220219859045,null,3.7333333333333338,1.8666666666666669,0,0,0,0,0,0,0,0,null,150.24860000000001,151.81118544,153.39002176857602,155.4098951949554,156.59712488611686,158.22573498493247,159.87128262877576,161.9765027187126,163.2138969853834,164.91132151403136,null,175.20459058118161,182.95401942480063,191.04621124742098,200.04289198819978,208.32019703891504,217.53435369021435,227.15605931660809,237.85321227588992,247.6950195789768,258.6507538024855,null,null,560.92810666666674,283.38087948800006,0,0,0,0,0,0,0,0,null,null,654.09713816974477,341.51416959296125,0,0,0,0,0,0,0,0]
[null,"1x20W Fluorescent","Obsolete, no new Connections",36.18,36.556272,36.936457228800002,37.32059638397952,37.708730586372909,38.100901384471186,38.497150758869687,38.89752112676193,39.302055346480252,39.710796722083643,null,null,42.189425307305029,44.055494845138568,46.004102021128254,48.038897536158629,50.163693564319047,52.382470894983086,54.699386390787545,57.118780775483295,59.645186766248614,62.283337565700634,null,2.4000000000000004,1.2000000000000002,0,0,0,0,0,0,0,0,null,132.05700000000002,133.43039279999999,134.81806888512,136.59338276536505,137.63686664026113,139.06829005331983,140.51460026987436,142.36492732394868,143.45250201465294,144.94440803560531,null,153.99140237166336,160.80255618475579,167.91497237711815,175.82236498234059,183.09748150976452,191.19601876668824,199.65276032637456,209.05473763826885,217.70493169680742,227.33418211480731,null,null,316.93680000000006,160.11647136000002,0,0,0,0,0,0,0,0,null,null,369.57936569199211,192.96306742170697,0,0,0,0,0,0,0,0]
[null,"1x40W Fluorescent","Obsolete, no new Connections",36.18,36.556272,36.936457228800002,37.32059638397952,37.708730586372909,38.100901384471186,38.497150758869687,38.89752112676193,39.302055346480252,39.710796722083643,null,null,42.189425307305029,44.055494845138568,46.004102021128254,48.038897536158629,50.163693564319047,52.382470894983086,54.699386390787545,57.118780775483295,59.645186766248614,62.283337565700634,null,16,8,0,0,0,0,0,0,0,0,null,132.05700000000002,133.43039279999999,134.81806888512,136.59338276536505,137.63686664026113,139.06829005331983,140.51460026987436,142.36492732394868,143.45250201465294,144.94440803560531,null,153.99140237166336,160.80255618475579,167.91497237711815,175.82236498234059,183.09748150976452,191.19601876668824,199.65276032637456,209.05473763826885,217.70493169680742,227.33418211480731,null,null,2112.9120000000003,1067.4431423999999,0,0,0,0,0,0,0,0,null,null,2463.8624379466137,1286.4204494780463,0,0,0,0,0,0,0,0]
[null,"2x20W Fluorescent","Obsolete, no new Connections",36.18,36.556272,36.936457228800002,37.32059638397952,37.708730586372909,38.100901384471186,38.497150758869687,38.89752112676193,39.302055346480252,39.710796722083643,null,null,42.189425307305029,44.055494845138568,46.004102021128254,48.038897536158629,50.163693564319047,52.382470894983086,54.699386390787545,57.118780775483295,59.645186766248614,62.283337565700634,null,2,1,0,0,0,0,0,0,0,0,null,132.05700000000002,133.43039279999999,134.81806888512,136.59338276536505,137.63686664026113,139.06829005331983,140.51460026987436,142.36492732394868,143.45250201465294,144.94440803560531,null,153.99140237166336,160.80255618475579,167.91497237711815,175.82236498234059,183.09748150976452,191.19601876668824,199.65276032637456,209.05473763826885,217.70493169680742,227.33418211480731,null,null,264.11400000000003,133.43039279999999,0,0,0,0,0,0,0,0,null,null,307.98280474332671,160.80255618475579,0,0,0,0,0,0,0,0]
[null,"2x24W Fluorescent","Obsolete, no new Connections",36.18,36.556272,36.936457228800002,37.32059638397952,37.708730586372909,38.100901384471186,38.497150758869687,38.89752112676193,39.302055346480252,39.710796722083643,null,null,42.189425307305029,44.055494845138568,46.004102021128254,48.038897536158629,50.163693564319047,52.382470894983086,54.699386390787545,57.118780775483295,59.645186766248614,62.283337565700634,null,0.4,0.2,0,0,0,0,0,0,0,0,null,132.05700000000002,133.43039279999999,134.81806888512,136.59338276536505,137.63686664026113,139.06829005331983,140.51460026987436,142.36492732394868,143.45250201465294,144.94440803560531,null,153.99140237166336,160.80255618475579,167.91497237711815,175.82236498234059,183.09748150976452,191.19601876668824,199.65276032637456,209.05473763826885,217.70493169680742,227.33418211480731,null,null,52.822800000000008,26.686078559999999,0,0,0,0,0,0,0,0,null,null,61.596560948665342,32.160511236951159,0,0,0,0,0,0,0,0]
[null,"2x40W Fluorescent","Obsolete, no new Connections",36.18,36.556272,36.936457228800002,37.32059638397952,37.708730586372909,38.100901384471186,38.497150758869687,38.89752112676193,39.302055346480252,39.710796722083643,null,null,42.189425307305029,44.055494845138568,46.004102021128254,48.038897536158629,50.163693564319047,52.382470894983086,54.699386390787545,57.118780775483295,59.645186766248614,62.283337565700634,null,0.8,0.4,0,0,0,0,0,0,0,0,null,132.05700000000002,133.43039279999999,134.81806888512,136.59338276536505,137.63686664026113,139.06829005331983,140.51460026987436,142.36492732394868,143.45250201465294,144.94440803560531,null,153.99140237166336,160.80255618475579,167.91497237711815,175.82236498234059,183.09748150976452,191.19601876668824,199.65276032637456,209.05473763826885,217.70493169680742,227.33418211480731,null,null,105.64560000000002,53.372157119999997,0,0,0,0,0,0,0,0,null,null,123.19312189733068,64.321022473902318,0,0,0,0,0,0,0,0]
[null,"4x40W Fluorescent","Obsolete, no new Connections",36.18,36.556272,36.936457228800002,37.32059638397952,37.708730586372909,38.100901384471186,38.497150758869687,38.89752112676193,39.302055346480252,39.710796722083643,null,null,42.189425307305029,44.055494845138568,46.004102021128254,48.038897536158629,50.163693564319047,52.382470894983086,54.699386390787545,57.118780775483295,59.645186766248614,62.283337565700634,null,0.4,0.2,0,0,0,0,0,0,0,0,null,132.05700000000002,133.43039279999999,134.81806888512,136.59338276536505,137.63686664026113,139.06829005331983,140.51460026987436,142.36492732394868,143.45250201465294,144.94440803560531,null,153.99140237166336,160.80255618475579,167.91497237711815,175.82236498234059,183.09748150976452,191.19601876668824,199.65276032637456,209.05473763826885,217.70493169680742,227.33418211480731,null,null,52.822800000000008,26.686078559999999,0,0,0,0,0,0,0,0,null,null,61.596560948665342,32.160511236951159,0,0,0,0,0,0,0,0]
[null,"32W Compact Fluorescent","Not Offered",36.18,36.556272,36.936457228800002,37.32059638397952,37.708730586372909,38.100901384471186,38.497150758869687,38.89752112676193,39.302055346480252,39.710796722083643,null,null,42.189425307305029,44.055494845138568,46.004102021128254,48.038897536158629,50.163693564319047,52.382470894983086,54.699386390787545,57.118780775483295,59.645186766248614,62.283337565700634,null,0,0,0,0,0,0,0,0,0,0,null,132.05700000000002,133.43039279999999,134.81806888512,136.59338276536505,137.63686664026113,139.06829005331983,140.51460026987436,142.36492732394868,143.45250201465294,144.94440803560531,null,153.99140237166336,160.80255618475579,167.91497237711815,175.82236498234059,183.09748150976452,191.19601876668824,199.65276032637456,209.05473763826885,217.70493169680742,227.33418211480731,null,null,0,0,0,0,0,0,0,0,0,0,null,null,0,0,0,0,0,0,0,0,0,0]
[null,"42W Compact Fluorescent","Offered",36.18,36.556272,36.936457228800002,37.32059638397952,37.708730586372909,38.100901384471186,38.497150758869687,38.89752112676193,39.302055346480252,39.710796722083643,null,null,42.189425307305029,44.055494845138568,46.004102021128254,48.038897536158629,50.163693564319047,52.382470894983086,54.699386390787545,57.118780775483295,59.645186766248614,62.283337565700634,null,971.06666666666672,485.53333333333336,0,0,0,0,0,0,0,0,null,132.05700000000002,133.43039279999999,134.81806888512,136.59338276536505,137.63686664026113,139.06829005331983,140.51460026987436,142.36492732394868,143.45250201465294,144.94440803560531,null,153.99140237166336,160.80255618475579,167.91497237711815,175.82236498234059,183.09748150976452,191.19601876668824,199.65276032637456,209.05473763826885,217.70493169680742,227.33418211480731,null,null,128236.15080000002,64784.903384160003,0,0,0,0,0,0,0,0,null,null,149535.91779637657,78075.001112905098,0,0,0,0,0,0,0,0]
[null,0,"NA","","","","","","","","","","",null,null,"","","","","","","","","","",null,0,0,0,0,0,0,0,0,0,0,null,"","","","","","","","","","",null,"","","","","","","","","","",null,null,0,0,0,0,0,0,0,0,0,0,null,null,0,0,0,0,0,0,0,0,0,0]
[null,"60W Incandescent","Obsolete, no new Connections",35.174999999999997,35.540819999999997,35.910444527999992,36.283913151091191,36.661265847862538,37.042543012680305,37.427785460012181,37.817034428796305,38.210331586855787,38.607719035359089,null,null,41.017496826546555,42.831731099440269,44.726210298319124,46.70448371570977,48.770257631976833,50.927402259011316,53.179958991043428,55.532147976164296,57.988376022741683,60.553244855542275,null,2.4000000000000004,1.2000000000000002,0,0,0,0,0,0,0,0,null,128.38874999999999,129.72399299999998,131.07312252719998,132.79912213299377,133.81362034469828,135.20528199628313,136.61141692904445,138.41034600939446,139.46771029202361,140.91817447906067,null,149.71386341689492,156.33581851295696,163.25066758886479,170.93841039949777,178.01144035671544,185.88501824539128,194.10685031730853,203.24766159276132,211.65757248300713,221.01934372272933,null,null,308.13300000000004,155.66879159999999,0,0,0,0,0,0,0,0,null,null,359.31327220054789,187.60298221554839,0,0,0,0,0,0,0,0]
[null,"100W Incandescent","Obsolete, no new Connections",38.567999999999998,38.969107199999996,39.374385914879994,39.783879528394742,40.197631875490046,40.615687246995144,41.038090394363891,41.464886534465272,41.896121354423713,42.331841016509721,null,null,44.974067309346061,46.96330362596197,49.040525338609015,51.209624106538577,53.474663719973918,55.839887713590578,58.309727316746638,60.888809755357627,63.581966920969478,66.394244423270919,null,3.6,1.8,0,0,0,0,0,0,0,0,null,140.7732,142.23724127999998,143.71650858931199,145.60899907392476,146.72135634553865,148.24725845153228,149.78902993942819,151.76148471614289,152.92084294364656,154.51121971026049,null,164.15534567911311,171.41605823476118,178.99791748592293,187.4272242299312,195.18252257790482,203.81559015460559,212.83050470612525,222.85304370460889,232.0741792615386,242.33899214493886,null,null,506.78352000000001,256.02703430399998,0,0,0,0,0,0,0,0,null,null,590.95924444480727,308.54890482257014,0,0,0,0,0,0,0,0]
[null,"100W Metal Halide","Offered",38.274000000000001,38.672049600000001,39.074238915839999,39.480611000564735,39.891209354970606,40.306077932262298,40.725261142757823,41.148803858642502,41.576751418772382,42.009149633527613,null,null,44.631234500049551,46.605307067518893,48.666694327160386,50.819258272496832,53.067031715885769,55.414225843963024,57.865238107269263,60.424660458840442,63.09728795719731,65.888127749851463,null,0,0,0,0,0,0,0,0,0,0,null,139.70009999999999,141.15298103999999,142.62097204281599,144.49903626206694,145.60291414564273,147.11718445275739,148.64720317106605,150.60462212263155,151.75514267851918,153.33339616237581,null,162.90400592518085,170.10937079644395,177.63343429413541,185.9984852773384,193.69466576298305,202.26192433046504,211.20811909153284,221.15425727935602,230.30510104377018,240.49166628695784,null,null,0,0,0,0,0,0,0,0,0,0,null,null,0,0,0,0,0,0,0,0,0,0]
[null,"150W Metal Halide","Offered",41.136000000000003,41.563814399999998,41.996078069759996,42.432837281685501,42.874138789415028,43.320029832824943,43.770558143086319,44.225771947774412,44.685719976031265,45.150451463781991,null,null,47.968606949731893,50.090293973179108,52.30582478554814,54.619350167148184,57.035204490376671,59.557913840133331,62.192204493406187,64.943011773915984,67.815489298408025,70.815018631914342,null,6,3,0,0,0,0,0,0,0,0,null,150.1464,151.70792255999999,153.285684954624,155.30418445096893,156.49060658136486,158.11810888981105,159.76253722226508,161.86632532885434,163.10287791251412,164.79914784280427,null,175.0854153665214,182.82957300210376,190.91626046725071,199.90682161176235,208.17849638987485,217.38638551648665,227.00154640093257,237.69142309253249,247.5265359391893,258.47481800648734,null,null,900.87840000000006,455.12376767999996,0,0,0,0,0,0,0,0,null,null,1050.5124921991285,548.48871900631127,0,0,0,0,0,0,0,0]
[null,"250W Metal Halide","Offered",40.274000000000001,40.692849600000002,41.116055235840001,41.543662210292737,41.975716297279781,42.412263746771487,42.853351289737908,43.299026143151181,43.749336015039951,44.204329109596365,null,null,46.963430481658456,49.040657805226942,51.209762432253157,53.474808163937332,55.840038546417503,58.309884821021242,60.888974226163,63.582138666440407,66.394423765171254,69.33109831733077,null,8,4,0,0,0,0,0,0,0,0,null,147.0001,148.52890103999999,150.07360161081601,152.04980368967142,153.21136448507121,154.80476267571592,156.41473220754335,158.47443568393331,159.68507645489584,161.34580125002674,null,171.41652125805336,178.99840098907833,186.91563287772402,195.71779788001061,203.81614069442389,212.83107959672753,222.24475592549493,232.71062751917191,242.33964674287509,253.05850885825731,null,null,1176.0008,594.11560415999998,0,0,0,0,0,0,0,0,null,null,1371.3321700644269,715.99360395631334,0,0,0,0,0,0,0,0]
[null,"400W Metal Halide","Offered",48.043999999999997,48.543657599999996,49.048511639039994,49.558616160086011,50.074025768150904,50.594795636139672,51.12098151075552,51.652639718467377,52.189827171539434,52.732601374123441,null,null,56.024011870209037,58.501995421222695,61.089582020538572,63.791619492183663,66.613170083033282,69.559519946892394,72.63618904806512,75.848941502966241,79.20379637915002,82.707038971987856,null,0.4,0.2,0,0,0,0,0,0,0,0,null,175.36059999999998,177.18435023999999,179.02706748249599,181.38453514591481,182.77019405375077,184.67100407190981,186.59158251425765,189.0486613695906,190.49286917611894,192.47399501555057,null,204.487643326263,213.53228328746286,222.97697437496581,233.4773273413922,243.13807080307149,253.89224780615726,265.12209002543767,277.60712590085643,289.09385678389759,301.88069224775569,null,null,70.144239999999996,35.436870047999996,0,0,0,0,0,0,0,0,null,null,81.795057330505202,42.706456657492573,0,0,0,0,0,0,0,0]
[null,"400W Metal Halide - Flood Light","Offered",40.844000000000001,41.2687776,41.697972887039995,42.131631805065211,42.569800775837891,43.012526703906602,43.459856981627226,43.911839494236148,44.368522624976201,44.829955260275952,null,null,47.628106336416991,49.73473276547373,51.934536842204594,54.231639882997868,56.630345493119044,59.13514762948283,61.750739020047703,64.48201995560639,67.334107470443826,70.312344929062363,null,0,0,0,0,0,0,0,0,0,0,null,149.0806,150.63103824000001,152.19760103769599,154.20177240653868,155.37977283180828,156.99572246925908,158.62847798293936,160.7173325489043,161.94510758116314,163.62933670000723,null,173.84258812792203,181.53177459397909,189.56105947404677,198.4878019717722,206.70076104988451,215.84328884761234,225.3901974231741,236.0041930375194,245.76949226711997,256.64005899107764,null,null,0,0,0,0,0,0,0,0,0,0,null,null,0,0,0,0,0,0,0,0,0,0]
[null,"LED 18","Offered",32.378999999999998,32.715741599999994,33.05598531263999,33.399767559891444,33.747125142514314,34.098095243996461,34.452715434534021,34.811023675053171,35.173058321273722,35.538858127814969,null,null,37.757086844257309,39.427110768124415,41.171001087399425,42.992024967475949,44.893594082893472,46.879271009083929,48.952775896829984,51.117993441939539,53.3789801631941,55.739972002206187,null,7295.4833333333345,9319.7833333333347,11344.083333333334,11344.083333333334,11344.083333333334,11344.083333333334,11344.083333333334,11344.083333333334,11344.083333333334,11344.083333333334,null,118.18334999999999,119.41245683999998,120.65434639113597,122.24314926920268,123.17700677017724,124.45804764058708,125.75241133604918,127.4083466506946,128.38166287264909,129.71683216652463,null,137.81336698153919,143.90895430365413,150.2741539690079,157.35081138096197,163.86161840256119,171.10933918315632,178.67763202342942,187.09185599749873,194.83327759565847,203.45089780805259,null,null,862204.66020250006,1112898.2250498179,1368712.9599899126,1386736.4722389409,1397330.229551455,1411862.4639387899,1426545.8335637534,1445330.9017677004,1456372.2820992374,1471518.5538330693,null,null,1005415.1219243696,1341200.2738366241,1704722.5254705898,1785000.7168732479,1858859.854293521,1941078.6028053241,2026933.9474764522,2122385.6054236256,2210204.937151616,2307963.9389760327]
[null,0,"NA","","","","","","","","","","",null,null,"","","","","","","","","","",null,0,0,0,0,0,0,0,0,0,0,null,"","","","","","","","","","",null,"","","","","","","","","","",null,null,0,0,0,0,0,0,0,0,0,0,null,null,0,0,0,0,0,0,0,0,0,0]
[null,0,"NA","","","","","","","","","","",null,null,"","","","","","","","","","",null,0,0,0,0,0,0,0,0,0,0,null,"","","","","","","","","","",null,"","","","","","","","","","",null,null,0,0,0,0,0,0,0,0,0,0,null,null,0,0,0,0,0,0,0,0,0,0]
[null,0,"NA","","","","","","","","","","",null,null,"","","","","","","","","","",null,0,0,0,0,0,0,0,0,0,0,null,"","","","","","","","","","",null,"","","","","","","","","","",null,null,0,0,0,0,0,0,0,0,0,0,null,null,0,0,0,0,0,0,0,0,0,0]
[null,"LED 20","Offered",45.997999999999998,46.476379199999997,46.959733543679995,47.448114772534268,47.941575166168626,48.440167547896777,48.9439452903949,49.452962321415008,49.967273129557725,50.48693277010512,null,null,53.638175381023132,56.010631616547364,58.488023349028666,61.074991953240037,63.776384095399315,66.597260813361842,69.542906998436848,72.618841296591498,75.830826447592685,79.184880081456541,null,48.666666666666664,48.666666666666664,48.666666666666664,48.666666666666664,48.666666666666664,48.666666666666664,48.666666666666664,48.666666666666664,48.666666666666664,48.666666666666664,null,167.89269999999999,169.63878407999999,171.40302743443198,173.66010006747544,174.9867493565155,176.80661154982326,178.64540030994141,180.99784209637892,182.38054692288569,184.2773046108837,null,195.77934014073443,204.43880540039788,213.48128522395461,223.53447054885856,232.7838019482075,243.08000196877074,253.83161054429448,265.78495914552491,276.78251653371331,289.02481229731637,null,null,8170.7780666666658,8255.7541585599993,8341.6140018090227,8451.4582032838043,8516.0218020170869,8604.5884287580648,8694.0761484171489,8808.5616486904401,8875.8532835804363,8968.1621577296737,null,null,9527.9278868490746,9949.3551961526973,10389.422547565791,10878.677566711116,11328.811694812764,11829.893429146843,12353.138379822331,12934.868011748878,13470.08247130738,14065.874198469397]
[null,"LED 200","Offered",45.201999999999998,45.672100799999996,46.147090648319995,46.627020391062523,47.11194140312957,47.601905593722115,48.096965411896825,48.597173852180553,49.102584460243229,49.613251338629759,null,null,52.709961380342783,55.041362022939559,57.475882243201745,60.018083096446716,62.672727376847682,65.444788540492667,68.339460023117141,71.362164969966713,74.518566396019054,77.814577795599774,null,4,4,4,4,4,4,4,4,4,4,null,164.9873,166.70316791999997,168.43688086636797,170.65489463128884,171.95858612142291,173.74695541708573,175.55392375342342,177.86565629898084,179.22443327988779,181.08836738599859,null,192.39135903825118,200.90097138372937,209.78697018768639,219.66618413299497,228.75545492549406,238.87347817279823,249.43902908437758,261.18552379007821,271.99276734546953,284.02320895393916,null,null,659.94920000000002,666.81267167999988,673.74752346547189,682.61957852515536,687.83434448569164,694.98782166834292,702.21569501369368,711.46262519592335,716.89773311955116,724.35346954399438,null,null,769.56543615300473,803.60388553491748,839.14788075074557,878.66473653197988,915.02181970197626,955.49391269119292,997.75611633751032,1044.7420951603128,1087.9710693818781,1136.0928358157566]
[null,"LED 240","Offered",45.201999999999998,45.672100799999996,46.147090648319995,46.627020391062523,47.11194140312957,47.601905593722115,48.096965411896825,48.597173852180553,49.102584460243229,49.613251338629759,null,null,52.709961380342783,55.041362022939559,57.475882243201745,60.018083096446716,62.672727376847682,65.444788540492667,68.339460023117141,71.362164969966713,74.518566396019054,77.814577795599774,null,30.833333333333332,30.833333333333332,30.833333333333332,30.833333333333332,30.833333333333332,30.833333333333332,30.833333333333332,30.833333333333332,30.833333333333332,30.833333333333332,null,164.9873,166.70316791999997,168.43688086636797,170.65489463128884,171.95858612142291,173.74695541708573,175.55392375342342,177.86565629898084,179.22443327988779,181.08836738599859,null,192.39135903825118,200.90097138372937,209.78697018768639,219.66618413299497,228.75545492549406,238.87347817279823,249.43902908437758,261.18552379007821,271.99276734546953,284.02320895393916,null,null,5087.1084166666669,5140.014344199999,5193.4704933796793,5261.8592511314055,5302.0564054105398,5357.19779202681,5412.9126490638882,5484.1910692185756,5526.0866927965399,5583.5579944016235,null,null,5932.0669036794116,6194.4466176649885,6468.4315807869971,6773.0406774340117,7053.2931935360666,7365.2655769946114,7691.0367301016422,8053.2203168607448,8386.4436598186439,8757.3822760797902]
[null,"LED 25","Offered",42.637999999999998,43.081435199999994,43.529482126079991,43.982188740191219,44.439603503089209,44.901775379521332,45.368753843468355,45.840588883440425,46.317331007828201,46.799031250309611,null,null,49.720086131920176,51.919242377197847,54.215668932472802,56.613668135619989,59.117732620105997,61.732553731904034,64.463030318695374,67.314277907823552,70.291638290196445,73.400689528091291,null,75,75,75,75,75,75,75,75,75,75,null,155.62869999999998,157.24723847999996,158.88260976019197,160.97481078909988,162.20455278627563,163.89148013525286,165.5959515286595,167.77655531339195,169.05825817857294,170.81646406363009,null,181.47831438150865,189.50523467677212,197.88719160352571,207.20602537636915,215.77972406338688,225.32382112144973,235.29006066323811,246.37025714263422,256.56447975921702,267.9125167775332,null,null,11672.152499999998,11793.542885999997,11916.195732014397,12073.11080918249,12165.341458970672,12291.861010143964,12419.696364649462,12583.241648504396,12679.369363392971,12811.234804772257,null,null,13610.873578613149,14212.892600757908,14841.539370264429,15540.451903227686,16183.479304754015,16899.28658410873,17646.754549742858,18477.769285697566,19242.335981941276,20093.438758314991]
[null,0,"NA","","","","","","","","","","",null,null,"","","","","","","","","","",null,0,0,0,0,0,0,0,0,0,0,null,"","","","","","","","","","",null,"","","","","","","","","","",null,null,0,0,0,0,0,0,0,0,0,0,null,null,0,0,0,0,0,0,0,0,0,0]
[null,0,"NA","","","","","","","","","","",null,null,"","","","","","","","","","",null,0,0,0,0,0,0,0,0,0,0,null,"","","","","","","","","","",null,"","","","","","","","","","",null,null,0,0,0,0,0,0,0,0,0,0,null,null,0,0,0,0,0,0,0,0,0,0]
[null,0,"NA","","","","","","","","","","",null,null,"","","","","","","","","","",null,0,0,0,0,0,0,0,0,0,0,null,"","","","","","","","","","",null,"","","","","","","","","","",null,null,0,0,0,0,0,0,0,0,0,0,null,null,0,0,0,0,0,0,0,0,0,0]
[null,"LED 265","Offered",41.728999999999999,42.162981599999995,42.601476608639992,43.044531965369849,43.492195097809692,43.944513926826907,44.401536871665904,44.863312855131227,45.329891308824592,45.801322178436365,null,null,48.660103058278928,50.812375466909536,53.059844478708136,55.40672070996029,57.857401015629321,60.416476726831078,63.088742252658164,65.879204062469356,68.793090065472285,71.835859405171945,null,44,44,44,44,44,44,44,44,44,44,null,152.31084999999999,153.89488283999998,155.49538962153599,157.54298699325366,158.74651210700537,160.39747583291822,162.06560958158056,164.19972504978028,165.45410327720975,167.17482595129275,null,177.60937616271806,185.46517045421982,193.66843234728469,202.78859779845465,211.17951370704702,220.52014005293341,230.27390922220232,241.11788686863784,251.09477873897384,262.20088682887757,null,null,6701.6773999999996,6771.3748449599989,6841.7971433475832,6931.8914277031608,6984.8465327082367,7057.4889366484012,7130.8868215895445,7224.7879021903327,7279.9805441972294,7355.6923418568804,null,null,7814.8125511595945,8160.4674999856716,8521.4110232805269,8922.6983031320051,9291.8986031100685,9702.8861623290704,10132.052005776903,10609.187022220065,11048.170264514849,11536.839020470614]
[null,"LED 30","Offered",32.444000000000003,32.781417600000005,33.122344343040005,33.466816724207618,33.814871618139378,34.166546282968028,34.521878364310894,34.880905899299727,35.243667320652442,35.610201460787223,null,null,37.832883213659606,39.50625966709994,41.25365080081496,43.078330338947779,44.983716804885773,46.973379925838344,49.05104732069406,51.220611483686568,53.486137076953291,55.851868545649296,null,0,0,0,0,0,0,0,0,0,0,null,118.42060000000001,119.65217424000002,120.89655685209601,122.48854921059988,123.42428140620873,124.7078939328333,126.00485602973477,127.664115591437,128.63938572038143,129.97723533187337,null,138.09002372985756,144.19784778491479,150.57582542297459,157.66668904054887,164.19056633783308,171.45283672930998,179.03632272053332,187.46743803029284,195.22440033087952,203.85932019161993,null,null,0,0,0,0,0,0,0,0,0,0,null,null,0,0,0,0,0,0,0,0,0,0]
[null,"LED 75","Offered",40.405000000000001,40.825212000000001,41.249794204799997,41.678792064529915,42.112251502001023,42.550218917621834,42.992741194365102,43.439865702786499,43.891640306095475,44.348113365278863,null,null,47.116189318453841,49.200173278546821,51.376333393136733,53.64874668182668,56.021670493817318,58.499550484018549,61.087028941950535,63.788953489038207,66.610386160593549,69.556612889500656,null,386,386,386,386,386,386,386,386,386,386,null,147.47825,149.01202380000001,150.56174884751999,152.54437895617949,153.70971798230374,155.30829904931969,156.92350535943262,158.98990847219858,160.20448711724848,161.87061378326786,null,171.97409101235652,179.5806324666959,187.52361688494909,196.35441285548563,204.47909730243322,213.52335926666771,222.96765563811948,233.46756976987984,243.12790948616646,253.88163704667738,null,null,56926.604500000001,57518.641186800007,58116.835055142714,58882.130277085278,59331.951141169244,59949.003433037396,60572.47306874099,61370.104670268651,61838.932027257913,62482.056920341391,null,null,66381.999130769618,69318.124132144614,72384.116117590354,75792.803362217455,78928.931558739219,82420.016676933737,86065.515076314114,90118.481931173621,93847.373061660255,97998.311900017463]
[null,"LED 155","Offered",30.882000000000001,31.203172800000001,31.52768579712,31.855573729410047,32.186871696195908,32.521615161836344,32.859839959519441,33.20158229509844,33.546878750967466,33.895766289977523,null,null,36.011438152023054,37.604250740949951,39.2675146107375,41.004345873732746,42.817998470240482,44.711870264755866,46.689509411838046,48.754621003550987,50.911074010925631,53.162908532447943,null,14,14,14,14,14,14,14,14,14,14,null,112.7193,113.89158072000001,115.076053159488,116.59139984964077,117.48208169111507,118.70389534070266,119.93841585224597,121.51779120006029,122.44610744103126,123.71954695841796,null,131.44174925488414,137.25551520446732,143.32642832919188,150.07590589786184,156.28569441637777,163.19832646635891,170.41670935320886,178.44191287299662,185.82542013987856,194.04461614343498,null,null,1578.0702000000001,1594.4821300800002,1611.064744232832,1632.2795978949707,1644.7491436756109,1661.8545347698373,1679.1378219314436,1701.249076800844,1714.2455041744377,1732.0736574178516,null,null,1840.184489568378,1921.5772128625424,2006.5699966086863,2101.0626825700656,2187.9997218292888,2284.7765705290249,2385.8339309449238,2498.1867802219526,2601.5558819582998,2716.6246260080898]
[null,"LED 14","Offered",31.341999999999999,31.667956799999999,31.997303550719998,32.330075507647486,32.66630829292702,33.006037899173457,33.349300693324857,33.696133420535432,34.046573208109002,34.400657569473331,null,null,36.547843227793095,38.164381410622802,39.85242027490883,41.615122348764061,43.45579004126278,45.377871829479254,47.384968719183597,49.480840991298969,51.669415246759634,53.954791762968178,null,15104.133333333333,16289.15,17474.166666666664,17474.166666666664,17474.166666666664,17474.166666666664,17474.166666666664,17474.166666666664,17474.166666666664,17474.166666666664,null,114.39830000000001,115.58804232,116.790157960128,118.3280763579898,119.23202526918364,120.47203833198311,121.72494753063573,123.32784831915967,124.26999220959786,125.56240012857766,null,133.39962778144479,139.29999214877324,145.46133400341722,152.31134779647647,158.61363365060916,165.62923217759925,172.95513582502011,181.09987802815422,188.59336565067267,196.93498993483388,null,null,1727887.1763066668,1882830.959556828,2040810.6852216031,2067684.5276255731,2083480.2815579262,2105148.4764861278,2127042.0206415835,2155051.3761703824,2171514.5555358808,2194098.3069134541,null,null,2014885.7646279796,2269078.4671101896,2541815.5939313793,2661513.8766202624,2771641.0700163525,2894232.8079433986,3022246.8692623717,3164569.4519769712,3295511.9036074621,3441274.836619609]
[null,0,"NA","","","","","","","","","","",null,null,"","","","","","","","","","",null,0,0,0,0,0,0,0,0,0,0,null,"","","","","","","","","","",null,"","","","","","","","","","",null,null,0,0,0,0,0,0,0,0,0,0,null,null,0,0,0,0,0,0,0,0,0,0]
[null,0,"NA","","","","","","","","","","",null,null,"","","","","","","","","","",null,0,0,0,0,0,0,0,0,0,0,null,"","","","","","","","","","",null,"","","","","","","","","","",null,null,0,0,0,0,0,0,0,0,0,0,null,null,0,0,0,0,0,0,0,0,0,0]
[null,0,"NA","","","","","","","","","","",null,null,"","","","","","","","","","",null,0,0,0,0,0,0,0,0,0,0,null,"","","","","","","","","","",null,"","","","","","","","","","",null,null,0,0,0,0,0,0,0,0,0,0,null,null,0,0,0,0,0,0,0,0,0,0]
[null,"LED 17","Offered",37.149000000000001,37.535349599999996,37.925717235839997,38.320144695092729,38.718674199921693,39.121348411600877,39.528210435081526,39.939303823606373,40.35467258337188,40.774361178238948,null,null,43.319374260394547,45.235422277558115,47.236218518045696,49.325511458561543,51.507215373711659,53.785417669367774,56.16438654039154,58.648578967065461,61.242649065211971,63.951456805644355,null,15.666666666666666,15.666666666666666,15.666666666666666,15.666666666666666,15.666666666666666,15.666666666666666,15.666666666666666,15.666666666666666,15.666666666666666,15.666666666666666,null,135.59385,137.00402603999999,138.428867910816,140.2517295840394,141.32316082971417,142.79292170234322,144.27796808804757,146.17785199439933,147.29455492930737,148.82641830057216,null,158.11571605044008,165.10929131308711,172.41219759086678,180.53137193833524,188.00133611404755,196.31677449319238,205.00001087242913,214.6537990194596,223.53566908802367,233.42281734060191,null,null,2124.3036499999998,2146.3964079599996,2168.718930602784,2197.2770968166169,2214.0628529988553,2237.0891066700437,2260.354833379412,2290.1196812455896,2307.6146938924821,2331.6138867089635,null,null,2477.1462181235611,2586.712230571698,2701.1244289235797,2828.3248270339186,2945.3542657867447,3075.6294670600137,3211.6668370013895,3362.9095179715337,3502.0588157123707,3656.9574716694297]
[null,"LED 175","Offered",40.771000000000001,41.195018400000002,41.62344659136,42.056330435910141,42.493716272443606,42.935650921677016,43.382181691262453,43.833356380851583,44.289223287212437,44.749831209399446,null,null,47.542981183088266,49.645842463547389,51.841714856368711,54.134712311960293,56.529130743804636,59.029456076820203,61.640372651708084,64.366772001028991,67.213762013452779,70.186676503349375,null,799.58333333333337,799.58333333333337,799.58333333333337,799.58333333333337,799.58333333333337,799.58333333333337,799.58333333333337,799.58333333333337,799.58333333333337,799.58333333333337,null,148.81415000000001,150.36181716000002,151.92558005846399,153.92616939543112,155.10206439441916,156.71512586412112,158.34496317310794,160.43008435391678,161.65566499832539,163.33688391430798,null,173.53188131827218,181.20732499194798,189.2222592257458,198.13304706177468,206.33132721488693,215.45751468039373,224.98736017873452,235.58238552376611,245.33023134910266,256.18136923722523,null,null,118989.31410416668,120226.80297085001,121477.16172174684,123076.79961243014,124017.02565537099,125306.80272218685,126609.99347049756,128277.22161465263,129257.17547157768,130601.45009648209,null,null,138753.20010406847,144890.35694147841,151298.96477258592,158423.88221314401,164979.09038557002,172276.23777986484,179896.14340957982,188367.74909171133,196161.96414955336,204838.35315259802]
[null,"LED 14 New Tech","Offered",31.965,32.297435999999998,32.633329334399996,32.972715959477753,33.315632205456318,33.662114780393061,34.012200774109147,34.365927662159883,34.723333309846346,35.08445597626875,null,null,37.274322276064275,38.922993165418859,40.644585989645229,42.442326139947774,44.319581668973406,46.279869600832882,48.326862520218988,50.464395452966357,52.69647305094351,55.02727709473799,null,1,1,1,1,1,1,1,1,1,1,null,116.67225000000001,117.88564139999998,119.11165207055997,120.68014041168857,121.60205754991556,122.86671894843468,124.14453282549839,125.77929524350516,126.74016658093916,128.05826431338093,null,136.05127630763459,142.06892505377883,148.35273886220509,155.33891367220886,161.76647309175291,168.92152404303999,176.39304819879931,184.69968735785685,192.34212663594383,200.84956139579367,null,null,116.67225000000001,117.88564139999998,119.11165207055997,120.68014041168857,121.60205754991556,122.86671894843468,124.14453282549839,125.77929524350516,126.74016658093916,128.05826431338093,null,null,136.05127630763459,142.06892505377883,148.35273886220509,155.33891367220886,161.76647309175291,168.92152404303999,176.39304819879931,184.69968735785685,192.34212663594383,200.84956139579367]
[null,"LED 75 New Tech","Offered",40.405000000000001,40.825212000000001,41.249794204799997,41.678792064529915,42.112251502001023,42.550218917621834,42.992741194365102,43.439865702786499,43.891640306095475,44.348113365278863,null,null,47.116189318453841,49.200173278546821,51.376333393136733,53.64874668182668,56.021670493817318,58.499550484018549,61.087028941950535,63.788953489038207,66.610386160593549,69.556612889500656,null,1,1,1,1,1,1,1,1,1,1,null,147.47825,149.01202380000001,150.56174884751999,152.54437895617949,153.70971798230374,155.30829904931969,156.92350535943262,158.98990847219858,160.20448711724848,161.87061378326786,null,171.97409101235652,179.5806324666959,187.52361688494909,196.35441285548563,204.47909730243322,213.52335926666771,222.96765563811948,233.46756976987984,243.12790948616646,253.88163704667738,null,null,147.47825,149.01202380000001,150.56174884751999,152.54437895617949,153.70971798230374,155.30829904931969,156.92350535943262,158.98990847219858,160.20448711724848,161.87061378326786,null,null,171.97409101235652,179.5806324666959,187.52361688494909,196.35441285548563,204.47909730243322,213.52335926666771,222.96765563811948,233.46756976987984,243.12790948616646,253.88163704667738]
[null,0,"NA","","","","","","","","","","",null,null,"","","","","","","","","","",null,0,0,0,0,0,0,0,0,0,0,null,"","","","","","","","","","",null,"","","","","","","","","","",null,null,0,0,0,0,0,0,0,0,0,0,null,null,0,0,0,0,0,0,0,0,0,0]
[null,0,"NA","","","","","","","","","","",null,null,"","","","","","","","","","",null,0,0,0,0,0,0,0,0,0,0,null,"","","","","","","","","","",null,"","","","","","","","","","",null,null,0,0,0,0,0,0,0,0,0,0,null,null,0,0,0,0,0,0,0,0,0,0]
[null,0,"NA","","","","","","","","","","",null,null,"","","","","","","","","","",null,0,0,0,0,0,0,0,0,0,0,null,"","","","","","","","","","",null,"","","","","","","","","","",null,null,0,0,0,0,0,0,0,0,0,0,null,null,0,0,0,0,0,0,0,0,0,0]
[null,0,"NA","","","","","","","","","","",null,null,"","","","","","","","","","",null,0,0,0,0,0,0,0,0,0,0,null,"","","","","","","","","","",null,"","","","","","","","","","",null,null,0,0,0,0,0,0,0,0,0,0,null,null,0,0,0,0,0,0,0,0,0,0]
[null,0,"NA","","","","","","","","","","",null,null,"","","","","","","","","","",null,0,0,0,0,0,0,0,0,0,0,null,"","","","","","","","","","",null,"","","","","","","","","","",null,null,0,0,0,0,0,0,0,0,0,0,null,null,0,0,0,0,0,0,0,0,0,0]
[null,0,"NA","","","","","","","","","","",null,null,"","","","","","","","","","",null,0,0,0,0,0,0,0,0,0,0,null,"","","","","","","","","","",null,"","","","","","","","","","",null,null,0,0,0,0,0,0,0,0,0,0,null,null,0,0,0,0,0,0,0,0,0,0]
[null,0,"NA","","","","","","","","","","",null,null,"","","","","","","","","","",null,0,0,0,0,0,0,0,0,0,0,null,"","","","","","","","","","",null,"","","","","","","","","","",null,null,0,0,0,0,0,0,0,0,0,0,null,null,0,0,0,0,0,0,0,0,0,0]
[null,0,"NA","","","","","","","","","","",null,null,"","","","","","","","","","",null,0,0,0,0,0,0,0,0,0,0,null,"","","","","","","","","","",null,"","","","","","","","","","",null,null,0,0,0,0,0,0,0,0,0,0,null,null,0,0,0,0,0,0,0,0,0,0]
[null,null,null,null,null,null,null,null,null,null,null,null,null,null,null,null,null,null,null,null,null,null,null,null,null,null,30238,30238,30238,30238,30238,30238,30238,30238,30238,30238,null,null,null,null,null,null,null,null,null,null,null,null,null,null,null,null,null,null,null,null,null,null,null,null,3696571.9731550007,3661913.3092732653,3626133.9239581753,3673883.6502379347,3701949.7122217207,3740449.9892288256,3779350.6691168044,3829117.9870785661,3858369.9376028059,3898496.9849538743,null,null,4310565.1507600881,4413125.1381440833,4516324.7234760718,4729005.8930920409,4924681.0504281074,5142503.3417916913,5369960.0744782826,5622840.3387104906,5855500.2661510482,6114493.3810335286]
[null,null,null,null,null,null,null,null,null,null,null,null,null,null,null,null,null,null,null,null,null,null,null,null,null,null,true,true,true,true,true,true,true,true,true,true]
[null,"Total",null,null,null,null,null,null,null,null,null,null,null,null,"Price (cents) per Light per day Nominal Smoothed",0,0,0,0,0,0,0,0,0,0,null,51858.75,51858.75,51858.75,51858.75,51858.75,51858.75,51858.75,51858.75,51858.75,51858.75,null,null,null,null,null,null,null,null,null,null,null,null,null,null,null,null,null,null,null,null,null,null,null,null,4497057.7451758338,4463198.3042030456,4428148.1850923067,4486459.0109466277,4520732.6158499261,4559232.892857031,4606648.9149427433,4667310.2775311833,4702965.4675201923,4751876.3083824012,null,null,5233435.0395833496,5373265.9039066378,5515227.938883692,5774949.1061069472,6013902.9371004626,6268195.1249287389,6545442.0391643988,6853677.6851326432,7137266.7712295856,7452953.3682422498]
[null,null,null,null,null,null,null,null,null,null,null,null,null,null,null,null,null,null,null,null,null,null,null,null,null,null,true,true,true,true,true,true,true,true,true,true]

{"sheet":"Unsmoothed Prices","index":4,"n_rows":161,"n_cols":38,"rows_kept":161,"cut":false,"hidden":false,"merged":[[7,2,7,8],[7,15,7,20],[7,27,7,32],[82,2,82,8],[82,15,82,20],[82,27,82,32]]}
[]
[]
[]
[null,"Private Contract Lights"]
[]
[null,null,null,null,null,null,null,null,null,null,null,null,null,null,"Days",null,365,365,365,366,365,365,365,366,365,365]
[null,null,null,2,16,17,18,19,20,21,22,23,24,25]
[null,null,"Price (cents) per Light per day",null,null,null,null,null,null,null,null,null,null,null,null,"Revenue ($m)  - Real",null,null,null,null,null,null,null,null,null,null,null,"Volumes"]
[null,"Private Contract Lights","Offered / No Longer Offered / NA","2023-24","2024-25","2025-26","2026-27","2027-28","2028-29","2029-30","2030-31","2031-32","2032-33","2033-34",null,null,"2024-25","2025-26","2026-27","2027-28","2028-29","2029-30","2030-31","2031-32","2032-33","2033-34",null,null,"2024-25","2025-26","2026-27","2027-28","2028-29","2029-30","2030-31","2031-32","2032-33","2033-34"]
[-0.29013671875000002,"50W Mercury Vapour","Obsolete, no new Connections",20.48,14.538,14.712,15.116,15.077999999999999,15.125999999999999,12.792999999999999,12.8,12.772,12.814,12.821,null,null,3.6295570800000004E-3,1.8364989600000001E-3,0,0,0,0,0,0,0,0,null,null,68.400000000000006,34.200000000000003,0,0,0,0,0,0,0,0]
[-0.28938356164383566,"80W Mercury Vapour","Obsolete, no new Connections",20.440000000000001,14.525,14.7,15.103,15.065,15.114000000000001,12.78,12.787000000000001,12.76,12.802,12.808999999999999,null,null,5.1902908750000006E-3,2.6264122500000001E-3,0,0,0,0,0,0,0,0,null,null,97.9,48.95,0,0,0,0,0,0,0,0]
[-0.28955722639933174,"125W Mercury Vapour","Obsolete, no new Connections",23.94,17.007999999999999,17.187000000000001,17.593,17.55,17.606999999999999,15.276,15.285,15.252000000000001,15.303000000000001,15.313000000000001,null,null,8.6165929600000007E-3,4.3536389699999995E-3,0,0,0,0,0,0,0,0,null,null,138.80000000000001,69.400000000000006,0,0,0,0,0,0,0,0]
[-0.2781954887218045,"250W Mercury Vapour","Obsolete, no new Connections",23.94,17.28,17.459,17.864999999999998,17.821000000000002,17.879000000000001,15.548,15.557,15.523,15.574999999999999,15.584,null,null,7.0640640000000016E-4,3.5686196E-4,0,0,0,0,0,0,0,0,null,null,11.200000000000001,5.6000000000000005,0,0,0,0,0,0,0,0]
[0,0,"NA","","","","","","","","","","","",null,null,"","","","","","","","","","",null,null,0,0,0,0,0,0,0,0,0,0]
[-0.24734219269102989,"400W Mercury Vapour","Obsolete, no new Connections",24.08,18.123999999999999,18.303000000000001,18.709,18.663,18.722999999999999,16.391999999999999,16.401,16.364999999999998,16.419,16.428000000000001,null,null,6.8798703999999999E-4,3.4739094000000003E-4,0,0,0,0,0,0,0,0,null,null,10.4,5.2,0,0,0,0,0,0,0,0]
[-0.26193887297039165,"70W Sodium Vapour","Offered",20.94,15.455,15.629,16.033000000000001,15.993,16.044,13.71,13.717000000000001,13.686999999999999,13.731,13.739000000000001,null,null,1.8427511666666669E-3,9.3174888333333328E-4,0,0,0,0,0,0,0,0,null,null,32.666666666666671,16.333333333333336,0,0,0,0,0,0,0,0]
[0,0,"NA","","","","","","","","","","","",null,null,"","","","","","","","","","",null,null,0,0,0,0,0,0,0,0,0,0]
[-0.25746987951807221,"100W Sodium Vapour","Offered",24.9,18.489000000000001,18.667999999999999,19.074000000000002,19.027000000000001,19.088000000000001,16.756,16.765999999999998,16.728999999999999,16.783999999999999,16.792999999999999,null,null,5.3987880000000004E-5,2.7255280000000002E-5,0,0,0,0,0,0,0,0,null,null,0.8,0.4,0,0,0,0,0,0,0,0]
[0,0,"NA","","","","","","","","","","","",null,null,"","","","","","","","","","",null,null,0,0,0,0,0,0,0,0,0,0]
[-0.29320889594916599,"150W Sodium Vapour","Offered",25.18,17.797000000000001,17.975999999999999,18.382000000000001,18.335999999999999,18.396000000000001,16.064,16.074000000000002,16.039000000000001,16.091999999999999,16.100999999999999,null,null,4.3132809199999999E-3,2.1783316800000002E-3,0,0,0,0,0,0,0,0,null,null,66.400000000000006,33.200000000000003,0,0,0,0,0,0,0,0]
[0,0,"NA","","","","","","","","","","","",null,null,"","","","","","","","","","",null,null,0,0,0,0,0,0,0,0,0,0]
[0,0,"NA","","","","","","","","","","","",null,null,"","","","","","","","","","",null,null,0,0,0,0,0,0,0,0,0,0]
[0,0,"NA","","","","","","","","","","","",null,null,"","","","","","","","","","",null,null,0,0,0,0,0,0,0,0,0,0]
[-0.27100591715976335,"250W Sodium Vapour","Offered",25.35,18.48,18.66,19.065999999999999,19.018000000000001,19.079000000000001,16.748000000000001,16.757000000000001,16.721,16.776,16.785,null,null,4.7014044000000003E-3,2.3735986500000002E-3,0,0,0,0,0,0,0,0,null,null,69.7,34.85,0,0,0,0,0,0,0,0]
[0,0,"NA","","","","","","","","","","","",null,null,"","","","","","","","","","",null,null,0,0,0,0,0,0,0,0,0,0]
[0,0,"NA","","","","","","","","","","","",null,null,"","","","","","","","","","",null,null,0,0,0,0,0,0,0,0,0,0]
[0,0,"NA","","","","","","","","","","","",null,null,"","","","","","","","","","",null,null,0,0,0,0,0,0,0,0,0,0]
[-0.26220472440944886,"400W Sodium Vapour","Offered",25.4,18.739999999999998,18.919,19.324999999999999,19.277000000000001,19.338999999999999,17.007999999999999,17.016999999999999,16.98,17.035,17.045000000000002,null,null,2.5992379999999994E-3,1.3120326500000001E-3,0,0,0,0,0,0,0,0,null,null,38,19,0,0,0,0,0,0,0,0]
[0,0,"NA","","","","","","","","","","","",null,null,"","","","","","","","","","",null,null,0,0,0,0,0,0,0,0,0,0]
[-0.25199211045364894,"250W Sodium Vapour - Flood Light","Offered",25.35,18.962,19.140999999999998,19.547000000000001,19.498000000000001,19.561,17.228999999999999,17.238,17.2,17.257000000000001,17.265999999999998,null,null,0,0,0,0,0,0,0,0,0,0,null,null,0,0,0,0,0,0,0,0,0,0]
[-0.26220472440944886,"400W Sodium Vapour - Flood Light","Offered",25.4,18.739999999999998,18.919,19.324999999999999,19.277000000000001,19.338999999999999,17.007999999999999,17.016999999999999,16.98,17.035,17.045000000000002,null,null,0,0,0,0,0,0,0,0,0,0,null,null,0,0,0,0,0,0,0,0,0,0]
[-0.27811890838206621,"1x20W Fluorescent","Obsolete, no new Connections",20.52,14.813000000000001,14.988,15.391,15.353,15.401999999999999,13.069000000000001,13.076000000000001,13.047000000000001,13.09,13.097,null,null,5.8392845999999995E-4,2.9541347999999999E-4,0,0,0,0,0,0,0,0,null,null,10.8,5.4,0,0,0,0,0,0,0,0]
[-0.27847053093034585,"1x40W Fluorescent","Obsolete, no new Connections",20.53,14.813000000000001,14.988,15.391,15.353,15.401999999999999,13.069000000000001,13.076000000000001,13.047000000000001,13.09,13.097,null,null,2.162698E-4,1.0941239999999999E-4,0,0,0,0,0,0,0,0,null,null,4,2,0,0,0,0,0,0,0,0]
[-0.28817876021143674,"2x20W Fluorescent","Obsolete, no new Connections",20.81,14.813000000000001,14.988,15.391,15.353,15.401999999999999,13.069000000000001,13.076000000000001,13.047000000000001,13.09,13.097,null,null,9.9484108000000011E-4,5.0329703999999994E-4,0,0,0,0,0,0,0,0,null,null,18.400000000000002,9.2000000000000011,0,0,0,0,0,0,0,0]
[-0.28405026582890286,"2x24W Fluorescent","Obsolete, no new Connections",20.69,14.813000000000001,14.988,15.391,15.353,15.401999999999999,13.069000000000001,13.076000000000001,13.047000000000001,13.09,13.097,null,null,0,0,0,0,0,0,0,0,0,0,null,null,0,0,0,0,0,0,0,0,0,0]
[-0.28920345489443372,"2x40W Fluorescent","Obsolete, no new Connections",20.84,14.813000000000001,14.988,15.391,15.353,15.401999999999999,13.069000000000001,13.076000000000001,13.047000000000001,13.09,13.097,null,null,6.4880940000000027E-5,3.2823720000000004E-5,0,0,0,0,0,0,0,0,null,null,1.2000000000000002,0.60000000000000009,0,0,0,0,0,0,0,0]
[-0.40771691323470616,"4x40W Fluorescent","Obsolete, no new Connections",25.01,14.813000000000001,14.988,15.391,15.353,15.401999999999999,13.069000000000001,13.076000000000001,13.047000000000001,13.09,13.097,null,null,2.162698E-5,1.0941240000000001E-5,0,0,0,0,0,0,0,0,null,null,0.4,0.2,0,0,0,0,0,0,0,0]
[-0.28335752298016453,"32W Compact Fluorescent","Not Offered",20.67,14.813000000000001,14.988,15.391,15.353,15.401999999999999,13.069000000000001,13.076000000000001,13.047000000000001,13.09,13.097,null,null,0,0,0,0,0,0,0,0,0,0,null,null,0,0,0,0,0,0,0,0,0,0]
[-0.28335752298016453,"42W Compact Fluorescent","Offered",20.67,14.813000000000001,14.988,15.391,15.353,15.401999999999999,13.069000000000001,13.076000000000001,13.047000000000001,13.09,13.097,null,null,4.5056208333333334E-4,2.279425E-4,0,0,0,0,0,0,0,0,null,null,8.3333333333333339,4.166666666666667,0,0,0,0,0,0,0,0]
[0,0,"NA","","","","","","","","","","","",null,null,"","","","","","","","","","",null,null,0,0,0,0,0,0,0,0,0,0]
[-0.24091355599214143,"60W Incandescent","Obsolete, no new Connections",20.36,15.455,15.629,16.033000000000001,15.993,16.044,13.71,13.717000000000001,13.686999999999999,13.731,13.739000000000001,null,null,2.2564300000000001E-4,1.140917E-4,0,0,0,0,0,0,0,0,null,null,4,2,0,0,0,0,0,0,0,0]
[-0.22589958158995807,"100W Incandescent","Obsolete, no new Connections",23.9,18.501000000000001,18.68,19.085999999999999,19.039000000000001,19.100000000000001,16.768999999999998,16.777999999999999,16.741,16.795999999999999,16.805,null,null,1.3505730000000003E-4,6.8182000000000006E-5,0,0,0,0,0,0,0,0,null,null,2,1,0,0,0,0,0,0,0,0]
[-0.27946783161239075,"100W Metal Halide","Offered",25.18,18.143000000000001,18.321999999999999,18.728000000000002,18.681999999999999,18.742000000000001,16.411000000000001,16.420000000000002,16.384,16.437999999999999,16.446999999999999,null,null,0,0,0,0,0,0,0,0,0,0,null,null,0,0,0,0,0,0,0,0,0,0]
[-0.20528634361233472,"150W Metal Halide","Offered",24.97,19.844000000000001,20.023,20.428999999999998,20.378,20.443000000000001,18.111999999999998,18.120999999999999,18.079999999999998,18.138999999999999,18.148,null,null,7.822504800000001E-4,3.9465333E-4,0,0,0,0,0,0,0,0,null,null,10.8,5.4,0,0,0,0,0,0,0,0]
[-0.23772527032438928,"250W Metal Halide","Offered",24.97,19.033999999999999,19.213000000000001,19.619,19.57,19.632999999999999,17.302,17.311,17.273,17.329000000000001,17.338000000000001,null,null,1.1115856E-3,5.6101960000000005E-4,0,0,0,0,0,0,0,0,null,null,16,8,0,0,0,0,0,0,0,0]
[-0.27643163225555123,"400W Metal Halide","Offered",25.67,18.574000000000002,18.753,19.158999999999999,19.111000000000001,19.172999999999998,16.841000000000001,16.850999999999999,16.814,16.869,16.878,null,null,2.4406236000000005E-4,1.2320721000000002E-4,0,0,0,0,0,0,0,0,null,null,3.6,1.8,0,0,0,0,0,0,0,0]
[-0.27643163225555123,"400W Metal Halide - Flood Light","Offered",25.67,18.574000000000002,18.753,19.158999999999999,19.111000000000001,19.172999999999998,16.841000000000001,16.850999999999999,16.814,16.869,16.878,null,null,5.4236079999999999E-5,2.7379380000000003E-5,0,0,0,0,0,0,0,0,null,null,0.8,0.4,0,0,0,0,0,0,0,0]
[-0.3455621301775148,"LED 18","Offered",15.21,9.9540000000000006,10.116,10.513999999999999,10.486000000000001,10.516,8.1780000000000008,8.18,8.1590000000000007,8.1829999999999998,8.1850000000000005,null,null,0.197264531415,0.20703442691999993,0.22199742367833328,0.22201281120199998,0.22203965259666664,0.17267404706499997,0.17271627598333331,0.17274485281299998,0.17277961936083328,0.17282184827916661,null,null,5429.4833333333327,5607.1333333333323,5784.7833333333319,5784.7833333333319,5784.7833333333319,5784.7833333333319,5784.7833333333319,5784.7833333333319,5784.7833333333319,5784.7833333333319]
[0,0,"NA","","","","","","","","","","","",null,null,"","","","","","","","","","",null,null,0,0,0,0,0,0,0,0,0,0]
[0,0,"NA","","","","","","","","","","","",null,null,"","","","","","","","","","",null,null,0,0,0,0,0,0,0,0,0,0]
[0,0,"NA","","","","","","","","","","","",null,null,"","","","","","","","","","",null,null,0,0,0,0,0,0,0,0,0,0]
[-0.3455621301775148,"LED 20","Offered",15.21,9.9540000000000006,10.116,10.513999999999999,10.486000000000001,10.516,8.1780000000000008,8.18,8.1590000000000007,8.1829999999999998,8.1850000000000005,null,null,7.2664199999999995E-5,7.3846799999999986E-5,7.6752199999999987E-5,7.6757519999999993E-5,7.6766800000000005E-5,5.9699400000000006E-5,5.9713999999999998E-5,5.9723880000000011E-5,5.9735899999999998E-5,5.9750500000000003E-5,null,null,2,2,2,2,2,2,2,2,2,2]
[-0.2907955292570677,"LED 200","Offered",15.21,10.787000000000001,10.951000000000001,11.349,11.319000000000001,11.352,9.0139999999999993,9.016,8.9939999999999998,9.0210000000000008,9.0229999999999997,null,null,3.9372550000000006E-5,3.9971150000000004E-5,4.1423850000000005E-5,4.1427539999999999E-5,4.1434800000000005E-5,3.2901100000000003E-5,3.2908399999999998E-5,3.2918039999999995E-5,3.2926650000000001E-5,3.2933950000000003E-5,null,null,1,1,1,1,1,1,1,1,1,1]
[-0.2907955292570677,"LED 240","Offered",15.21,10.787000000000001,10.951000000000001,11.349,11.319000000000001,11.352,9.0139999999999993,9.016,8.9939999999999998,9.0210000000000008,9.0229999999999997,null,null,2.3623530000000002E-4,2.3982690000000001E-4,2.4854309999999998E-4,2.4856524000000003E-4,2.4860879999999999E-4,1.974066E-4,1.974504E-4,1.9750824000000001E-4,1.9755990000000002E-4,1.9760369999999999E-4,null,null,6,6,6,6,6,6,6,6,6,6]
[-0.3455621301775148,"LED 25","Offered",15.21,9.9540000000000006,10.116,10.513999999999999,10.486000000000001,10.516,8.1780000000000008,8.18,8.1590000000000007,8.1829999999999998,8.1850000000000005,null,null,1.8529371000000001E-3,1.8830933999999997E-3,1.9571810999999997E-3,1.9573167600000002E-3,1.9575534E-3,1.5223347000000002E-3,1.5227070000000001E-3,1.52295894E-3,1.5232654499999999E-3,1.5236377499999998E-3,null,null,51,51,51,51,51,51,51,51,51,51]
[0,0,"NA","","","","","","","","","","","",null,null,"","","","","","","","","","",null,null,0,0,0,0,0,0,0,0,0,0]
[0,0,"NA","","","","","","","","","","","",null,null,"","","","","","","","","","",null,null,0,0,0,0,0,0,0,0,0,0]
[0,0,"NA","","","","","","","","","","","",null,null,"","","","","","","","","","",null,null,0,0,0,0,0,0,0,0,0,0]
[-0.2907955292570677,"LED 265","Offered",15.21,10.787000000000001,10.951000000000001,11.349,11.319000000000001,11.352,9.0139999999999993,9.016,8.9939999999999998,9.0210000000000008,9.0229999999999997,null,null,null,null,null,null,null,null,null,null,null,null,null,null,0.91666666666666663,0.91666666666666663,0.91666666666666663,0.91666666666666663,0.91666666666666663,0.91666666666666663,0.91666666666666663,0.91666666666666663,0.91666666666666663,0.91666666666666663]
[-0.33239436619718304,"LED 30","Offered",14.91,9.9540000000000006,10.116,10.513999999999999,10.486000000000001,10.516,8.1780000000000008,8.18,8.1590000000000007,8.1829999999999998,8.1850000000000005,null,null,1.089963E-3,1.1077020000000001E-3,1.1512829999999999E-3,1.1513628E-3,1.1515020000000002E-3,8.954910000000001E-4,8.9570999999999976E-4,8.958582000000001E-4,8.960385000000001E-4,8.9625750000000008E-4,null,null,30,30,30,30,30,30,30,30,30,30]
[-0.31755424063116372,"LED 75","Offered",15.21,10.38,10.542,10.94,10.911,10.942,8.6039999999999992,8.6059999999999999,8.5839999999999996,8.609,8.6110000000000007,null,null,2.3995099999999999E-4,2.4369589999999997E-4,2.5289633333333328E-4,2.5291697999999999E-4,2.5294256666666669E-4,1.9889579999999999E-4,1.9894203333333332E-4,1.9897711999999996E-4,1.9901138333333333E-4,1.9905761666666667E-4,null,null,6.333333333333333,6.333333333333333,6.333333333333333,6.333333333333333,6.333333333333333,6.333333333333333,6.333333333333333,6.333333333333333,6.333333333333333,6.333333333333333]
[-0.2907955292570677,"LED 155","Offered",15.21,10.787000000000001,10.951000000000001,11.349,11.319000000000001,11.352,9.0139999999999993,9.016,8.9939999999999998,9.0210000000000008,9.0229999999999997,null,null,0,0,0,0,0,0,0,0,0,0,null,null,0,0,0,0,0,0,0,0,0,0]
[-0.31209398756046991,"LED 14","Offered",14.47,9.9540000000000006,10.116,10.513999999999999,10.486000000000001,10.516,8.1780000000000008,8.18,8.1590000000000007,8.1829999999999998,8.1850000000000005,null,null,0.56184867742500011,0.57577980725999989,0.60340852715500004,0.60345035179800022,0.60352330906999996,0.46934325043500003,0.46945803235000005,0.46953570668700012,0.46963020522250004,0.46974498713750001,null,null,15464.250000000002,15593.9,15723.550000000001,15723.550000000001,15723.550000000001,15723.550000000001,15723.550000000001,15723.550000000001,15723.550000000001,15723.550000000001]
[0,0,"NA","","","","","","","","","","","",null,null,"","","","","","","","","","",null,null,0,0,0,0,0,0,0,0,0,0]
[0,0,"NA","","","","","","","","","","","",null,null,"","","","","","","","","","",null,null,0,0,0,0,0,0,0,0,0,0]
[0,0,"NA","","","","","","","","","","","",null,null,"","","","","","","","","","",null,null,0,0,0,0,0,0,0,0,0,0]
[-0.3455621301775148,"LED 17","Offered",15.21,9.9540000000000006,10.116,10.513999999999999,10.486000000000001,10.516,8.1780000000000008,8.18,8.1590000000000007,8.1829999999999998,8.1850000000000005,null,null,2.1799260000000001E-4,2.215404E-4,2.3025659999999999E-4,2.3027255999999999E-4,2.3030039999999999E-4,1.7909820000000003E-4,1.79142E-4,1.7917164000000004E-4,1.7920770000000002E-4,1.7925150000000002E-4,null,null,6,6,6,6,6,6,6,6,6,6]
[-0.2907955292570677,"LED 175","Offered",15.21,10.787000000000001,10.951000000000001,11.349,11.319000000000001,11.352,9.0139999999999993,9.016,8.9939999999999998,9.0210000000000008,9.0229999999999997,null,null,3.6091504166666665E-4,3.6640220833333332E-4,3.7971862500000002E-4,3.7975245000000001E-4,3.7981899999999999E-4,3.0159341666666662E-4,3.016603333333333E-4,3.0174869999999998E-4,3.0182762499999995E-4,3.0189454166666663E-4,null,null,9.1666666666666661,9.1666666666666661,9.1666666666666661,9.1666666666666661,9.1666666666666661,9.1666666666666661,9.1666666666666661,9.1666666666666661,9.1666666666666661,9.1666666666666661]
[-0.31209398756046991,"LED 14 New Tech","Offered",14.47,9.9540000000000006,10.116,10.513999999999999,10.486000000000001,10.516,8.1780000000000008,8.18,8.1590000000000007,8.1829999999999998,8.1850000000000005,null,null,0,0,0,0,0,0,0,0,0,0,null,null,0,0,0,0,0,0,0,0,0,0]
[-0.31755424063116372,"LED 75 New Tech","Offered",15.21,10.38,10.542,10.94,10.911,10.942,8.6039999999999992,8.6059999999999999,8.5839999999999996,8.609,8.6110000000000007,null,null,0,0,0,0,0,0,0,0,0,0,null,null,0,0,0,0,0,0,0,0,0,0]
[0,0,null,"","","","","","","","","","","",null,null,"","","","","","","","","","",null,null,0,0,0,0,0,0,0,0,0,0]
[0,0,null,"","","","","","","","","","","",null,null,"","","","","","","","","","",null,null,0,0,0,0,0,0,0,0,0,0]
[0,0,null,"","","","","","","","","","","",null,null,"","","","","","","","","","",null,null,0,0,0,0,0,0,0,0,0,0]
[0,0,null,"","","","","","","","","","","",null,null,"","","","","","","","","","",null,null,0,0,0,0,0,0,0,0,0,0]
[0,0,null,"","","","","","","","","","","",null,null,"","","","","","","","","","",null,null,0,0,0,0,0,0,0,0,0,0]
[0,0,null,"","","","","","","","","","","",null,null,"","","","","","","","","","",null,null,0,0,0,0,0,0,0,0,0,0]
[0,0,null,"","","","","","","","","","","",null,null,"","","","","","","","","","",null,null,0,0,0,0,0,0,0,0,0,0]
[0,0,null,"","","","","","","","","","","",null,null,"","","","","","","","","","",null,null,0,0,0,0,0,0,0,0,0,0]
[0,0,null,"","","","","","","","","","","",null,null,"","","","","","","","","","",null,null,0,0,0,0,0,0,0,0,0,0]
[0,0,null,"","","","","","","","","","","",null,null,"","","","","","","","","","",null,null,0,0,0,0,0,0,0,0,0,0]
[0,null,null,null,null,null,null,null,null,null,null,null,null,null,null,null,0.80044968051666676,0.80580244676166646,0.82974400564166662,0.82980153485000019,0.82990188943333321,0.64540471771666663,0.6455625425,0.64566942426000007,0.64579939769166661,0.64595722247499987,null,null,21620.750000000004,21620.75,21620.75,21620.75,21620.75,21620.75,21620.75,21620.75,21620.75,21620.75]
[0,null,null,null,null,null,null,null,null,null,null,null,null,null,null,null,null,null,null,null,null,null,null,null,null,null,null,null,true,true,true,true,true,true,true,true,true,true]
[0]
[0,"Public Road Lights","Offered / No Longer Offered / NA","2023-24","2024-25","2025-26","2026-27","2027-28","2028-29","2029-30","2030-31","2031-32","2032-33","2033-34",null,null,"2024-25","2025-26","2026-27","2027-28","2028-29","2029-30","2030-31","2031-32","2032-33","2033-34",null,null,"2024-25","2025-26","2026-27","2027-28","2028-29","2029-30","2030-31","2031-32","2032-33","2033-34"]
[-0.16360087826299105,"50W Mercury Vapour","Obsolete, no new Connections",40.99,34.283999999999999,29.766999999999999,30.254000000000001,29.673999999999999,26.001999999999999,23.681999999999999,23.701000000000001,23.655999999999999,23.741,23.760999999999999,null,null,6.70732176E-3,2.9118079400000003E-3,0,0,0,0,0,0,0,0,null,null,53.6,26.8,0,0,0,0,0,0,0,0]
[-0.16371400683260118,"80W Mercury Vapour","Obsolete, no new Connections",40.98,34.271000000000001,29.754999999999999,30.242000000000001,29.661999999999999,25.989000000000001,23.669,23.689,23.643999999999998,23.728000000000002,23.748000000000001,null,null,0.14579974360166667,6.3293621004166675E-2,0,0,0,0,0,0,0,0,null,null,1165.5666666666666,582.7833333333333,0,0,0,0,0,0,0,0]
[-0.26341076037323807,"125W Mercury Vapour","Obsolete, no new Connections",50.37,37.101999999999997,32.594999999999999,33.085999999999999,32.5,28.84,26.523,26.547000000000001,26.498000000000001,26.594999999999999,26.619,null,null,5.09187848E-3,2.2366689000000001E-3,0,0,0,0,0,0,0,0,null,null,37.6,18.8,0,0,0,0,0,0,0,0]
[-0.26429133858267706,"250W Mercury Vapour","Obsolete, no new Connections",50.8,37.374000000000002,32.866999999999997,33.357999999999997,32.771999999999998,29.111999999999998,26.795000000000002,26.818999999999999,26.768999999999998,26.866,26.89,null,null,1.7843095080000003E-2,7.8456815700000005E-3,0,0,0,0,0,0,0,0,null,null,130.80000000000001,65.400000000000006,0,0,0,0,0,0,0,0]
[0,0,"NA","","","","","","","","","","","",null,null,"","","","","","","","","","",null,null,0,0,0,0,0,0,0,0,0,0]
[-0.22216701700745267,"400W Mercury Vapour","Obsolete, no new Connections",52.33,40.704000000000001,36.195999999999998,36.688000000000002,36.091999999999999,32.441000000000003,30.125,30.148,30.09,30.196000000000002,30.22,null,null,1.1647856640000002E-2,5.1789236800000001E-3,0,0,0,0,0,0,0,0,null,null,78.400000000000006,39.200000000000003,0,0,0,0,0,0,0,0]
[-0.19063506672802585,"70W Sodium Vapour","Offered",43.46,35.174999999999997,30.658000000000001,31.145,30.562000000000001,26.893000000000001,24.571999999999999,24.591999999999999,24.544,24.632000000000001,24.652000000000001,null,null,7.0100257500000001E-3,3.0549164100000009E-3,0,0,0,0,0,0,0,0,null,null,54.6,27.3,0,0,0,0,0,0,0,0]
[0,0,"NA","","","","","","","","","","","",null,null,"","","","","","","","","","",null,null,0,0,0,0,0,0,0,0,0,0]
[-0.22584871947587845,"100W Sodium Vapour","Offered",50.37,38.994,34.485999999999997,34.978000000000002,34.387,30.731000000000002,28.414999999999999,28.437999999999999,28.384,28.486000000000001,28.51,null,null,1.3834291320000002E-2,6.1174715399999998E-3,0,0,0,0,0,0,0,0,null,null,97.200000000000017,48.600000000000009,0,0,0,0,0,0,0,0]
[0,0,"NA","","","","","","","","","","","",null,null,"","","","","","","","","","",null,null,0,0,0,0,0,0,0,0,0,0]
[-0.2602907854984895,"150W Sodium Vapour","Offered",52.96,39.174999999999997,34.667000000000002,35.158999999999999,34.567,30.913,28.596,28.62,28.565000000000001,28.667000000000002,28.690999999999999,null,null,0.22958273699999998,0.10158193674000002,0,0,0,0,0,0,0,0,null,null,1605.6000000000001,802.80000000000007,0,0,0,0,0,0,0,0]
[0,0,"NA","","","","","","","","","","","",null,null,"","","","","","","","","","",null,null,0,0,0,0,0,0,0,0,0,0]
[0,0,"NA","","","","","","","","","","","",null,null,"","","","","","","","","","",null,null,0,0,0,0,0,0,0,0,0,0]
[0,0,"NA","","","","","","","","","","","",null,null,"","","","","","","","","","",null,null,0,0,0,0,0,0,0,0,0,0]
[-0.25316595901790656,"250W Sodium Vapour","Offered",54.17,40.456000000000003,35.948999999999998,36.44,35.844999999999999,32.194000000000003,29.876999999999999,29.901,29.843,29.948,29.972000000000001,null,null,0.29447726862666668,0.13083551673249999,0,0,0,0,0,0,0,0,null,null,1994.2333333333331,997.11666666666656,0,0,0,0,0,0,0,0]
[0,0,"NA","","","","","","","","","","","",null,null,"","","","","","","","","","",null,null,0,0,0,0,0,0,0,0,0,0]
[0,0,"NA","","","","","","","","","","","",null,null,"","","","","","","","","","",null,null,0,0,0,0,0,0,0,0,0,0]
[0,0,"NA","","","","","","","","","","","",null,null,"","","","","","","","","","",null,null,0,0,0,0,0,0,0,0,0,0]
[-0.24842066824904147,"400W Sodium Vapour","Offered",54.77,41.164000000000001,36.655999999999999,37.148000000000003,36.551000000000002,32.901000000000003,30.584,30.608000000000001,30.547999999999998,30.655999999999999,30.68,null,null,2.624843042E-2,1.1686940839999998E-2,0,0,0,0,0,0,0,0,null,null,174.7,87.35,0,0,0,0,0,0,0,0]
[0,0,"NA","","","","","","","","","","","",null,null,"","","","","","","","","","",null,null,0,0,0,0,0,0,0,0,0,0]
[-0.27414389484607399,"250W Sodium Vapour - Flood Light","Offered",57.82,41.969000000000001,37.460999999999999,37.951999999999998,37.353000000000002,33.706000000000003,31.388999999999999,31.413,31.350999999999999,31.460999999999999,31.484999999999999,null,null,1.3991065633333335E-3,6.2441243499999986E-4,0,0,0,0,0,0,0,0,null,null,9.1333333333333329,4.5666666666666664,0,0,0,0,0,0,0,0]
[-0.28009793634137808,"400W Sodium Vapour - Flood Light","Offered",57.18,41.164000000000001,36.655999999999999,37.148000000000003,36.551000000000002,32.901000000000003,30.584,30.608000000000001,30.547999999999998,30.655999999999999,30.68,null,null,5.6092810666666674E-4,2.4974954666666675E-4,0,0,0,0,0,0,0,0,null,null,3.7333333333333338,1.8666666666666669,0,0,0,0,0,0,0,0]
[-0.19707057256990684,"1x20W Fluorescent","Obsolete, no new Connections",45.06,36.18,31.663,32.15,31.565000000000001,27.898,25.577000000000002,25.597000000000001,25.547000000000001,25.637,25.657,null,null,3.1693680000000009E-4,1.3868394E-4,0,0,0,0,0,0,0,0,null,null,2.4000000000000004,1.2000000000000002,0,0,0,0,0,0,0,0]
[-0.17791411042944782,"1x40W Fluorescent","Obsolete, no new Connections",44.01,36.18,31.663,32.15,31.565000000000001,27.898,25.577000000000002,25.597000000000001,25.547000000000001,25.637,25.657,null,null,2.1129120000000002E-3,9.2455960000000002E-4,0,0,0,0,0,0,0,0,null,null,16,8,0,0,0,0,0,0,0,0]
[-0.20202911336568158,"2x20W Fluorescent","Obsolete, no new Connections",45.34,36.18,31.663,32.15,31.565000000000001,27.898,25.577000000000002,25.597000000000001,25.547000000000001,25.637,25.657,null,null,2.6411400000000003E-4,1.1556995E-4,0,0,0,0,0,0,0,0,null,null,2,1,0,0,0,0,0,0,0,0]
[-0.20150077245641143,"2x24W Fluorescent","Obsolete, no new Connections",45.31,36.18,31.663,32.15,31.565000000000001,27.898,25.577000000000002,25.597000000000001,25.547000000000001,25.637,25.657,null,null,5.2822800000000005E-5,2.3113989999999999E-5,0,0,0,0,0,0,0,0,null,null,0.4,0.2,0,0,0,0,0,0,0,0]
[-0.18366425992779783,"2x40W Fluorescent","Obsolete, no new Connections",44.32,36.18,31.663,32.15,31.565000000000001,27.898,25.577000000000002,25.597000000000001,25.547000000000001,25.637,25.657,null,null,1.0564560000000001E-4,4.6227979999999997E-5,0,0,0,0,0,0,0,0,null,null,0.8,0.4,0,0,0,0,0,0,0,0]
[-0.31164383561643838,"4x40W Fluorescent","Obsolete, no new Connections",52.56,36.18,31.663,32.15,31.565000000000001,27.898,25.577000000000002,25.597000000000001,25.547000000000001,25.637,25.657,null,null,5.2822800000000005E-5,2.3113989999999999E-5,0,0,0,0,0,0,0,0,null,null,0.4,0.2,0,0,0,0,0,0,0,0]
[-0.16172381835032432,"32W Compact Fluorescent","Not Offered",43.16,36.18,31.663,32.15,31.565000000000001,27.898,25.577000000000002,25.597000000000001,25.547000000000001,25.637,25.657,null,null,0,0,0,0,0,0,0,0,0,0,null,null,0,0,0,0,0,0,0,0,0,0]
[-0.1623060893725399,"42W Compact Fluorescent","Offered",43.19,36.18,31.663,32.15,31.565000000000001,27.898,25.577000000000002,25.597000000000001,25.547000000000001,25.637,25.657,null,null,0.1282361508,5.6113063056666669E-2,0,0,0,0,0,0,0,0,null,null,971.06666666666672,485.53333333333336,0,0,0,0,0,0,0,0]
[0,0,"NA","","","","","","","","","","","",null,null,"","","","","","","","","","",null,null,0,0,0,0,0,0,0,0,0,0]
[-0.13040791100123622,"60W Incandescent","Obsolete, no new Connections",40.450000000000003,35.174999999999997,30.658000000000001,31.145,30.562000000000001,26.893000000000001,24.571999999999999,24.591999999999999,24.544,24.632000000000001,24.652000000000001,null,null,3.0813299999999999E-4,1.3428204000000003E-4,0,0,0,0,0,0,0,0,null,null,2.4000000000000004,1.2000000000000002,0,0,0,0,0,0,0,0]
[-0.1792296233241116,"100W Incandescent","Obsolete, no new Connections",46.99,38.567999999999998,34.061,34.552,33.962000000000003,30.306000000000001,27.989000000000001,28.013000000000002,27.96,28.06,28.084,null,null,5.0678352E-4,2.2378077000000002E-4,0,0,0,0,0,0,0,0,null,null,3.6,1.8,0,0,0,0,0,0,0,0]
[-0.2462780622292241,"100W Metal Halide","Offered",50.78,38.274000000000001,33.767000000000003,34.258000000000003,33.668999999999997,30.012,27.695,27.719000000000001,27.667000000000002,27.766999999999999,27.791,null,null,0,0,0,0,0,0,0,0,0,0,null,null,0,0,0,0,0,0,0,0,0,0]
[-0.22560240963855413,"150W Metal Halide","Offered",53.12,41.136000000000003,36.628,37.119999999999997,36.523000000000003,32.874000000000002,30.556999999999999,30.581,30.521000000000001,30.628,30.652000000000001,null,null,9.0087840000000006E-4,4.0107660000000004E-4,0,0,0,0,0,0,0,0,null,null,6,3,0,0,0,0,0,0,0,0]
[-0.25459929668702574,"250W Metal Halide","Offered",54.03,40.274000000000001,35.765999999999998,36.258000000000003,35.662999999999997,32.011000000000003,29.695,29.718,29.661000000000001,29.765999999999998,29.79,null,null,1.1760008E-3,5.2218359999999994E-4,0,0,0,0,0,0,0,0,null,null,8,4,0,0,0,0,0,0,0,0]
[-0.18209056860742262,"400W Metal Halide","Offered",58.74,48.043999999999997,43.536000000000001,44.027999999999999,43.411999999999999,39.781999999999996,37.465000000000003,37.488999999999997,37.409999999999997,37.536000000000001,37.56,null,null,7.0144240000000001E-5,3.1781280000000005E-5,0,0,0,0,0,0,0,0,null,null,0.4,0.2,0,0,0,0,0,0,0,0]
[-0.30466462376574738,"400W Metal Halide - Flood Light","Offered",58.74,40.844000000000001,36.337000000000003,36.828000000000003,36.231999999999999,32.582000000000001,30.265000000000001,30.289000000000001,30.23,30.335999999999999,30.36,null,null,0,0,0,0,0,0,0,0,0,0,null,null,0,0,0,0,0,0,0,0,0,0]
[-0.21429264741567589,"LED 18","Offered",41.21,32.378999999999998,27.85,28.331,27.753,24.07,21.745000000000001,21.759,21.713999999999999,21.788,21.803000000000001,null,null,0.86220466020250008,0.94737927529166688,1.1730706709458334,1.152286381785,0.9966401132916668,0.90037138610416689,0.9009510687625002,0.90155105733000007,0.90215183998333337,0.90277292854583335,null,null,7295.4833333333345,9319.7833333333347,11344.083333333334,11344.083333333334,11344.083333333334,11344.083333333334,11344.083333333334,11344.083333333334,11344.083333333334,11344.083333333334]
[0,0,"NA","","","","","","","","","","","",null,null,"","","","","","","","","","",null,null,0,0,0,0,0,0,0,0,0,0]
[0,0,"NA","","","","","","","","","","","",null,null,"","","","","","","","","","",null,null,0,0,0,0,0,0,0,0,0,0]
[0,0,"NA","","","","","","","","","","","",null,null,"","","","","","","","","","",null,null,0,0,0,0,0,0,0,0,0,0]
[0.11618539189517099,"LED 20","Offered",41.21,45.997999999999998,41.469000000000001,41.95,41.335000000000001,37.69,35.363999999999997,35.378,35.295999999999999,35.406999999999996,35.421999999999997,null,null,8.1707780666666653E-3,7.3662766999999995E-3,7.4517183333333327E-3,7.3625901999999988E-3,6.6950003333333327E-3,6.2818251999999996E-3,6.2843120666666663E-3,6.2869235199999995E-3,6.2894634333333322E-3,6.2921279333333323E-3,null,null,48.666666666666664,48.666666666666664,48.666666666666664,48.666666666666664,48.666666666666664,48.666666666666664,48.666666666666664,48.666666666666664,48.666666666666664,48.666666666666664]
[9.686969182237315E-2,"LED 200","Offered",41.21,45.201999999999998,40.677999999999997,41.161999999999999,40.549999999999997,36.905000000000001,34.582000000000001,34.597999999999999,34.521000000000001,34.631999999999998,34.649000000000001,null,null,6.5994920000000002E-4,5.9389879999999999E-4,6.0096520000000003E-4,5.9365199999999996E-4,5.3881299999999997E-4,5.0489719999999999E-4,5.0513080000000007E-4,5.0538744000000002E-4,5.0562719999999999E-4,5.0587540000000006E-4,null,null,4,4,4,4,4,4,4,4,4,4]
[9.686969182237315E-2,"LED 240","Offered",41.21,45.201999999999998,40.677999999999997,41.161999999999999,40.549999999999997,36.905000000000001,34.582000000000001,34.597999999999999,34.521000000000001,34.631999999999998,34.649000000000001,null,null,5.0871084166666664E-3,4.5779699166666656E-3,4.6324400833333331E-3,4.5760674999999994E-3,4.1533502083333333E-3,3.8919159166666667E-3,3.8937165833333328E-3,3.89569485E-3,3.8975429999999998E-3,3.8994562083333336E-3,null,null,30.833333333333332,30.833333333333332,30.833333333333332,30.833333333333332,30.833333333333332,30.833333333333332,30.833333333333332,30.833333333333332,30.833333333333332,30.833333333333332]
[3.4651783547682537E-2,"LED 25","Offered",41.21,42.637999999999998,38.109000000000002,38.590000000000003,37.984000000000002,34.33,32.003999999999998,32.018000000000001,31.945,32.048000000000002,32.061999999999998,null,null,1.16721525E-2,1.0432338750000001E-2,1.0564012500000003E-2,1.0426608E-2,9.3978374999999989E-3,8.761095E-3,8.7649275000000002E-3,8.7689025E-3,8.7731400000000005E-3,8.7769724999999972E-3,null,null,75,75,75,75,75,75,75,75,75,75]
[0,0,"NA","","","","","","","","","","","",null,null,"","","","","","","","","","",null,null,0,0,0,0,0,0,0,0,0,0]
[0,0,"NA","","","","","","","","","","","",null,null,"","","","","","","","","","",null,null,0,0,0,0,0,0,0,0,0,0]
[0,0,"NA","","","","","","","","","","","",null,null,"","","","","","","","","","",null,null,0,0,0,0,0,0,0,0,0,0]
[1.2594030575103089E-2,"LED 265","Offered",41.21,41.728999999999999,37.206000000000003,37.689,37.087000000000003,33.433,31.109000000000002,31.126000000000001,31.058,31.16,31.177,null,null,6.7016773999999998E-3,5.9752835999999998E-3,6.0528533999999997E-3,5.9724904800000003E-3,5.3693398000000002E-3,4.9961054E-3,4.9988356000000003E-3,5.001580319999999E-3,5.0042959999999992E-3,5.0070262000000004E-3,null,null,44,44,44,44,44,44,44,44,44,44]
[-0.2127153603494297,"LED 30","Offered",41.21,32.444000000000003,27.914999999999999,28.396000000000001,27.818000000000001,24.135000000000002,21.809000000000001,21.824000000000002,21.779,21.853000000000002,21.867999999999999,null,null,0,0,0,0,0,0,0,0,0,0,null,null,0,0,0,0,0,0,0,0,0,0]
[-1.9534093666585772E-2,"LED 75","Offered",41.21,40.405000000000001,35.875999999999998,36.356999999999999,35.756999999999998,32.095999999999997,29.77,29.785,29.718,29.814,29.829000000000001,null,null,5.6926604499999998E-2,5.0545696399999993E-2,5.1223377299999991E-2,5.0516059320000001E-2,4.5220054399999994E-2,4.1942952999999998E-2,4.1964086500000004E-2,4.1984401679999998E-2,4.2004944600000003E-2,4.2026078100000003E-2,null,null,386,386,386,386,386,386,386,386,386,386]
[-0.25061878184906572,"LED 155","Offered",41.21,30.882000000000001,26.358000000000001,26.841999999999999,26.268999999999998,22.585000000000001,20.262,20.277999999999999,20.239999999999998,20.312000000000001,20.329000000000001,null,null,1.5780702000000001E-3,1.3468938000000001E-3,1.3716262E-3,1.3460235600000002E-3,1.1540934999999999E-3,1.0353882E-3,1.0362058E-3,1.0370975999999998E-3,1.0379432E-3,1.0388118999999998E-3,null,null,14,14,14,14,14,14,14,14,14,14]
[-0.23200196030384718,"LED 14","Offered",40.81,31.341999999999999,26.812999999999999,27.294,26.719000000000001,23.033000000000001,20.707000000000001,20.722000000000001,20.68,20.751000000000001,20.765999999999998,null,null,1.7278871763066663,1.5941775731674999,1.74083065325,1.7088256685499998,1.4690610550416663,1.3207071274583333,1.3216638380833334,1.3225987059999997,1.323513478625,1.3244701892499995,null,null,15104.133333333333,16289.15,17474.166666666664,17474.166666666664,17474.166666666664,17474.166666666664,17474.166666666664,17474.166666666664,17474.166666666664,17474.166666666664]
[0,0,"NA","","","","","","","","","","","",null,null,"","","","","","","","","","",null,null,0,0,0,0,0,0,0,0,0,0]
[0,0,"NA","","","","","","","","","","","",null,null,"","","","","","","","","","",null,null,0,0,0,0,0,0,0,0,0,0]
[0,0,"NA","","","","","","","","","","","",null,null,"","","","","","","","","","",null,null,0,0,0,0,0,0,0,0,0,0]
[-9.8544042708080565E-2,"LED 17","Offered",41.21,37.149000000000001,32.619999999999997,33.100999999999999,32.51,28.841000000000001,26.515000000000001,26.529,26.471,26.559000000000001,26.573,null,null,2.1243036499999997E-3,1.8653203333333333E-3,1.8928255166666664E-3,1.8641233999999998E-3,1.6492245166666666E-3,1.5162160833333334E-3,1.5170166499999997E-3,1.51784714E-3,1.5187321500000001E-3,1.5195327166666666E-3,null,null,15.666666666666666,15.666666666666666,15.666666666666666,15.666666666666666,15.666666666666666,15.666666666666666,15.666666666666666,15.666666666666666,15.666666666666666,15.666666666666666]
[-1.0652754185877215E-2,"LED 175","Offered",41.21,40.771000000000001,36.247,36.731000000000002,36.131,32.473999999999997,30.151,30.167000000000002,30.102,30.201000000000001,30.218,null,null,0.11898931410416667,0.10578611435416667,0.10719865827083334,0.105736468225,9.4774692458333337E-2,8.7995065354166666E-2,8.8041761020833345E-2,8.8092750450000021E-2,8.8140989312500015E-2,8.8190603458333336E-2,null,null,799.58333333333337,799.58333333333337,799.58333333333337,799.58333333333337,799.58333333333337,799.58333333333337,799.58333333333337,799.58333333333337,799.58333333333337,799.58333333333337]
[-0.21673609409458472,"LED 14 New Tech","Offered",40.81,31.965,27.436,27.917000000000002,27.34,23.657,21.331,21.344999999999999,21.302,21.375,21.388999999999999,null,null,1.1667225E-4,1.0014139999999999E-4,1.0189704999999999E-4,1.0006440000000001E-4,8.6348049999999997E-5,7.7858149999999996E-5,7.7909249999999979E-5,7.7965320000000012E-5,7.8018749999999996E-5,7.8069850000000006E-5,null,null,1,1,1,1,1,1,1,1,1,1]
[-1.9534093666585772E-2,"LED 75 New Tech","Offered",41.21,40.405000000000001,35.875999999999998,36.356999999999999,35.756999999999998,32.095999999999997,29.77,29.785,29.718,29.814,29.829000000000001,null,null,1.4747824999999999E-4,1.3094739999999999E-4,1.3270304999999998E-4,1.3087062000000002E-4,1.1715039999999999E-4,1.086605E-4,1.0871525E-4,1.0876788E-4,1.088211E-4,1.0887585000000001E-4,null,null,1,1,1,1,1,1,1,1,1,1]
[0,0,null,"","","","","","","","","","","",null,null,"","","","","","","","","","",null,null,0,0,0,0,0,0,0,0,0,0]
[0,0,null,"","","","","","","","","","","",null,null,"","","","","","","","","","",null,null,0,0,0,0,0,0,0,0,0,0]
[0,0,null,"","","","","","","","","","","",null,null,"","","","","","","","","","",null,null,0,0,0,0,0,0,0,0,0,0]
[0,0,null,"","","","","","","","","","","",null,null,"","","","","","","","","","",null,null,0,0,0,0,0,0,0,0,0,0]
[0,0,null,"","","","","","","","","","","",null,null,"","","","","","","","","","",null,null,0,0,0,0,0,0,0,0,0,0]
[0,0,null,"","","","","","","","","","","",null,null,"","","","","","","","","","",null,null,0,0,0,0,0,0,0,0,0,0]
[0,0,null,"","","","","","","","","","","",null,null,"","","","","","","","","","",null,null,0,0,0,0,0,0,0,0,0,0]
[0,0,null,"","","","","","","","","","","",null,null,"","","","","","","","","","",null,null,0,0,0,0,0,0,0,0,0,0]
[0,0,null,"","","","","","","","","","","",null,null,"","","","","","","","","","",null,null,0,0,0,0,0,0,0,0,0,0]
[0,0,null,"","","","","","","","","","","",null,null,"","","","","","","","","","",null,null,0,0,0,0,0,0,0,0,0,0]
[0,0,null,"","","","","","","","","","","",null,null,"","","","","","","","","","",null,null,0,0,0,0,0,0,0,0,0,0]
[0,0,null,"","","","","","","","","","","",null,null,"","","","","","","","","","",null,null,0,0,0,0,0,0,0,0,0,0]
[null,null,null,null,null,null,null,null,null,null,null,null,null,null,null,null,3.6965719731549997,3.1245928140483334,3.1051244010999999,3.0497370680400002,2.6348570725,2.3781904935666671,2.3798075238666669,2.3814270820299996,2.3830248373541667,2.3846865479124997,null,null,30238,30238,30238,30238,30238,30238,30238,30238,30238,30238]
[null,null,null,null,null,null,null,null,null,null,null,null,null,null,null,null,null,null,null,null,null,null,null,null,null,null,null,null,true,true,true,true,true,true,true,true,true,true]
[null,"Total",null,null,null,null,null,null,null,null,null,null,null,"Revenue ($m)  - Real",null,null,4.4970216536716663,3.9303952608100001,3.9348684067416664,3.8795386028900003,3.4647589619333332,3.0235952112833338,3.0253700663666669,3.0270965062899995,3.0288242350458332,3.0306437703874995,null,null,51858.75,51858.75,51858.75,51858.75,51858.75,51858.75,51858.75,51858.75,51858.75,51858.75]
[null,null,null,null,null,null,null,null,null,null,null,null,null,null,null,null,null,null,null,null,null,null,null,null,null,null,null,null,true,true,true,true,true,true,true,true,true,true]

{"sheet":"General Inputs","index":5,"n_rows":35,"n_cols":17,"rows_kept":35,"cut":false,"hidden":false,"merged":[]}
[]
[null,null,null,null,null,"Start of Regulatory Control Period"]
["Year Count",null,"Model Start Year","Year 1","Year 2","Year 3","Year 4","Year 5","Year 6","Year 7","Year 8","Year 9","Year 10","Year 11","Year 12","Year 13","Year 14"]
["Year",null,2022,{"$f":"C4+1","v":2023},{"$f":"D4+1","v":2024},2025,2026,2027,2028,2029,2030,2031,2032,2033,2034,2035,2036]
["Financial Year",null,{"$f":"LEFT(C4,2)&RIGHT(C4,2)-1&\"-\"&RIGHT(C4,2)","v":"2021-22"},{"$f":"LEFT(D4,2)&RIGHT(D4,2)-1&\"-\"&RIGHT(D4,2)","v":"2022-23"},"2023-24","2024-25","2025-26","2026-27","2027-28","2028-29","2029-30","2030-31","2031-32","2032-33","2033-34","2034-35","2035-36"]
["End of Financial Year",null,{"$f":"DATE(C$4,6,30)","v":"2022-06-30"},{"$f":"DATE(D$4,6,30)","v":"2023-06-30"},"2024-06-30","2025-06-30","2026-06-30","2027-06-30","2028-06-30","2029-06-30","2030-06-30","2031-06-30","2032-06-30","2033-06-30","2034-06-30","2035-06-30","2036-06-30"]
["Days in the year",null,null,{"$f":"D6-C6","v":365},366,365,365,{"$f":"H6-G6","v":365},{"$f":"I6-H6","v":366},{"$f":"J6-I6","v":365},365,365,366,365,365,365,366]
["Reset Year Counter",null,null,null,null,1,2,3,4,5]
[null,null,{"$f":"C3","v":"Model Start Year"},{"$f":"D3","v":"Year 1"},"Year 2","Year 3","Year 4","Year 5","Year 6","Year 7","Year 8","Year 9","Year 10","Year 11","Year 12","Year 13","Year 14"]
[null,null,{"$f":"C5","v":"2021-22"},{"$f":"D5","v":"2022-23"},"2023-24","2024-25","2025-26","2026-27","2027-28","2028-29","2029-30","2030-31","2031-32","2032-33","2033-34","2034-35","2035-36"]
["CPI (actuals from RBA where available)",null,3.8461538461538325E-2,6.1447811447811418E-2,6.3E-2,3.3482522625496003E-2,3.3482522625496003E-2,3.3482522625496003E-2,3.3482522625496003E-2,3.3482522625496003E-2,3.3482522625496003E-2,3.3482522625496003E-2,3.3482522625496003E-2,3.3482522625496003E-2,3.3482522625496003E-2,3.3482522625496003E-2,3.3482522625496003E-2]
["Cumulative CPI",null,1,{"$f":"C12*(1+D$11)","v":1.0614478114478114},{"$f":"D12*(1+E$11)","v":1.1283190235690235},1.1660979908044509,1.2051418931651063,1.2454930838699401,1.287195334230514,1.3302938811323202,1.3748354761058921,1.4208684360409423,1.4684426955985361,1.5176098613781586,1.5684232678984287,1.6209380354521923,1.6752111298987473]
["Nominal Vanilla WACC %",null,4.9683391312997247E-2,4.9025607687710013E-2,4.9756567333827786E-2,5.7062005570836474E-2,5.7792965216954248E-2,5.8523924863072035E-2,5.9254884509189809E-2,6.0312966762079007E-2,5.3666421075471177E-2,5.4558238741096804E-2,5.55241940309847E-2,5.55241940309847E-2,5.4135450759579685E-2,5.2746707488174678E-2,5.1357964216769664E-2]
["Pre Tax Real WACC %",null,2.7880840083494229E-2,2.7238629265578629E-2,2.8636067722157543E-2,2.6094175795350338E-2,2.6801453983529733E-2,2.7508732171709349E-2,2.8216010359888744E-2,2.9239813113902668E-2,2.9239813113902668E-2,2.9239813113902668E-2,2.9239813113902668E-2,2.9239813113902668E-2,2.9239813113902668E-2,2.9239813113902668E-2,2.9239813113902668E-2]
["X-Factor %",null,null,1.04E-2,1.04E-2,1.04E-2,1.04E-2,1.04E-2,1.04E-2,1.04E-2,1.04E-2,1.04E-2,1.04E-2,1.04E-2,1.04E-2,1.04E-2,1.04E-2]
["Adjustment Contract Lighting (C/Day)",null,null,null,null,0,0,0,0,0,0,0,0,0,0,0,0]
["Adjustment Public Lighting (C/Day)",null,null,null,null,0,0,0,0,0,0,0,0,0,0,0,0]
[]
["Labour Real $ escalator %",null,null,-4.0446398325809596E-2,-8.6557475643928902E-3,1.3155261352898587E-2,1.2174350024345797E-2,6.0183555984282752E-3,2.7779527663757708E-3,5.0643688183282043E-3,5.0643688183282E-3,5.0643688183282E-3,5.0643688183282E-3,5.0643688183282E-3,5.0643688183282E-3,5.0643688183282E-3,5.0643688183282E-3]
["Labour Real $ escalator - Index",null,1,{"$f":"C20*(1+D$19)","v":0.95955360167419035},{"$f":"D20*(1+E$19)","v":0.95124794792359457},0.96376186328993807,0.97549503755374556,0.98136591357424618,0.98409210172868666,0.9890759070830446,0.99408495226583571,0.99911936510086019,1.004179274059265,1.0092648082628222,1.0143760974872245,1.0195132721653963,1.0246764633908225]
["Labour Real $ escalator - cumulative %",null,null,{"$f":"D20-1","v":-4.0446398325809652E-2},{"$f":"E20-1","v":-4.8752052076405428E-2},-3.623813671006193E-2,-2.4504962446254441E-2,-1.8634086425753815E-2,-1.5907898271313337E-2,-1.0924092916955397E-2,-5.9150477341642915E-3,-8.8063489913980941E-4,4.1792740592649924E-3,9.2648082628221662E-3,1.437609748722446E-2,1.9513272165396334E-2,2.4676463390822523E-2]
["Material Real $ escalator %",null,null,0,0,0,0,0,0,0,0,0,0,0,0,0,0]
["Material Real $ escalator - Index",null,1,{"$f":"C23*(1+D$22)","v":1},{"$f":"D23*(1+E$22)","v":1},1,1,1,1,1,1,1,1,1,1,1,1]
["Material Real $ escalator - cumulative %",null,null,{"$f":"D23-1","v":0},{"$f":"E23-1","v":0},0,0,0,0,0,0,0,0,0,0,0,0]
["Direct Capex Efficiency (20yr Asset life)",null,1,0,0,0,0,0,0,0,0,0,0,0,0,0,0]
["Direct Capex Efficiency (20yr Asset life) - Cummulative",null,1,{"$f":"C26*(1+D$25)","v":1},{"$f":"D26*(1+E$25)","v":1},1,1,1,1,1,1,1,1,1,1,1,1]
["Direct Capex Efficiency (40yr Asset life)",null,1,0,0,0,0,0,0,0,0,0,0,0,0,0,0]
["Direct Capex Efficiency (40yr Asset life) - Cummulative",null,1,{"$f":"C28*(1+D$27)","v":1},{"$f":"D28*(1+E$27)","v":1},1,1,1,1,1,1,1,1,1,1,1,1]
[]
[]
[]
[]
["Data Validation Fields",null,null,null,"Set Input"]
["Start of Regulatory Control Period",null,null,null,"Formula"]
[null,null,null,null,"User Defined Input"]

{"sheet":"Volumes Input","index":6,"n_rows":146,"n_cols":16,"rows_kept":146,"cut":false,"hidden":false,"merged":[[1,3,1,7]]}
[]
[]
[null,null,null,{"$f":"D4&\" Regulatory Year\"","v":"2024-25 Regulatory Year"},{"$f":"E4&\" Regulatory Year\"","v":"2025-26 Regulatory Year"},"2026-27 Regulatory Year","2027-28 Regulatory Year","2028-29 Regulatory Year","2029-30 Regulatory Year","2030-31 Regulatory Year","2031-32 Regulatory Year","2032-33 Regulatory Year","2033-34 Regulatory Year"]
["Private Contract Lights","Light Description","Dbill code",{"$f":"INDEX('General Inputs'!$C$5:$Q$5,1,MATCH(\"Start of Regulatory Control Period\",'General Inputs'!$C$2:$Q$2,0))","v":"2024-25"},{"$f":"LEFT(D$4,2)&RIGHT(D$4,2)&\"-\"&RIGHT(D$4,2)+1","v":"2025-26"},{"$f":"LEFT(E$4,2)&RIGHT(E$4,2)&\"-\"&RIGHT(E$4,2)+1","v":"2026-27"},"2027-28","2028-29","2029-30","2030-31","2031-32","2032-33","2033-34",null,null,"Check to Unsmoothed Prices"]
[{"$f":"INDEX('[1]Master list'!$B$3:$B$68,MATCH(C5,'[1]Master list'!$A$3:$A$68,0),1)","v":"Mercury Vapour (elliptical) 50"},"50W Mercury Vapour","MV_50_E",68.400000000000006,34.200000000000003,0,0,0,0,0,0,0,0,null,null,{"$f":"VLOOKUP(B5,'Unsmoothed Prices'!$B$10:$B$80,1,FALSE)","v":"50W Mercury Vapour"}]
[{"$f":"INDEX('[1]Master list'!$B$3:$B$68,MATCH(C6,'[1]Master list'!$A$3:$A$68,0),1)","v":"Mercury Vapour (elliptical) 80"},"80W Mercury Vapour","MV_80_E",97.9,48.95,0,0,0,0,0,0,0,0,null,null,{"$f":"VLOOKUP(B6,'Unsmoothed Prices'!$B$10:$B$80,1,FALSE)","v":"80W Mercury Vapour"}]
[{"$f":"INDEX('[1]Master list'!$B$3:$B$68,MATCH(C7,'[1]Master list'!$A$3:$A$68,0),1)","v":"Mercury Vapour (elliptical) 125"},"125W Mercury Vapour","MV_125_E",138.80000000000001,69.400000000000006,0,0,0,0,0,0,0,0,null,null,{"$f":"VLOOKUP(B7,'Unsmoothed Prices'!$B$10:$B$80,1,FALSE)","v":"125W Mercury Vapour"}]
[{"$f":"INDEX('[1]Master list'!$B$3:$B$68,MATCH(C8,'[1]Master list'!$A$3:$A$68,0),1)","v":"Mercury Vapour (elliptical) 250"},"250W Mercury Vapour","MV_250_E",11.200000000000001,5.6000000000000005,0,0,0,0,0,0,0,0,null,null,{"$f":"VLOOKUP(B8,'Unsmoothed Prices'!$B$10:$B$80,1,FALSE)","v":"250W Mercury Vapour"}]
[{"$f":"INDEX('[1]Master list'!$B$3:$B$68,MATCH(C9,'[1]Master list'!$A$3:$A$68,0),1)","v":"Mercury Vapour (tubular) 250"},"250W Mercury Vapour","MV_250_T",0,0,0,0,0,0,0,0,0,0,null,null,{"$f":"VLOOKUP(B9,'Unsmoothed Prices'!$B$10:$B$80,1,FALSE)","v":"250W Mercury Vapour"}]
[{"$f":"INDEX('[1]Master list'!$B$3:$B$68,MATCH(C10,'[1]Master list'!$A$3:$A$68,0),1)","v":"Mercury Vapour (elliptical) 400"},"400W Mercury Vapour","MV_400_E",10.4,5.2,0,0,0,0,0,0,0,0,null,null,{"$f":"VLOOKUP(B10,'Unsmoothed Prices'!$B$10:$B$80,1,FALSE)","v":"400W Mercury Vapour"}]
[{"$f":"INDEX('[1]Master list'!$B$3:$B$68,MATCH(C11,'[1]Master list'!$A$3:$A$68,0),1)","v":"High Pressure Sodium (elliptical) 70"},"70W Sodium Vapour","HPS_70_E",29.6,14.8,0,0,0,0,0,0,0,0,null,null,{"$f":"VLOOKUP(B11,'Unsmoothed Prices'!$B$10:$B$80,1,FALSE)","v":"70W Sodium Vapour"}]
[{"$f":"INDEX('[1]Master list'!$B$3:$B$68,MATCH(C12,'[1]Master list'!$A$3:$A$68,0),1)","v":"High Pressure Sodium (tubular) 70"},"70W Sodium Vapour","HPS_70_T",3.0666666666666669,1.5333333333333334,0,0,0,0,0,0,0,0,null,null,{"$f":"VLOOKUP(B12,'Unsmoothed Prices'!$B$10:$B$80,1,FALSE)","v":"70W Sodium Vapour"}]
[{"$f":"INDEX('[1]Master list'!$B$3:$B$68,MATCH(C13,'[1]Master list'!$A$3:$A$68,0),1)","v":"High Pressure Sodium (elliptical) 100"},"100W Sodium Vapour","HPS_100_E",0.8,0.4,0,0,0,0,0,0,0,0,null,null,{"$f":"VLOOKUP(B13,'Unsmoothed Prices'!$B$10:$B$80,1,FALSE)","v":"100W Sodium Vapour"}]
[{"$f":"INDEX('[1]Master list'!$B$3:$B$68,MATCH(C14,'[1]Master list'!$A$3:$A$68,0),1)","v":"High Pressure Sodium (tubular) 100"},"100W Sodium Vapour","HPS_100_T",0,0,0,0,0,0,0,0,0,0,null,null,{"$f":"VLOOKUP(B14,'Unsmoothed Prices'!$B$10:$B$80,1,FALSE)","v":"100W Sodium Vapour"}]
[{"$f":"INDEX('[1]Master list'!$B$3:$B$68,MATCH(C15,'[1]Master list'!$A$3:$A$68,0),1)","v":"High Pressure Sodium (elliptical) 150"},"150W Sodium Vapour","HPS_150_E",0.8,0.4,0,0,0,0,0,0,0,0,null,null,{"$f":"VLOOKUP(B15,'Unsmoothed Prices'!$B$10:$B$80,1,FALSE)","v":"150W Sodium Vapour"}]
[{"$f":"INDEX('[1]Master list'!$B$3:$B$68,MATCH(C16,'[1]Master list'!$A$3:$A$68,0),1)","v":"High Pressure Sodium (tubular) 150"},"150W Sodium Vapour","HPS_150_T",65.600000000000009,32.800000000000004,0,0,0,0,0,0,0,0,null,null,{"$f":"VLOOKUP(B16,'Unsmoothed Prices'!$B$10:$B$80,1,FALSE)","v":"150W Sodium Vapour"}]
[{"$f":"INDEX('[1]Master list'!$B$3:$B$68,MATCH(C17,'[1]Master list'!$A$3:$A$68,0),1)","v":"High Pres Sodium (tubular - dbl arc) 150"},"150W Sodium Vapour","HPS_150_TD",0,0,0,0,0,0,0,0,0,0,null,null,{"$f":"VLOOKUP(B17,'Unsmoothed Prices'!$B$10:$B$80,1,FALSE)","v":"150W Sodium Vapour"}]
[{"$f":"INDEX('[1]Master list'!$B$3:$B$68,MATCH(C18,'[1]Master list'!$A$3:$A$68,0),1)","v":"High Pres Sodium (tubular - self ig) 150"},"150W Sodium Vapour","HPS_150_TS",0,0,0,0,0,0,0,0,0,0,null,null,{"$f":"VLOOKUP(B18,'Unsmoothed Prices'!$B$10:$B$80,1,FALSE)","v":"150W Sodium Vapour"}]
[{"$f":"INDEX('[1]Master list'!$B$3:$B$68,MATCH(C19,'[1]Master list'!$A$3:$A$68,0),1)","v":"High Pressure Sodium (elliptical) 250"},"250W Sodium Vapour","HPS_250_E",0.8,0.4,0,0,0,0,0,0,0,0,null,null,{"$f":"VLOOKUP(B19,'Unsmoothed Prices'!$B$10:$B$80,1,FALSE)","v":"250W Sodium Vapour"}]
[{"$f":"INDEX('[1]Master list'!$B$3:$B$68,MATCH(C20,'[1]Master list'!$A$3:$A$68,0),1)","v":"High Pressure Sodium (tubular) 250"},"250W Sodium Vapour","HPS_250_T",68.100000000000009,34.050000000000004,0,0,0,0,0,0,0,0,null,null,{"$f":"VLOOKUP(B20,'Unsmoothed Prices'!$B$10:$B$80,1,FALSE)","v":"250W Sodium Vapour"}]
[{"$f":"INDEX('[1]Master list'!$B$3:$B$68,MATCH(C21,'[1]Master list'!$A$3:$A$68,0),1)","v":"High Pres Sodium (tubular - dbl arc) 250"},"250W Sodium Vapour","HPS_250_TD",0,0,0,0,0,0,0,0,0,0,null,null,{"$f":"VLOOKUP(B21,'Unsmoothed Prices'!$B$10:$B$80,1,FALSE)","v":"250W Sodium Vapour"}]
[{"$f":"INDEX('[1]Master list'!$B$3:$B$68,MATCH(C22,'[1]Master list'!$A$3:$A$68,0),1)","v":"High Pres Sodium (tubular - self ig) 250"},"250W Sodium Vapour","HPS_250_TS",0.8,0.4,0,0,0,0,0,0,0,0,null,null,{"$f":"VLOOKUP(B22,'Unsmoothed Prices'!$B$10:$B$80,1,FALSE)","v":"250W Sodium Vapour"}]
[{"$f":"INDEX('[1]Master list'!$B$3:$B$68,MATCH(C23,'[1]Master list'!$A$3:$A$68,0),1)","v":"High Pressure Sodium (tubular) 400"},"400W Sodium Vapour","HPS_400_T",38,19,0,0,0,0,0,0,0,0,null,null,{"$f":"VLOOKUP(B23,'Unsmoothed Prices'!$B$10:$B$80,1,FALSE)","v":"400W Sodium Vapour"}]
[{"$f":"INDEX('[1]Master list'!$B$3:$B$68,MATCH(C24,'[1]Master list'!$A$3:$A$68,0),1)","v":"High Pres Sodium (tubular - dbl arc) 400"},"400W Sodium Vapour","HPS_400_TD",0,0,0,0,0,0,0,0,0,0,null,null,{"$f":"VLOOKUP(B24,'Unsmoothed Prices'!$B$10:$B$80,1,FALSE)","v":"400W Sodium Vapour"}]
[{"$f":"INDEX('[1]Master list'!$B$3:$B$68,MATCH(C25,'[1]Master list'!$A$3:$A$68,0),1)","v":"High Pressure Sodium (tubular) 250 FLOOD"},"250W Sodium Vapour - Flood Light","HPS_250_T1",0,0,0,0,0,0,0,0,0,0,null,null,{"$f":"VLOOKUP(B25,'Unsmoothed Prices'!$B$10:$B$80,1,FALSE)","v":"250W Sodium Vapour - Flood Light"}]
[{"$f":"INDEX('[1]Master list'!$B$3:$B$68,MATCH(C26,'[1]Master list'!$A$3:$A$68,0),1)","v":"High Pressure Sodium (tubular) 400 FLOOD"},"400W Sodium Vapour - Flood Light","HPS_400_T1",0,0,0,0,0,0,0,0,0,0,null,null,{"$f":"VLOOKUP(B26,'Unsmoothed Prices'!$B$10:$B$80,1,FALSE)","v":"400W Sodium Vapour - Flood Light"}]
[{"$f":"INDEX('[1]Master list'!$B$3:$B$68,MATCH(C27,'[1]Master list'!$A$3:$A$68,0),1)","v":"Fluorescent 1x20"},"1x20W Fluorescent","FL_1X20",10.8,5.4,0,0,0,0,0,0,0,0,null,null,{"$f":"VLOOKUP(B27,'Unsmoothed Prices'!$B$10:$B$80,1,FALSE)","v":"1x20W Fluorescent"}]
[{"$f":"INDEX('[1]Master list'!$B$3:$B$68,MATCH(C28,'[1]Master list'!$A$3:$A$68,0),1)","v":"Fluorescent 1x40"},"1x40W Fluorescent","FL_1X40",4,2,0,0,0,0,0,0,0,0,null,null,{"$f":"VLOOKUP(B28,'Unsmoothed Prices'!$B$10:$B$80,1,FALSE)","v":"1x40W Fluorescent"}]
[{"$f":"INDEX('[1]Master list'!$B$3:$B$68,MATCH(C29,'[1]Master list'!$A$3:$A$68,0),1)","v":"Fluorescent 2X20"},"2x20W Fluorescent","FL_2X20",18.400000000000002,9.2000000000000011,0,0,0,0,0,0,0,0,null,null,{"$f":"VLOOKUP(B29,'Unsmoothed Prices'!$B$10:$B$80,1,FALSE)","v":"2x20W Fluorescent"}]
[{"$f":"INDEX('[1]Master list'!$B$3:$B$68,MATCH(C30,'[1]Master list'!$A$3:$A$68,0),1)","v":"Fluorescent 2X24"},"2x24W Fluorescent","FL_2X24",0,0,0,0,0,0,0,0,0,0,null,null,{"$f":"VLOOKUP(B30,'Unsmoothed Prices'!$B$10:$B$80,1,FALSE)","v":"2x24W Fluorescent"}]
[{"$f":"INDEX('[1]Master list'!$B$3:$B$68,MATCH(C31,'[1]Master list'!$A$3:$A$68,0),1)","v":"Fluorescent 2x40"},"2x40W Fluorescent","FL_2X40",1.2000000000000002,0.60000000000000009,0,0,0,0,0,0,0,0,null,null,{"$f":"VLOOKUP(B31,'Unsmoothed Prices'!$B$10:$B$80,1,FALSE)","v":"2x40W Fluorescent"}]
[{"$f":"INDEX('[1]Master list'!$B$3:$B$68,MATCH(C32,'[1]Master list'!$A$3:$A$68,0),1)","v":"Fluorescent 4x40"},"4x40W Fluorescent","FL_4X40",0.4,0.2,0,0,0,0,0,0,0,0,null,null,{"$f":"VLOOKUP(B32,'Unsmoothed Prices'!$B$10:$B$80,1,FALSE)","v":"4x40W Fluorescent"}]
[{"$f":"INDEX('[1]Master list'!$B$3:$B$68,MATCH(C33,'[1]Master list'!$A$3:$A$68,0),1)","v":"Compact Fluorescent 32"},"32W Compact Fluorescent","CFL_32",0,0,0,0,0,0,0,0,0,0,null,null,{"$f":"VLOOKUP(B33,'Unsmoothed Prices'!$B$10:$B$80,1,FALSE)","v":"32W Compact Fluorescent"}]
[{"$f":"INDEX('[1]Master list'!$B$3:$B$68,MATCH(C34,'[1]Master list'!$A$3:$A$68,0),1)","v":"Compact Fluorescent 42"},"42W Compact Fluorescent","CFL_42",7.9333333333333336,3.9666666666666668,0,0,0,0,0,0,0,0,null,null,{"$f":"VLOOKUP(B34,'Unsmoothed Prices'!$B$10:$B$80,1,FALSE)","v":"42W Compact Fluorescent"}]
[{"$f":"INDEX('[1]Master list'!$B$3:$B$68,MATCH(C35,'[1]Master list'!$A$3:$A$68,0),1)","v":"Compact Fluorescent 42 Pole Top Entry"},"42W Compact Fluorescent","CFL_42_1",0.4,0.2,0,0,0,0,0,0,0,0,null,null,{"$f":"VLOOKUP(B35,'Unsmoothed Prices'!$B$10:$B$80,1,FALSE)","v":"42W Compact Fluorescent"}]
[{"$f":"INDEX('[1]Master list'!$B$3:$B$68,MATCH(C36,'[1]Master list'!$A$3:$A$68,0),1)","v":"Incandescent 60"},"60W Incandescent","INC_60",4,2,0,0,0,0,0,0,0,0,null,null,{"$f":"VLOOKUP(B36,'Unsmoothed Prices'!$B$10:$B$80,1,FALSE)","v":"60W Incandescent"}]
[{"$f":"INDEX('[1]Master list'!$B$3:$B$68,MATCH(C37,'[1]Master list'!$A$3:$A$68,0),1)","v":"Incandescent 100"},"100W Incandescent","INC_100",2,1,0,0,0,0,0,0,0,0,null,null,{"$f":"VLOOKUP(B37,'Unsmoothed Prices'!$B$10:$B$80,1,FALSE)","v":"100W Incandescent"}]
[{"$f":"INDEX('[1]Master list'!$B$3:$B$68,MATCH(C38,'[1]Master list'!$A$3:$A$68,0),1)","v":"Metal Halide (elliptical) 100"},"100W Metal Halide","MH_100_E",0,0,0,0,0,0,0,0,0,0,null,null,{"$f":"VLOOKUP(B38,'Unsmoothed Prices'!$B$10:$B$80,1,FALSE)","v":"100W Metal Halide"}]
[{"$f":"INDEX('[1]Master list'!$B$3:$B$68,MATCH(C39,'[1]Master list'!$A$3:$A$68,0),1)","v":"Metal Halide (elliptical) 150"},"150W Metal Halide","MH_150_E",10.8,5.4,0,0,0,0,0,0,0,0,null,null,{"$f":"VLOOKUP(B39,'Unsmoothed Prices'!$B$10:$B$80,1,FALSE)","v":"150W Metal Halide"}]
[{"$f":"INDEX('[1]Master list'!$B$3:$B$68,MATCH(C40,'[1]Master list'!$A$3:$A$68,0),1)","v":"Metal Halide (tubular) 250"},"250W Metal Halide","MH_250_T",16,8,0,0,0,0,0,0,0,0,null,null,{"$f":"VLOOKUP(B40,'Unsmoothed Prices'!$B$10:$B$80,1,FALSE)","v":"250W Metal Halide"}]
[{"$f":"INDEX('[1]Master list'!$B$3:$B$68,MATCH(C41,'[1]Master list'!$A$3:$A$68,0),1)","v":"Metal Halide (tubular) 400"},"400W Metal Halide","MH_400_T",3.6,1.8,0,0,0,0,0,0,0,0,null,null,{"$f":"VLOOKUP(B41,'Unsmoothed Prices'!$B$10:$B$80,1,FALSE)","v":"400W Metal Halide"}]
[{"$f":"INDEX('[1]Master list'!$B$3:$B$68,MATCH(C42,'[1]Master list'!$A$3:$A$68,0),1)","v":"Metal Halide (tubular) 400 FLOOD"},"400W Metal Halide - Flood Light","MH_400_T1",0.8,0.4,0,0,0,0,0,0,0,0,null,null,{"$f":"VLOOKUP(B42,'Unsmoothed Prices'!$B$10:$B$80,1,FALSE)","v":"400W Metal Halide - Flood Light"}]
[{"$f":"INDEX('[1]Master list'!$B$3:$B$68,MATCH(C43,'[1]Master list'!$A$3:$A$68,0),1)","v":"LED 18 Hobart and Glenorchy"},"LED 18","LED_18",5349.15,5526.7999999999993,5704.4499999999989,5704.4499999999989,5704.4499999999989,5704.4499999999989,5704.4499999999989,5704.4499999999989,5704.4499999999989,5704.4499999999989,null,null,{"$f":"VLOOKUP(B43,'Unsmoothed Prices'!$B$10:$B$80,1,FALSE)","v":"LED 18"}]
[{"$f":"INDEX('[1]Master list'!$B$3:$B$68,MATCH(C44,'[1]Master list'!$A$3:$A$68,0),1)","v":"LED 18 TasNetworks BAU"},"LED 18","LED_18_1",76.333333333333329,76.333333333333329,76.333333333333329,76.333333333333329,76.333333333333329,76.333333333333329,76.333333333333329,76.333333333333329,76.333333333333329,76.333333333333329,null,null,{"$f":"VLOOKUP(B44,'Unsmoothed Prices'!$B$10:$B$80,1,FALSE)","v":"LED 18"}]
[{"$f":"INDEX('[1]Master list'!$B$3:$B$68,MATCH(C45,'[1]Master list'!$A$3:$A$68,0),1)","v":"LED 18 Kensington Pole Top Entry"},"LED 18","LED_18_2",0,0,0,0,0,0,0,0,0,0,null,null,{"$f":"VLOOKUP(B45,'Unsmoothed Prices'!$B$10:$B$80,1,FALSE)","v":"LED 18"}]
[{"$f":"INDEX('[1]Master list'!$B$3:$B$68,MATCH(C46,'[1]Master list'!$A$3:$A$68,0),1)","v":"LED 18 Burke Hill"},"LED 18","LED_18_3",2,2,2,2,2,2,2,2,2,2,null,null,{"$f":"VLOOKUP(B46,'Unsmoothed Prices'!$B$10:$B$80,1,FALSE)","v":"LED 18"}]
[{"$f":"INDEX('[1]Master list'!$B$3:$B$68,MATCH(C47,'[1]Master list'!$A$3:$A$68,0),1)","v":"Sylvania StreetLED Aeroscreen"},"LED 18","LED_18_4",2,2,2,2,2,2,2,2,2,2,null,null,{"$f":"VLOOKUP(B47,'Unsmoothed Prices'!$B$10:$B$80,1,FALSE)","v":"LED 18"}]
[{"$f":"INDEX('[1]Master list'!$B$3:$B$68,MATCH(C48,'[1]Master list'!$A$3:$A$68,0),1)","v":"LED 20W Boston decorative top entry"},"LED 20","LED_20_1",2,2,2,2,2,2,2,2,2,2,null,null,{"$f":"VLOOKUP(B48,'Unsmoothed Prices'!$B$10:$B$80,1,FALSE)","v":"LED 20"}]
[{"$f":"INDEX('[1]Master list'!$B$3:$B$68,MATCH(C49,'[1]Master list'!$A$3:$A$68,0),1)","v":"LED 200W Aldridge Floodlight"},"LED 200","LED_200",1,1,1,1,1,1,1,1,1,1,null,null,{"$f":"VLOOKUP(B49,'Unsmoothed Prices'!$B$10:$B$80,1,FALSE)","v":"LED 200"}]
[{"$f":"INDEX('[1]Master list'!$B$3:$B$68,MATCH(C50,'[1]Master list'!$A$3:$A$68,0),1)","v":"LED 240W Aldridge Floodlight"},"LED 240","LED_240_1",6,6,6,6,6,6,6,6,6,6,null,null,{"$f":"VLOOKUP(B50,'Unsmoothed Prices'!$B$10:$B$80,1,FALSE)","v":"LED 240"}]
[{"$f":"INDEX('[1]Master list'!$B$3:$B$68,MATCH(C51,'[1]Master list'!$A$3:$A$68,0),1)","v":"LED 25 Hobart and Glenorchy"},"LED 25","LED_25",49,49,49,49,49,49,49,49,49,49,null,null,{"$f":"VLOOKUP(B51,'Unsmoothed Prices'!$B$10:$B$80,1,FALSE)","v":"LED 25"}]
[{"$f":"INDEX('[1]Master list'!$B$3:$B$68,MATCH(C52,'[1]Master list'!$A$3:$A$68,0),1)","v":"LED 25 TasNetworks BAU"},"LED 25","LED_25_1",2,2,2,2,2,2,2,2,2,2,null,null,{"$f":"VLOOKUP(B52,'Unsmoothed Prices'!$B$10:$B$80,1,FALSE)","v":"LED 25"}]
[{"$f":"INDEX('[1]Master list'!$B$3:$B$68,MATCH(C53,'[1]Master list'!$A$3:$A$68,0),1)","v":"LED 25 Kensington Pole Top Entry"},"LED 25","LED_25_2",0,0,0,0,0,0,0,0,0,0,null,null,{"$f":"VLOOKUP(B53,'Unsmoothed Prices'!$B$10:$B$80,1,FALSE)","v":"LED 25"}]
[{"$f":"INDEX('[1]Master list'!$B$3:$B$68,MATCH(C54,'[1]Master list'!$A$3:$A$68,0),1)","v":"LED 25 Burke Hill"},"LED 25","LED_25_3",0,0,0,0,0,0,0,0,0,0,null,null,{"$f":"VLOOKUP(B54,'Unsmoothed Prices'!$B$10:$B$80,1,FALSE)","v":"LED 25"}]
[{"$f":"INDEX('[1]Master list'!$B$3:$B$68,MATCH(C55,'[1]Master list'!$A$3:$A$68,0),1)","v":"LED 265W Aldridge VLED MKII"},"LED 265","LED_265",0.91666666666666663,0.91666666666666663,0.91666666666666663,0.91666666666666663,0.91666666666666663,0.91666666666666663,0.91666666666666663,0.91666666666666663,0.91666666666666663,0.91666666666666663,null,null,{"$f":"VLOOKUP(B55,'Unsmoothed Prices'!$B$10:$B$80,1,FALSE)","v":"LED 265"}]
[{"$f":"INDEX('[1]Master list'!$B$3:$B$68,MATCH(C56,'[1]Master list'!$A$3:$A$68,0),1)","v":"LED 30 Hobart and Glenorchy"},"LED 30","LED_30",30,30,30,30,30,30,30,30,30,30,null,null,{"$f":"VLOOKUP(B56,'Unsmoothed Prices'!$B$10:$B$80,1,FALSE)","v":"LED 30"}]
[{"$f":"INDEX('[1]Master list'!$B$3:$B$68,MATCH(C57,'[1]Master list'!$A$3:$A$68,0),1)","v":"LED 75 Aldridge VLED MKII"},"LED 75","LED_75",6.333333333333333,6.333333333333333,6.333333333333333,6.333333333333333,6.333333333333333,6.333333333333333,6.333333333333333,6.333333333333333,6.333333333333333,6.333333333333333,null,null,{"$f":"VLOOKUP(B57,'Unsmoothed Prices'!$B$10:$B$80,1,FALSE)","v":"LED 75"}]
[{"$f":"INDEX('[1]Master list'!$B$3:$B$68,MATCH(C58,'[1]Master list'!$A$3:$A$68,0),1)","v":"Gerard Lighting Sylvania RoadLED 155W"},"LED 155","LED_155_1",0,0,0,0,0,0,0,0,0,0,null,null,{"$f":"VLOOKUP(B58,'Unsmoothed Prices'!$B$10:$B$80,1,FALSE)","v":"LED 155"}]
[{"$f":"INDEX('[1]Master list'!$B$3:$B$68,MATCH(C59,'[1]Master list'!$A$3:$A$68,0),1)","v":"14W LED"},"LED 14","LED_14_1",8736,8865.65,8995.2999999999993,8995.2999999999993,8995.2999999999993,8995.2999999999993,8995.2999999999993,8995.2999999999993,8995.2999999999993,8995.2999999999993,null,null,{"$f":"VLOOKUP(B59,'Unsmoothed Prices'!$B$10:$B$80,1,FALSE)","v":"LED 14"}]
[{"$f":"INDEX('[1]Master list'!$B$3:$B$68,MATCH(C60,'[1]Master list'!$A$3:$A$68,0),1)","v":"14W LED (Aeroscreen)"},"LED 14","LED_14_2",5.083333333333333,5.083333333333333,5.083333333333333,5.083333333333333,5.083333333333333,5.083333333333333,5.083333333333333,5.083333333333333,5.083333333333333,5.083333333333333,null,null,{"$f":"VLOOKUP(B60,'Unsmoothed Prices'!$B$10:$B$80,1,FALSE)","v":"LED 14"}]
[{"$f":"INDEX('[1]Master list'!$B$3:$B$68,MATCH(C61,'[1]Master list'!$A$3:$A$68,0),1)","v":"LED 14 Aldridge PLED II"},"LED 14","LED_14_3",6700.083333333333,6700.083333333333,6700.083333333333,6700.083333333333,6700.083333333333,6700.083333333333,6700.083333333333,6700.083333333333,6700.083333333333,6700.083333333333,null,null,{"$f":"VLOOKUP(B61,'Unsmoothed Prices'!$B$10:$B$80,1,FALSE)","v":"LED 14"}]
[{"$f":"INDEX('[1]Master list'!$B$3:$B$68,MATCH(C62,'[1]Master list'!$A$3:$A$68,0),1)","v":"LED 14 Aldridge PLED II (Aeroscreen)"},"LED 14","LED_14_4",23.083333333333332,23.083333333333332,23.083333333333332,23.083333333333332,23.083333333333332,23.083333333333332,23.083333333333332,23.083333333333332,23.083333333333332,23.083333333333332,null,null,{"$f":"VLOOKUP(B62,'Unsmoothed Prices'!$B$10:$B$80,1,FALSE)","v":"LED 14"}]
[{"$f":"INDEX('[1]Master list'!$B$3:$B$68,MATCH(C63,'[1]Master list'!$A$3:$A$68,0),1)","v":"LED 17W Berlin decorative bottom entry"},"LED 17","LED_17_1",6,6,6,6,6,6,6,6,6,6,null,null,{"$f":"VLOOKUP(B63,'Unsmoothed Prices'!$B$10:$B$80,1,FALSE)","v":"LED 17"}]
[{"$f":"INDEX('[1]Master list'!$B$3:$B$68,MATCH(C64,'[1]Master list'!$A$3:$A$68,0),1)","v":"LED 175W Aldridge VLED MKII"},"LED 175","LED_175",9.1666666666666661,9.1666666666666661,9.1666666666666661,9.1666666666666661,9.1666666666666661,9.1666666666666661,9.1666666666666661,9.1666666666666661,9.1666666666666661,9.1666666666666661,null,null,{"$f":"VLOOKUP(B64,'Unsmoothed Prices'!$B$10:$B$80,1,FALSE)","v":"LED 175"}]
["New technology - Minor","LED 14 New Tech","LEDNEWMIN",0,0,0,0,0,0,0,0,0,0,null,null,{"$f":"VLOOKUP(B65,'Unsmoothed Prices'!$B$10:$B$80,1,FALSE)","v":"LED 14 New Tech"}]
["New technology - Major","LED 75 New Tech","LEDNEWMAJ",0,0,0,0,0,0,0,0,0,0,null,null,{"$f":"VLOOKUP(B66,'Unsmoothed Prices'!$B$10:$B$80,1,FALSE)","v":"LED 75 New Tech"}]
[{"$f":"$A$4","v":"Private Contract Lights"},null,null,null,null,null,null,null,null,null,null,null,null,null,null,{"$f":"VLOOKUP(B67,'Unsmoothed Prices'!$B$10:$B$80,1,FALSE)","v":0}]
[null,null,null,null,null,null,null,null,null,null,null,null,null,null,null,{"$f":"VLOOKUP(B68,'Unsmoothed Prices'!B23:B93,1,FALSE)","v":0}]
[null,"Total Contract Lighting",null,{"$f":"SUM(D5:D68)","v":21620.75},21620.75,21620.75,21620.75,21620.75,21620.75,21620.75,21620.75,21620.75,21620.75]
[null,"Change",null,null,{"$f":"E69-D69","v":0},{"$f":"F69-E69","v":0},0,0]
[]
[]
[]
["Public Road Lights","Light Description",null,{"$f":"D4","v":"2024-25"},{"$f":"E4","v":"2025-26"},"2026-27","2027-28","2028-29","2029-30","2030-31","2031-32","2032-33","2033-34",null,null,"Check to Unsmoothed Prices"]
[{"$f":"INDEX('[1]Master list'!$B$3:$B$68,MATCH(C75,'[1]Master list'!$A$3:$A$68,0),1)","v":"Mercury Vapour (elliptical) 50"},"50W Mercury Vapour","MV_50_E",53.6,26.8,0,0,0,0,0,0,0,0,{"$f":"VLOOKUP(B75,#REF!,1,FALSE)","v":{"$error":"#REF!"}},null,{"$f":"VLOOKUP(B75,'Unsmoothed Prices'!$B$85:$B$157,1,FALSE)","v":"50W Mercury Vapour"}]
[{"$f":"INDEX('[1]Master list'!$B$3:$B$68,MATCH(C76,'[1]Master list'!$A$3:$A$68,0),1)","v":"Mercury Vapour (elliptical) 80"},"80W Mercury Vapour","MV_80_E",1165.5666666666666,582.7833333333333,0,0,0,0,0,0,0,0,{"$f":"VLOOKUP(B76,#REF!,1,FALSE)","v":{"$error":"#REF!"}},null,{"$f":"VLOOKUP(B76,'Unsmoothed Prices'!$B$85:$B$157,1,FALSE)","v":"80W Mercury Vapour"}]
[{"$f":"INDEX('[1]Master list'!$B$3:$B$68,MATCH(C77,'[1]Master list'!$A$3:$A$68,0),1)","v":"Mercury Vapour (elliptical) 125"},"125W Mercury Vapour","MV_125_E",37.6,18.8,0,0,0,0,0,0,0,0,{"$f":"VLOOKUP(B77,#REF!,1,FALSE)","v":{"$error":"#REF!"}},null,{"$f":"VLOOKUP(B77,'Unsmoothed Prices'!$B$85:$B$157,1,FALSE)","v":"125W Mercury Vapour"}]
[{"$f":"INDEX('[1]Master list'!$B$3:$B$68,MATCH(C78,'[1]Master list'!$A$3:$A$68,0),1)","v":"Mercury Vapour (elliptical) 250"},"250W Mercury Vapour","MV_250_E",127.60000000000001,63.800000000000004,0,0,0,0,0,0,0,0,{"$f":"VLOOKUP(B78,#REF!,1,FALSE)","v":{"$error":"#REF!"}},null,{"$f":"VLOOKUP(B78,'Unsmoothed Prices'!$B$85:$B$157,1,FALSE)","v":"250W Mercury Vapour"}]
[{"$f":"INDEX('[1]Master list'!$B$3:$B$68,MATCH(C79,'[1]Master list'!$A$3:$A$68,0),1)","v":"Mercury Vapour (tubular) 250"},"250W Mercury Vapour","MV_250_T",3.2,1.6,0,0,0,0,0,0,0,0,{"$f":"VLOOKUP(B79,#REF!,1,FALSE)","v":{"$error":"#REF!"}},null,{"$f":"VLOOKUP(B79,'Unsmoothed Prices'!$B$85:$B$157,1,FALSE)","v":"250W Mercury Vapour"}]
[{"$f":"INDEX('[1]Master list'!$B$3:$B$68,MATCH(C80,'[1]Master list'!$A$3:$A$68,0),1)","v":"Mercury Vapour (elliptical) 400"},"400W Mercury Vapour","MV_400_E",78.400000000000006,39.200000000000003,0,0,0,0,0,0,0,0,{"$f":"VLOOKUP(B80,#REF!,1,FALSE)","v":{"$error":"#REF!"}},null,{"$f":"VLOOKUP(B80,'Unsmoothed Prices'!$B$85:$B$157,1,FALSE)","v":"400W Mercury Vapour"}]
[{"$f":"INDEX('[1]Master list'!$B$3:$B$68,MATCH(C81,'[1]Master list'!$A$3:$A$68,0),1)","v":"High Pressure Sodium (elliptical) 70"},"70W Sodium Vapour","HPS_70_E",53.2,26.6,0,0,0,0,0,0,0,0,{"$f":"VLOOKUP(B81,#REF!,1,FALSE)","v":{"$error":"#REF!"}},null,{"$f":"VLOOKUP(B81,'Unsmoothed Prices'!$B$85:$B$157,1,FALSE)","v":"70W Sodium Vapour"}]
[{"$f":"INDEX('[1]Master list'!$B$3:$B$68,MATCH(C82,'[1]Master list'!$A$3:$A$68,0),1)","v":"High Pressure Sodium (tubular) 70"},"70W Sodium Vapour","HPS_70_T",1.4000000000000001,0.70000000000000007,0,0,0,0,0,0,0,0,{"$f":"VLOOKUP(B82,#REF!,1,FALSE)","v":{"$error":"#REF!"}},null,{"$f":"VLOOKUP(B82,'Unsmoothed Prices'!$B$85:$B$157,1,FALSE)","v":"70W Sodium Vapour"}]
[{"$f":"INDEX('[1]Master list'!$B$3:$B$68,MATCH(C83,'[1]Master list'!$A$3:$A$68,0),1)","v":"High Pressure Sodium (elliptical) 100"},"100W Sodium Vapour","HPS_100_E",2.4000000000000004,1.2000000000000002,0,0,0,0,0,0,0,0,{"$f":"VLOOKUP(B83,#REF!,1,FALSE)","v":{"$error":"#REF!"}},null,{"$f":"VLOOKUP(B83,'Unsmoothed Prices'!$B$85:$B$157,1,FALSE)","v":"100W Sodium Vapour"}]
[{"$f":"INDEX('[1]Master list'!$B$3:$B$68,MATCH(C84,'[1]Master list'!$A$3:$A$68,0),1)","v":"High Pressure Sodium (tubular) 100"},"100W Sodium Vapour","HPS_100_T",94.800000000000011,47.400000000000006,0,0,0,0,0,0,0,0,{"$f":"VLOOKUP(B84,#REF!,1,FALSE)","v":{"$error":"#REF!"}},null,{"$f":"VLOOKUP(B84,'Unsmoothed Prices'!$B$85:$B$157,1,FALSE)","v":"100W Sodium Vapour"}]
[{"$f":"INDEX('[1]Master list'!$B$3:$B$68,MATCH(C85,'[1]Master list'!$A$3:$A$68,0),1)","v":"High Pressure Sodium (elliptical) 150"},"150W Sodium Vapour","HPS_150_E",12.4,6.2,0,0,0,0,0,0,0,0,{"$f":"VLOOKUP(B85,#REF!,1,FALSE)","v":{"$error":"#REF!"}},null,{"$f":"VLOOKUP(B85,'Unsmoothed Prices'!$B$85:$B$157,1,FALSE)","v":"150W Sodium Vapour"}]
[{"$f":"INDEX('[1]Master list'!$B$3:$B$68,MATCH(C86,'[1]Master list'!$A$3:$A$68,0),1)","v":"High Pressure Sodium (tubular) 150"},"150W Sodium Vapour","HPS_150_T",1570.9,785.45,0,0,0,0,0,0,0,0,{"$f":"VLOOKUP(B86,#REF!,1,FALSE)","v":{"$error":"#REF!"}},null,{"$f":"VLOOKUP(B86,'Unsmoothed Prices'!$B$85:$B$157,1,FALSE)","v":"150W Sodium Vapour"}]
[{"$f":"INDEX('[1]Master list'!$B$3:$B$68,MATCH(C87,'[1]Master list'!$A$3:$A$68,0),1)","v":"High Pres Sodium (tubular - dbl arc) 150"},"150W Sodium Vapour","HPS_150_TD",19.100000000000001,9.5500000000000007,0,0,0,0,0,0,0,0,{"$f":"VLOOKUP(B87,#REF!,1,FALSE)","v":{"$error":"#REF!"}},null,{"$f":"VLOOKUP(B87,'Unsmoothed Prices'!$B$85:$B$157,1,FALSE)","v":"150W Sodium Vapour"}]
[{"$f":"INDEX('[1]Master list'!$B$3:$B$68,MATCH(C88,'[1]Master list'!$A$3:$A$68,0),1)","v":"High Pres Sodium (tubular - self ig) 150"},"150W Sodium Vapour","HPS_150_TS",3.2,1.6,0,0,0,0,0,0,0,0,{"$f":"VLOOKUP(B88,#REF!,1,FALSE)","v":{"$error":"#REF!"}},null,{"$f":"VLOOKUP(B88,'Unsmoothed Prices'!$B$85:$B$157,1,FALSE)","v":"150W Sodium Vapour"}]
[{"$f":"INDEX('[1]Master list'!$B$3:$B$68,MATCH(C89,'[1]Master list'!$A$3:$A$68,0),1)","v":"High Pressure Sodium (elliptical) 250"},"250W Sodium Vapour","HPS_250_E",12.100000000000001,6.0500000000000007,0,0,0,0,0,0,0,0,{"$f":"VLOOKUP(B89,#REF!,1,FALSE)","v":{"$error":"#REF!"}},null,{"$f":"VLOOKUP(B89,'Unsmoothed Prices'!$B$85:$B$157,1,FALSE)","v":"250W Sodium Vapour"}]
[{"$f":"INDEX('[1]Master list'!$B$3:$B$68,MATCH(C90,'[1]Master list'!$A$3:$A$68,0),1)","v":"High Pressure Sodium (tubular) 250"},"250W Sodium Vapour","HPS_250_T",1947.3333333333333,973.66666666666663,0,0,0,0,0,0,0,0,{"$f":"VLOOKUP(B90,#REF!,1,FALSE)","v":{"$error":"#REF!"}},null,{"$f":"VLOOKUP(B90,'Unsmoothed Prices'!$B$85:$B$157,1,FALSE)","v":"250W Sodium Vapour"}]
[{"$f":"INDEX('[1]Master list'!$B$3:$B$68,MATCH(C91,'[1]Master list'!$A$3:$A$68,0),1)","v":"High Pres Sodium (tubular - dbl arc) 250"},"250W Sodium Vapour","HPS_250_TD",27.200000000000003,13.600000000000001,0,0,0,0,0,0,0,0,{"$f":"VLOOKUP(B91,#REF!,1,FALSE)","v":{"$error":"#REF!"}},null,{"$f":"VLOOKUP(B91,'Unsmoothed Prices'!$B$85:$B$157,1,FALSE)","v":"250W Sodium Vapour"}]
[{"$f":"INDEX('[1]Master list'!$B$3:$B$68,MATCH(C92,'[1]Master list'!$A$3:$A$68,0),1)","v":"High Pres Sodium (tubular - self ig) 250"},"250W Sodium Vapour","HPS_250_TS",7.6000000000000005,3.8000000000000003,0,0,0,0,0,0,0,0,{"$f":"VLOOKUP(B92,#REF!,1,FALSE)","v":{"$error":"#REF!"}},null,{"$f":"VLOOKUP(B92,'Unsmoothed Prices'!$B$85:$B$157,1,FALSE)","v":"250W Sodium Vapour"}]
[{"$f":"INDEX('[1]Master list'!$B$3:$B$68,MATCH(C93,'[1]Master list'!$A$3:$A$68,0),1)","v":"High Pressure Sodium (tubular) 400"},"400W Sodium Vapour","HPS_400_T",169.5,84.75,0,0,0,0,0,0,0,0,{"$f":"VLOOKUP(B93,#REF!,1,FALSE)","v":{"$error":"#REF!"}},null,{"$f":"VLOOKUP(B93,'Unsmoothed Prices'!$B$85:$B$157,1,FALSE)","v":"400W Sodium Vapour"}]
[{"$f":"INDEX('[1]Master list'!$B$3:$B$68,MATCH(C94,'[1]Master list'!$A$3:$A$68,0),1)","v":"High Pres Sodium (tubular - dbl arc) 400"},"400W Sodium Vapour","HPS_400_TD",5.2,2.6,0,0,0,0,0,0,0,0,{"$f":"VLOOKUP(B94,#REF!,1,FALSE)","v":{"$error":"#REF!"}},null,{"$f":"VLOOKUP(B94,'Unsmoothed Prices'!$B$85:$B$157,1,FALSE)","v":"400W Sodium Vapour"}]
[{"$f":"INDEX('[1]Master list'!$B$3:$B$68,MATCH(C95,'[1]Master list'!$A$3:$A$68,0),1)","v":"High Pressure Sodium (tubular) 250 FLOOD"},"250W Sodium Vapour - Flood Light","HPS_250_T1",9.1333333333333329,4.5666666666666664,0,0,0,0,0,0,0,0,{"$f":"VLOOKUP(B95,#REF!,1,FALSE)","v":{"$error":"#REF!"}},null,{"$f":"VLOOKUP(B95,'Unsmoothed Prices'!$B$85:$B$157,1,FALSE)","v":"250W Sodium Vapour - Flood Light"}]
[{"$f":"INDEX('[1]Master list'!$B$3:$B$68,MATCH(C96,'[1]Master list'!$A$3:$A$68,0),1)","v":"High Pressure Sodium (tubular) 400 FLOOD"},"400W Sodium Vapour - Flood Light","HPS_400_T1",3.7333333333333338,1.8666666666666669,0,0,0,0,0,0,0,0,{"$f":"VLOOKUP(B96,#REF!,1,FALSE)","v":{"$error":"#REF!"}},null,{"$f":"VLOOKUP(B96,'Unsmoothed Prices'!$B$85:$B$157,1,FALSE)","v":"400W Sodium Vapour - Flood Light"}]
[{"$f":"INDEX('[1]Master list'!$B$3:$B$68,MATCH(C97,'[1]Master list'!$A$3:$A$68,0),1)","v":"Fluorescent 1x20"},"1x20W Fluorescent","FL_1X20",2.4000000000000004,1.2000000000000002,0,0,0,0,0,0,0,0,{"$f":"VLOOKUP(B97,#REF!,1,FALSE)","v":{"$error":"#REF!"}},null,{"$f":"VLOOKUP(B97,'Unsmoothed Prices'!$B$85:$B$157,1,FALSE)","v":"1x20W Fluorescent"}]
[{"$f":"INDEX('[1]Master list'!$B$3:$B$68,MATCH(C98,'[1]Master list'!$A$3:$A$68,0),1)","v":"Fluorescent 1x40"},"1x40W Fluorescent","FL_1X40",16,8,0,0,0,0,0,0,0,0,{"$f":"VLOOKUP(B98,#REF!,1,FALSE)","v":{"$error":"#REF!"}},null,{"$f":"VLOOKUP(B98,'Unsmoothed Prices'!$B$85:$B$157,1,FALSE)","v":"1x40W Fluorescent"}]
[{"$f":"INDEX('[1]Master list'!$B$3:$B$68,MATCH(C99,'[1]Master list'!$A$3:$A$68,0),1)","v":"Fluorescent 2X20"},"2x20W Fluorescent","FL_2X20",2,1,0,0,0,0,0,0,0,0,{"$f":"VLOOKUP(B99,#REF!,1,FALSE)","v":{"$error":"#REF!"}},null,{"$f":"VLOOKUP(B99,'Unsmoothed Prices'!$B$85:$B$157,1,FALSE)","v":"2x20W Fluorescent"}]
[{"$f":"INDEX('[1]Master list'!$B$3:$B$68,MATCH(C100,'[1]Master list'!$A$3:$A$68,0),1)","v":"Fluorescent 2X24"},"2x24W Fluorescent","FL_2X24",0.4,0.2,0,0,0,0,0,0,0,0,{"$f":"VLOOKUP(B100,#REF!,1,FALSE)","v":{"$error":"#REF!"}},null,{"$f":"VLOOKUP(B100,'Unsmoothed Prices'!$B$85:$B$157,1,FALSE)","v":"2x24W Fluorescent"}]
[{"$f":"INDEX('[1]Master list'!$B$3:$B$68,MATCH(C101,'[1]Master list'!$A$3:$A$68,0),1)","v":"Fluorescent 2x40"},"2x40W Fluorescent","FL_2X40",0.8,0.4,0,0,0,0,0,0,0,0,{"$f":"VLOOKUP(B101,#REF!,1,FALSE)","v":{"$error":"#REF!"}},null,{"$f":"VLOOKUP(B101,'Unsmoothed Prices'!$B$85:$B$157,1,FALSE)","v":"2x40W Fluorescent"}]
[{"$f":"INDEX('[1]Master list'!$B$3:$B$68,MATCH(C102,'[1]Master list'!$A$3:$A$68,0),1)","v":"Fluorescent 4x40"},"4x40W Fluorescent","FL_4X40",0.4,0.2,0,0,0,0,0,0,0,0,{"$f":"VLOOKUP(B102,#REF!,1,FALSE)","v":{"$error":"#REF!"}},null,{"$f":"VLOOKUP(B102,'Unsmoothed Prices'!$B$85:$B$157,1,FALSE)","v":"4x40W Fluorescent"}]
[{"$f":"INDEX('[1]Master list'!$B$3:$B$68,MATCH(C103,'[1]Master list'!$A$3:$A$68,0),1)","v":"Compact Fluorescent 32"},"32W Compact Fluorescent","CFL_32",0,0,0,0,0,0,0,0,0,0,{"$f":"VLOOKUP(B103,#REF!,1,FALSE)","v":{"$error":"#REF!"}},null,{"$f":"VLOOKUP(B103,'Unsmoothed Prices'!$B$85:$B$157,1,FALSE)","v":"32W Compact Fluorescent"}]
[{"$f":"INDEX('[1]Master list'!$B$3:$B$68,MATCH(C104,'[1]Master list'!$A$3:$A$68,0),1)","v":"Compact Fluorescent 42"},"42W Compact Fluorescent","CFL_42",964.43333333333339,482.2166666666667,0,0,0,0,0,0,0,0,{"$f":"VLOOKUP(B104,#REF!,1,FALSE)","v":{"$error":"#REF!"}},null,{"$f":"VLOOKUP(B104,'Unsmoothed Prices'!$B$85:$B$157,1,FALSE)","v":"42W Compact Fluorescent"}]
[{"$f":"INDEX('[1]Master list'!$B$3:$B$68,MATCH(C105,'[1]Master list'!$A$3:$A$68,0),1)","v":"Compact Fluorescent 42 Pole Top Entry"},"42W Compact Fluorescent","CFL_42_1",6.6333333333333329,3.3166666666666664,0,0,0,0,0,0,0,0,{"$f":"VLOOKUP(B105,#REF!,1,FALSE)","v":{"$error":"#REF!"}},null,{"$f":"VLOOKUP(B105,'Unsmoothed Prices'!$B$85:$B$157,1,FALSE)","v":"42W Compact Fluorescent"}]
[{"$f":"INDEX('[1]Master list'!$B$3:$B$68,MATCH(C106,'[1]Master list'!$A$3:$A$68,0),1)","v":"Incandescent 60"},"60W Incandescent","INC_60",2.4000000000000004,1.2000000000000002,0,0,0,0,0,0,0,0,{"$f":"VLOOKUP(B106,#REF!,1,FALSE)","v":{"$error":"#REF!"}},null,{"$f":"VLOOKUP(B106,'Unsmoothed Prices'!$B$85:$B$157,1,FALSE)","v":"60W Incandescent"}]
[{"$f":"INDEX('[1]Master list'!$B$3:$B$68,MATCH(C107,'[1]Master list'!$A$3:$A$68,0),1)","v":"Incandescent 100"},"100W Incandescent","INC_100",3.6,1.8,0,0,0,0,0,0,0,0,{"$f":"VLOOKUP(B107,#REF!,1,FALSE)","v":{"$error":"#REF!"}},null,{"$f":"VLOOKUP(B107,'Unsmoothed Prices'!$B$85:$B$157,1,FALSE)","v":"100W Incandescent"}]
[{"$f":"INDEX('[1]Master list'!$B$3:$B$68,MATCH(C108,'[1]Master list'!$A$3:$A$68,0),1)","v":"Metal Halide (elliptical) 100"},"100W Metal Halide","MH_100_E",0,0,0,0,0,0,0,0,0,0,{"$f":"VLOOKUP(B108,#REF!,1,FALSE)","v":{"$error":"#REF!"}},null,{"$f":"VLOOKUP(B108,'Unsmoothed Prices'!$B$85:$B$157,1,FALSE)","v":"100W Metal Halide"}]
[{"$f":"INDEX('[1]Master list'!$B$3:$B$68,MATCH(C109,'[1]Master list'!$A$3:$A$68,0),1)","v":"Metal Halide (elliptical) 150"},"150W Metal Halide","MH_150_E",6,3,0,0,0,0,0,0,0,0,{"$f":"VLOOKUP(B109,#REF!,1,FALSE)","v":{"$error":"#REF!"}},null,{"$f":"VLOOKUP(B109,'Unsmoothed Prices'!$B$85:$B$157,1,FALSE)","v":"150W Metal Halide"}]
[{"$f":"INDEX('[1]Master list'!$B$3:$B$68,MATCH(C110,'[1]Master list'!$A$3:$A$68,0),1)","v":"Metal Halide (tubular) 250"},"250W Metal Halide","MH_250_T",8,4,0,0,0,0,0,0,0,0,{"$f":"VLOOKUP(B110,#REF!,1,FALSE)","v":{"$error":"#REF!"}},null,{"$f":"VLOOKUP(B110,'Unsmoothed Prices'!$B$85:$B$157,1,FALSE)","v":"250W Metal Halide"}]
[{"$f":"INDEX('[1]Master list'!$B$3:$B$68,MATCH(C111,'[1]Master list'!$A$3:$A$68,0),1)","v":"Metal Halide (tubular) 400"},"400W Metal Halide","MH_400_T",0.4,0.2,0,0,0,0,0,0,0,0,{"$f":"VLOOKUP(B111,#REF!,1,FALSE)","v":{"$error":"#REF!"}},null,{"$f":"VLOOKUP(B111,'Unsmoothed Prices'!$B$85:$B$157,1,FALSE)","v":"400W Metal Halide"}]
[{"$f":"INDEX('[1]Master list'!$B$3:$B$68,MATCH(C112,'[1]Master list'!$A$3:$A$68,0),1)","v":"Metal Halide (tubular) 400 FLOOD"},"400W Metal Halide - Flood Light","MH_400_T1",0,0,0,0,0,0,0,0,0,0,{"$f":"VLOOKUP(B112,#REF!,1,FALSE)","v":{"$error":"#REF!"}},null,{"$f":"VLOOKUP(B112,'Unsmoothed Prices'!$B$85:$B$157,1,FALSE)","v":"400W Metal Halide - Flood Light"}]
[{"$f":"INDEX('[1]Master list'!$B$3:$B$68,MATCH(C113,'[1]Master list'!$A$3:$A$68,0),1)","v":"LED 18 Hobart and Glenorchy"},"LED 18","LED_18",7083.6500000000015,9107.9500000000007,11132.25,11132.25,11132.25,11132.25,11132.25,11132.25,11132.25,11132.25,{"$f":"VLOOKUP(B113,#REF!,1,FALSE)","v":{"$error":"#REF!"}},null,{"$f":"VLOOKUP(B113,'Unsmoothed Prices'!$B$85:$B$157,1,FALSE)","v":"LED 18"}]
[{"$f":"INDEX('[1]Master list'!$B$3:$B$68,MATCH(C114,'[1]Master list'!$A$3:$A$68,0),1)","v":"LED 18 TasNetworks BAU"},"LED 18","LED_18_1",2,2,2,2,2,2,2,2,2,2,{"$f":"VLOOKUP(B114,#REF!,1,FALSE)","v":{"$error":"#REF!"}},null,{"$f":"VLOOKUP(B114,'Unsmoothed Prices'!$B$85:$B$157,1,FALSE)","v":"LED 18"}]
[{"$f":"INDEX('[1]Master list'!$B$3:$B$68,MATCH(C115,'[1]Master list'!$A$3:$A$68,0),1)","v":"LED 18 Kensington Pole Top Entry"},"LED 18","LED_18_2",9,9,9,9,9,9,9,9,9,9,{"$f":"VLOOKUP(B115,#REF!,1,FALSE)","v":{"$error":"#REF!"}},null,{"$f":"VLOOKUP(B115,'Unsmoothed Prices'!$B$85:$B$157,1,FALSE)","v":"LED 18"}]
[{"$f":"INDEX('[1]Master list'!$B$3:$B$68,MATCH(C116,'[1]Master list'!$A$3:$A$68,0),1)","v":"LED 18 Burke Hill"},"LED 18","LED_18_3",74,74,74,74,74,74,74,74,74,74,{"$f":"VLOOKUP(B116,#REF!,1,FALSE)","v":{"$error":"#REF!"}},null,{"$f":"VLOOKUP(B116,'Unsmoothed Prices'!$B$85:$B$157,1,FALSE)","v":"LED 18"}]
[{"$f":"INDEX('[1]Master list'!$B$3:$B$68,MATCH(C117,'[1]Master list'!$A$3:$A$68,0),1)","v":"Sylvania StreetLED Aeroscreen"},"LED 18","LED_18_4",126.83333333333333,126.83333333333333,126.83333333333333,126.83333333333333,126.83333333333333,126.83333333333333,126.83333333333333,126.83333333333333,126.83333333333333,126.83333333333333,{"$f":"VLOOKUP(B117,#REF!,1,FALSE)","v":{"$error":"#REF!"}},null,{"$f":"VLOOKUP(B117,'Unsmoothed Prices'!$B$85:$B$157,1,FALSE)","v":"LED 18"}]
[{"$f":"INDEX('[1]Master list'!$B$3:$B$68,MATCH(C118,'[1]Master list'!$A$3:$A$68,0),1)","v":"LED 20W Boston decorative top entry"},"LED 20","LED_20_1",48.666666666666664,48.666666666666664,48.666666666666664,48.666666666666664,48.666666666666664,48.666666666666664,48.666666666666664,48.666666666666664,48.666666666666664,48.666666666666664,{"$f":"VLOOKUP(B118,#REF!,1,FALSE)","v":{"$error":"#REF!"}},null,{"$f":"VLOOKUP(B118,'Unsmoothed Prices'!$B$85:$B$157,1,FALSE)","v":"LED 20"}]
[{"$f":"INDEX('[1]Master list'!$B$3:$B$68,MATCH(C119,'[1]Master list'!$A$3:$A$68,0),1)","v":"LED 200W Aldridge Floodlight"},"LED 200","LED_200",4,4,4,4,4,4,4,4,4,4,{"$f":"VLOOKUP(B119,#REF!,1,FALSE)","v":{"$error":"#REF!"}},null,{"$f":"VLOOKUP(B119,'Unsmoothed Prices'!$B$85:$B$157,1,FALSE)","v":"LED 200"}]
[{"$f":"INDEX('[1]Master list'!$B$3:$B$68,MATCH(C120,'[1]Master list'!$A$3:$A$68,0),1)","v":"LED 240W Aldridge Floodlight"},"LED 240","LED_240_1",30.833333333333332,30.833333333333332,30.833333333333332,30.833333333333332,30.833333333333332,30.833333333333332,30.833333333333332,30.833333333333332,30.833333333333332,30.833333333333332,{"$f":"VLOOKUP(B120,#REF!,1,FALSE)","v":{"$error":"#REF!"}},null,{"$f":"VLOOKUP(B120,'Unsmoothed Prices'!$B$85:$B$157,1,FALSE)","v":"LED 240"}]
[{"$f":"INDEX('[1]Master list'!$B$3:$B$68,MATCH(C121,'[1]Master list'!$A$3:$A$68,0),1)","v":"LED 25 Hobart and Glenorchy"},"LED 25","LED_25",2,2,2,2,2,2,2,2,2,2,{"$f":"VLOOKUP(B121,#REF!,1,FALSE)","v":{"$error":"#REF!"}},null,{"$f":"VLOOKUP(B121,'Unsmoothed Prices'!$B$85:$B$157,1,FALSE)","v":"LED 25"}]
[{"$f":"INDEX('[1]Master list'!$B$3:$B$68,MATCH(C122,'[1]Master list'!$A$3:$A$68,0),1)","v":"LED 25 TasNetworks BAU"},"LED 25","LED_25_1",39,39,39,39,39,39,39,39,39,39,{"$f":"VLOOKUP(B122,#REF!,1,FALSE)","v":{"$error":"#REF!"}},null,{"$f":"VLOOKUP(B122,'Unsmoothed Prices'!$B$85:$B$157,1,FALSE)","v":"LED 25"}]
[{"$f":"INDEX('[1]Master list'!$B$3:$B$68,MATCH(C123,'[1]Master list'!$A$3:$A$68,0),1)","v":"LED 25 Kensington Pole Top Entry"},"LED 25","LED_25_2",19,19,19,19,19,19,19,19,19,19,{"$f":"VLOOKUP(B123,#REF!,1,FALSE)","v":{"$error":"#REF!"}},null,{"$f":"VLOOKUP(B123,'Unsmoothed Prices'!$B$85:$B$157,1,FALSE)","v":"LED 25"}]
[{"$f":"INDEX('[1]Master list'!$B$3:$B$68,MATCH(C124,'[1]Master list'!$A$3:$A$68,0),1)","v":"LED 25 Burke Hill"},"LED 25","LED_25_3",15,15,15,15,15,15,15,15,15,15,{"$f":"VLOOKUP(B124,#REF!,1,FALSE)","v":{"$error":"#REF!"}},null,{"$f":"VLOOKUP(B124,'Unsmoothed Prices'!$B$85:$B$157,1,FALSE)","v":"LED 25"}]
[{"$f":"INDEX('[1]Master list'!$B$3:$B$68,MATCH(C125,'[1]Master list'!$A$3:$A$68,0),1)","v":"LED 265W Aldridge VLED MKII"},"LED 265","LED_265",44,44,44,44,44,44,44,44,44,44,{"$f":"VLOOKUP(B125,#REF!,1,FALSE)","v":{"$error":"#REF!"}},null,{"$f":"VLOOKUP(B125,'Unsmoothed Prices'!$B$85:$B$157,1,FALSE)","v":"LED 265"}]
[{"$f":"INDEX('[1]Master list'!$B$3:$B$68,MATCH(C126,'[1]Master list'!$A$3:$A$68,0),1)","v":"LED 30 Hobart and Glenorchy"},"LED 30","LED_30",0,0,0,0,0,0,0,0,0,0,{"$f":"VLOOKUP(B126,#REF!,1,FALSE)","v":{"$error":"#REF!"}},null,{"$f":"VLOOKUP(B126,'Unsmoothed Prices'!$B$85:$B$157,1,FALSE)","v":"LED 30"}]
[{"$f":"INDEX('[1]Master list'!$B$3:$B$68,MATCH(C127,'[1]Master list'!$A$3:$A$68,0),1)","v":"LED 75 Aldridge VLED MKII"},"LED 75","LED_75",386,386,386,386,386,386,386,386,386,386,{"$f":"VLOOKUP(B127,#REF!,1,FALSE)","v":{"$error":"#REF!"}},null,{"$f":"VLOOKUP(B127,'Unsmoothed Prices'!$B$85:$B$157,1,FALSE)","v":"LED 75"}]
[{"$f":"INDEX('[1]Master list'!$B$3:$B$68,MATCH(C128,'[1]Master list'!$A$3:$A$68,0),1)","v":"Gerard Lighting Sylvania RoadLED 155W"},"LED 155","LED_155_1",14,14,14,14,14,14,14,14,14,14,{"$f":"VLOOKUP(B128,#REF!,1,FALSE)","v":{"$error":"#REF!"}},null,{"$f":"VLOOKUP(B128,'Unsmoothed Prices'!$B$85:$B$157,1,FALSE)","v":"LED 155"}]
[{"$f":"INDEX('[1]Master list'!$B$3:$B$68,MATCH(C129,'[1]Master list'!$A$3:$A$68,0),1)","v":"14W LED"},"LED 14","LED_14_1",11507.216666666667,12692.233333333334,13877.25,13877.25,13877.25,13877.25,13877.25,13877.25,13877.25,13877.25,{"$f":"VLOOKUP(B129,#REF!,1,FALSE)","v":{"$error":"#REF!"}},null,{"$f":"VLOOKUP(B129,'Unsmoothed Prices'!$B$85:$B$157,1,FALSE)","v":"LED 14"}]
[{"$f":"INDEX('[1]Master list'!$B$3:$B$68,MATCH(C130,'[1]Master list'!$A$3:$A$68,0),1)","v":"14W LED (Aeroscreen)"},"LED 14","LED_14_2",98.666666666666671,98.666666666666671,98.666666666666671,98.666666666666671,98.666666666666671,98.666666666666671,98.666666666666671,98.666666666666671,98.666666666666671,98.666666666666671,{"$f":"VLOOKUP(B130,#REF!,1,FALSE)","v":{"$error":"#REF!"}},null,{"$f":"VLOOKUP(B130,'Unsmoothed Prices'!$B$85:$B$157,1,FALSE)","v":"LED 14"}]
[{"$f":"INDEX('[1]Master list'!$B$3:$B$68,MATCH(C131,'[1]Master list'!$A$3:$A$68,0),1)","v":"LED 14 Aldridge PLED II"},"LED 14","LED_14_3",3409.6666666666665,3409.6666666666665,3409.6666666666665,3409.6666666666665,3409.6666666666665,3409.6666666666665,3409.6666666666665,3409.6666666666665,3409.6666666666665,3409.6666666666665,{"$f":"VLOOKUP(B131,#REF!,1,FALSE)","v":{"$error":"#REF!"}},null,{"$f":"VLOOKUP(B131,'Unsmoothed Prices'!$B$85:$B$157,1,FALSE)","v":"LED 14"}]
[{"$f":"INDEX('[1]Master list'!$B$3:$B$68,MATCH(C132,'[1]Master list'!$A$3:$A$68,0),1)","v":"LED 14 Aldridge PLED II (Aeroscreen)"},"LED 14","LED_14_4",88.583333333333329,88.583333333333329,88.583333333333329,88.583333333333329,88.583333333333329,88.583333333333329,88.583333333333329,88.583333333333329,88.583333333333329,88.583333333333329,{"$f":"VLOOKUP(B132,#REF!,1,FALSE)","v":{"$error":"#REF!"}},null,{"$f":"VLOOKUP(B132,'Unsmoothed Prices'!$B$85:$B$157,1,FALSE)","v":"LED 14"}]
[{"$f":"INDEX('[1]Master list'!$B$3:$B$68,MATCH(C133,'[1]Master list'!$A$3:$A$68,0),1)","v":"LED 17W Berlin decorative bottom entry"},"LED 17","LED_17_1",15.666666666666666,15.666666666666666,15.666666666666666,15.666666666666666,15.666666666666666,15.666666666666666,15.666666666666666,15.666666666666666,15.666666666666666,15.666666666666666,{"$f":"VLOOKUP(B133,#REF!,1,FALSE)","v":{"$error":"#REF!"}},null,{"$f":"VLOOKUP(B133,'Unsmoothed Prices'!$B$85:$B$157,1,FALSE)","v":"LED 17"}]
[{"$f":"INDEX('[1]Master list'!$B$3:$B$68,MATCH(C134,'[1]Master list'!$A$3:$A$68,0),1)","v":"LED 175W Aldridge VLED MKII"},"LED 175","LED_175",799.58333333333337,799.58333333333337,799.58333333333337,799.58333333333337,799.58333333333337,799.58333333333337,799.58333333333337,799.58333333333337,799.58333333333337,799.58333333333337,{"$f":"VLOOKUP(B134,#REF!,1,FALSE)","v":{"$error":"#REF!"}},null,{"$f":"VLOOKUP(B134,'Unsmoothed Prices'!$B$85:$B$157,1,FALSE)","v":"LED 175"}]
["New technology - Minor","LED 14 New Tech","LEDNEWMIN",1,1,1,1,1,1,1,1,1,1,{"$f":"VLOOKUP(B135,#REF!,1,FALSE)","v":{"$error":"#REF!"}},null,{"$f":"VLOOKUP(B135,'Unsmoothed Prices'!$B$85:$B$157,1,FALSE)","v":"LED 14 New Tech"}]
["New technology - Major","LED 75 New Tech","LEDNEWMAJ",1,1,1,1,1,1,1,1,1,1,{"$f":"VLOOKUP(B136,#REF!,1,FALSE)","v":{"$error":"#REF!"}},null,{"$f":"VLOOKUP(B136,'Unsmoothed Prices'!$B$85:$B$157,1,FALSE)","v":"LED 75 New Tech"}]
[null,null,null,null,null,null,null,null,null,null,null,null,null,null,null,{"$f":"VLOOKUP(B137,'Unsmoothed Prices'!$B$85:$B$157,1,FALSE)","v":0}]
[null,null,null,null,null,null,null,null,null,null,null,null,null,null,null,{"$f":"VLOOKUP(B138,'Unsmoothed Prices'!$B$85:$B$157,1,FALSE)","v":0}]
[null,null,null,null,null,null,null,null,{"$f":"H139","v":0},0,0,0,0,null,null,{"$f":"VLOOKUP(B139,'Unsmoothed Prices'!$B$85:$B$157,1,FALSE)","v":0}]
[null,null,null,null,null,null,null,null,null,null,null,null,null,null,null,{"$f":"VLOOKUP(B140,'Unsmoothed Prices'!$B$85:$B$157,1,FALSE)","v":0}]
[null,"Total Public Lighting",null,{"$f":"SUM(D75:D140)","v":30238.000000000004},30238.000000000004,30238.000000000004,30238.000000000004,30238.000000000004,30238.000000000004,30238.000000000004,30238.000000000004,30238.000000000004,30238.000000000004]
[null,"Movement",null,null,{"$f":"E141-D141","v":0},{"$f":"F141-E141","v":0},0,0,{"$f":"I141-H141","v":0},{"$f":"J141-I141","v":0},{"$f":"K141-J141","v":0},{"$f":"L141-K141","v":0},{"$f":"M141-L141","v":0}]
[]
[]
[null,"Total Lights",null,{"$f":"D69+D141","v":51858.75},51858.75,51858.75,51858.75,51858.75,51858.75,51858.75,51858.75,51858.75,51858.75]
[null,"% movement",null,null,{"$f":"(E145-D145)/D145","v":0},{"$f":"(F145-E145)/E145","v":0},0,0,{"$f":"(I145-H145)/H145","v":0},{"$f":"(J145-I145)/I145","v":0},{"$f":"(K145-J145)/J145","v":0},{"$f":"(L145-K145)/K145","v":0},{"$f":"(M145-L145)/L145","v":0}]

{"sheet":"RAB Input","index":7,"n_rows":62,"n_cols":10,"rows_kept":62,"cut":false,"hidden":false,"merged":[]}
[]
[]
[null,"Opening Regulatory Asset Base for 2021-22 ($m Nominal)","Opening Asset Value 2018-19 ($m Nominal) per R19 Final Decision","Average Remaining Life (Year) per R19 Decision","Opening Asset Value 2021-22 ($ Nominal) for R24 Modelling per RFM","Average Remaining Life (Year) for R24 per RFM","Standard Life (Year)","Opening Tax Value","Average Tax Remaining Life (Year)","Tax Standard Life (Year)"]
[null,"Spare Parts",0,"N/A",null,"N/A",5]
[null,"Motor Vehicles",323270.78237482277,4.6592782087319993,{"$f":"0.377695454554945*10^6","v":377695.454554945},4.5355088409034794,6]
[null,"Minor Assets",2371072.5227475758,3.977220119552209,{"$f":"1.76910091769034*10^6","v":1769100.91769034},3.8633226441847439,5]
[null,"NEM Assets",-5959.6732853384601,1,0,{"$f":"E42","v":0},5]
[null,"Streetlights"]
[null,"Non-System Property",206846.28634556208,42.494829550993522,{"$f":"0.200945954810357*10^6","v":200945.95481035701},38.869293429006376,40]
[null,"Business Management Systems",0,null,null,null,10]
[null,"Overhead High Voltage Lines Rural",430735.22452455468,16.585293013920541,{"$f":"0.368640579179036*10^6","v":368640.57917903597},12.585293013920539,35]
[null,"Indirect POW Capex",543949.80130909092,39,{"$f":"0.524825487573766*10^6","v":524825.48757376603},35,40]
[]
[]
[]
[]
[]
[]
[null,null,"Percentage Allocation based on R19 splits of Non-Network RAB (rounded)","Useful Life of Asset Class (in years) in line with AER"]
[null,"Non-Network Capex RAB Input"]
[null,"Motor Vehicles",0.14000000000000004,6]
[null,"Minor Assets",0.68,5]
[null,"NEM Assets",0,5]
[null,"Non-System Property",0.18,40]
[null,"Overhead High Voltage Lines Rural",0,35]
[null,"Indirect POW Capex",0,40]
[null,"Total",{"$f":"SUM(C21:C26)","v":1}]
[]
[]
[null,"Non-Network Capex related to Public Lighting per RINs (Forecast for future years)","2019-20","2020-21","2021-22"]
[null,"Motor Vehicles",143079.91246426117,50000,115272.52242779087]
[null,"Minor Assets",492696.55970429495,430493.8209291047,430493.8209291047]
[null,"NEM Assets",0,0,0]
[null,"Non-System Property",163609.99332365452,54827.005560074656,54827.005560074656]
[null,"Overhead High Voltage Lines Rural",0,0,0]
[null,"Indirect POW Capex",0,0,0]
[null,"Total",{"$f":"SUM(C31:C36)","v":799386.4654922107},{"$f":"SUM(D31:D36)","v":535320.8264891794},600593.34891697031]
[]
[null,"Calculated remaining residual life of assets based on R19 RAB + actual Capex","2019-20","2020-21","2021-22"]
[null,"Motor Vehicles",{"$f":"D5+IFERROR((D5/$G5),0)-1","v":4.4358245768539994},{"$f":"C40+IFERROR(((D31/$C56)/(C40/$G5)),0)-1","v":3.6098511265346751},{"$f":"D40+IFERROR(((E31/$C56)/(D40/$G5)),0)-1","v":3.1028618586115364}]
[null,"Minor Assets",{"$f":"D6+IFERROR(((C32/C6)/(D6/G6)),0)-1","v":3.2384513335535328},{"$f":"C41+IFERROR(((D32/$C57)/(C41/$G6)),0)-1","v":2.5285672584117154},{"$f":"D41+IFERROR(((E32/$C57)/(D41/$G6)),0)-1","v":1.9001319461282873}]
[null,"NEM Assets",0,0,0]
[null,"Non-System Property",{"$f":"D9+IFERROR(((C34/C9)/(D9/G9)),0)-1","v":42.239366059844151},{"$f":"C43+IFERROR(((D34/$C59)/(C43/$G9)),0)-1","v":41.383111987571731},{"$f":"D43+IFERROR(((E34/$C59)/(D43/$G9)),0)-1","v":40.529832148750543}]
[null,"Overhead High Voltage Lines Rural",{"$f":"D11+IFERROR(((C35/C11)/(D11/G11)),0)-1","v":15.585293013920541},{"$f":"C44+IFERROR(((D35/$C60)/(C44/$G11)),0)-1","v":14.585293013920541},{"$f":"D44+IFERROR(((E35/$C60)/(D44/$G11)),0)-1","v":13.585293013920541}]
[null,"Indirect POW Capex",{"$f":"D12+IFERROR(((C36/C12)/(D12/G12)),0)-1","v":38},{"$f":"C45+IFERROR(((D36/$C61)/(C45/$G12)),0)-1","v":37},{"$f":"D45+IFERROR(((E36/$C61)/(D45/$G12)),0)-1","v":36}]
[]
[null,"Assumed Depreciation for Non-Network capex based on standard Life","2019-20","2020-21","2021-22"]
[null,"Motor Vehicles",{"$f":"-(C5+C31)/G5","v":-77725.11580651399},{"$f":"-(C56+D31)/$G5","v":-73104.263172094987},-80132.306381377639]
[null,"Minor Assets",{"$f":"-(C6+C32)/G6","v":-572753.81649037416},-544301.81737812026,-521540.21808831708]
[null,"NEM Assets",{"$f":"-(C7+C33)/G7","v":1191.9346570676921},953.54772565415374,762.83818052332299]
[null,"Non-System Property",{"$f":"-(C9+C34)/G9","v":-9261.406991730415},{"$f":"-(C59+D34)/$G9","v":-10400.54695593902},-11511.208421042411]
[null,"Overhead High Voltage Lines Rural",{"$f":"-(C11+C35)/G11","v":-12306.720700701562},-41842.85038238531,-37658.56534414678]
[null,"Indirect POW Capex",{"$f":"-(C12+C36)/G12","v":-13598.745032727273},-15152.887322181819,-14719.947684405195]
[]
[null,"Allocate RAB across Asset categories","2019-20","2020-21","2021-22"]
[null,"Motor Vehicles",{"$f":"C5+C31+C48","v":388625.57903256995},{"$f":"C56+D31+D48","v":365521.31586047495},{"$f":"D56+E31+E48","v":400661.53190688818}]
[null,"Minor Assets",{"$f":"C6+C32+C49","v":2291015.2659614966},{"$f":"C57+D32+D49","v":2177207.2695124811},2086160.8723532683]
[null,"NEM Assets",{"$f":"C7+C33+C50","v":-4767.7386282707685},-3814.1909026166149,-3051.352722093292]
[null,"Non-System Property",{"$f":"C9+C34+C51","v":361194.87267748616},405621.33128162177,448937.12842065399]
[null,"Overhead High Voltage Lines Rural",{"$f":"C11+C35+C52","v":418428.5038238531},376585.65344146779,338927.08809732099]
[null,"Indirect POW Capex",{"$f":"C12+C36+C53","v":530351.05627636367},515198.16895418183,500478.22126977664]
[null,"Total Non-Network RAB",{"$f":"SUM(C56:C61)","v":3984847.5391434995},{"$f":"SUM(D56:D61)","v":3836319.5481476109},{"$f":"SUM(E56:E61)","v":3772113.4893258144}]

{"sheet":"Overhead & NonNetwork Input","index":8,"n_rows":45,"n_cols":12,"rows_kept":45,"cut":false,"hidden":false,"merged":[]}
[]
[null,null,"2024-25","2025-26","2026-27","2027-28","2028-29","2029-30","2030-31","2031-32","2032-33","2033-34"]
["Direct Opex per Program of Work","RLBLR",57000,142500,356250,356250,356250,356250,356250,356250,356250,356250]
["Indirect Opex per Program of Work","RLICM",47000,47000,47000,47000,47000,47000,47000,47000,47000,47000]
["Indirect Opex per Program of Work","RLDEC",350000,350000,350000,350000,350000,350000,350000,350000,350000,350000]
["Direct Opex per Program of Work","RLREM",128000,128000,128000,128000,128000,128000,128000,128000,128000,128000]
["Direct Opex per Program of Work","RLREM",210000,210000,210000,210000,210000,210000,210000,210000,210000,210000]
["Opex Overheads",null,{"$f":"SUM(C3:C7)*0.35","v":277200},{"$f":"SUM(D3:D7)*0.35","v":307125},381937.5,381937.5,381937.5,381937.5,381937.5,381937.5,381937.5,381937.5]
[]
["Direct Capex per Program of Work","RLMAJ",1982300,1982300,1982300,1982300,778300,778300,778300,778300,778300,778300]
["Direct Capex per Program of Work","RLMIN",2123800,635140,656840,496140,510400,510400,510400,510400,510400,510400]
["Capitalised Overheads",null,{"$f":"(C10+C11)*0.35","v":1437135},{"$f":"(D10+D11)*0.35","v":916104},923698.99999999988,867454,451045,451045,451045,451045,451045,451045]
[]
["Total Public Lighting",null,{"$f":"VLOOKUP($A14,'Volumes Input'!$B$141:$M$141,MATCH(C$2,'Volumes Input'!$B$4:$M$4,0),FALSE)","v":30238.000000000004},{"$f":"VLOOKUP($A14,'Volumes Input'!$B$141:$M$141,MATCH(D$2,'Volumes Input'!$B$4:$M$4,0),FALSE)","v":30238.000000000004},{"$f":"VLOOKUP($A14,'Volumes Input'!$B$141:$M$141,MATCH(E$2,'Volumes Input'!$B$4:$M$4,0),FALSE)","v":30238.000000000004},{"$f":"VLOOKUP($A14,'Volumes Input'!$B$141:$M$141,MATCH(F$2,'Volumes Input'!$B$4:$M$4,0),FALSE)","v":30238.000000000004},{"$f":"VLOOKUP($A14,'Volumes Input'!$B$141:$M$141,MATCH(G$2,'Volumes Input'!$B$4:$M$4,0),FALSE)","v":30238.000000000004},{"$f":"VLOOKUP($A14,'Volumes Input'!$B$141:$M$141,MATCH(H$2,'Volumes Input'!$B$4:$M$4,0),FALSE)","v":30238.000000000004},{"$f":"VLOOKUP($A14,'Volumes Input'!$B$141:$M$141,MATCH(I$2,'Volumes Input'!$B$4:$M$4,0),FALSE)","v":30238.000000000004},{"$f":"VLOOKUP($A14,'Volumes Input'!$B$141:$M$141,MATCH(J$2,'Volumes Input'!$B$4:$M$4,0),FALSE)","v":30238.000000000004},{"$f":"VLOOKUP($A14,'Volumes Input'!$B$141:$M$141,MATCH(K$2,'Volumes Input'!$B$4:$M$4,0),FALSE)","v":30238.000000000004},{"$f":"VLOOKUP($A14,'Volumes Input'!$B$141:$M$141,MATCH(L$2,'Volumes Input'!$B$4:$M$4,0),FALSE)","v":30238.000000000004}]
[]
["Total Contract Lighting",null,{"$f":"VLOOKUP($A16,'Volumes Input'!$B$69:$M$69,MATCH(C$2,'Volumes Input'!$B$4:$M$4,0),FALSE)","v":21620.75},{"$f":"VLOOKUP($A16,'Volumes Input'!$B$69:$M$69,MATCH(D$2,'Volumes Input'!$B$4:$M$4,0),FALSE)","v":21620.75},{"$f":"VLOOKUP($A16,'Volumes Input'!$B$69:$M$69,MATCH(E$2,'Volumes Input'!$B$4:$M$4,0),FALSE)","v":21620.75},{"$f":"VLOOKUP($A16,'Volumes Input'!$B$69:$M$69,MATCH(F$2,'Volumes Input'!$B$4:$M$4,0),FALSE)","v":21620.75},{"$f":"VLOOKUP($A16,'Volumes Input'!$B$69:$M$69,MATCH(G$2,'Volumes Input'!$B$4:$M$4,0),FALSE)","v":21620.75},{"$f":"VLOOKUP($A16,'Volumes Input'!$B$69:$M$69,MATCH(H$2,'Volumes Input'!$B$4:$M$4,0),FALSE)","v":21620.75},{"$f":"VLOOKUP($A16,'Volumes Input'!$B$69:$M$69,MATCH(I$2,'Volumes Input'!$B$4:$M$4,0),FALSE)","v":21620.75},{"$f":"VLOOKUP($A16,'Volumes Input'!$B$69:$M$69,MATCH(J$2,'Volumes Input'!$B$4:$M$4,0),FALSE)","v":21620.75},{"$f":"VLOOKUP($A16,'Volumes Input'!$B$69:$M$69,MATCH(K$2,'Volumes Input'!$B$4:$M$4,0),FALSE)","v":21620.75},{"$f":"VLOOKUP($A16,'Volumes Input'!$B$69:$M$69,MATCH(L$2,'Volumes Input'!$B$4:$M$4,0),FALSE)","v":21620.75}]
[]
["Total Lights",null,{"$f":"C14+C16","v":51858.75},{"$f":"D14+D16","v":51858.75},51858.75,51858.75,51858.75,51858.75,51858.75,51858.75,51858.75,51858.75]
[]
["Public Lighting Indirect Opex Rate",null,{"$f":"(C$4+C$5)/C$18","v":7.6554101284739797},{"$f":"(D$4+D$5)/D$18","v":7.6554101284739797},7.6554101284739797,7.6554101284739797,7.6554101284739797,7.6554101284739797,7.6554101284739797,7.6554101284739797,7.6554101284739797,7.6554101284739797]
[]
["Contract Lighting Indirect Opex Rate",null,{"$f":"(C$4+C$5)/C$18","v":7.6554101284739797},{"$f":"(D$4+D$5)/D$18","v":7.6554101284739797},7.6554101284739797,7.6554101284739797,7.6554101284739797,7.6554101284739797,7.6554101284739797,7.6554101284739797,7.6554101284739797,7.6554101284739797]
[]
["Public Lighting Overhead Rate",null,{"$f":"C$12/C$14+C$8/C$18","v":52.872737791025912},{"$f":"D$12/D$14+D$8/D$18","v":36.218785295440846},37.912579894827275,36.05250317017618,22.281453497578788,22.281453497578788,22.281453497578788,22.281453497578788,22.281453497578788,22.281453497578788]
[]
["Contract Lighting Overhead Rate",null,{"$f":"C$8/C18","v":5.3452888856750311},{"$f":"D$8/D18","v":5.9223371176513124},7.3649576975920166,7.3649576975920166,7.3649576975920166,7.3649576975920166,7.3649576975920166,7.3649576975920166,7.3649576975920166,7.3649576975920166]
[]
[]
["Non-Network Capex per Capex Model",null,1500075.354294332,661101.86672009446,536909.46162706474,405615.50661826966,217706.63157516351,217706.63157516351,217706.63157516351,217706.63157516351,217706.63157516351,217706.63157516351]
[]
["NPV Non-Network",{"$f":"NPV(INDEX('General Inputs'!$C$14:$Q$14,1,MATCH(C$2,'General Inputs'!$C$10:$Q$10,0)),$C$29:$G$29)","v":3144113.0254392754},{"$f":"$B$31/$B$32","v":725575.40594426508},{"$f":"$B$31/$B$32","v":725575.40594426508},725575.40594426508,725575.40594426508,725575.40594426508]
["Discount Factor",{"$f":"SUM(C32:G32)","v":4.3332684648365687},{"$f":"1/(1+INDEX('General Inputs'!$C$13:$Q$13,1,MATCH(\"Model Start Year\",'General Inputs'!$C$3:$Q$3,0)))^RIGHT(INDEX('General Inputs'!$C$8:$Q$8,1,MATCH(C$2,'General Inputs'!$C$10:$Q$10,0)),2)","v":0.95266821241131505},{"$f":"1/(1+INDEX('General Inputs'!$C$13:$Q$13,1,MATCH(\"Model Start Year\",'General Inputs'!$C$3:$Q$3,0)))^RIGHT(INDEX('General Inputs'!$C$8:$Q$8,1,MATCH(D$2,'General Inputs'!$C$10:$Q$10,0)),2)","v":0.90757672293897051},{"$f":"1/(1+INDEX('General Inputs'!$C$13:$Q$13,1,MATCH(\"Model Start Year\",'General Inputs'!$C$3:$Q$3,0)))^RIGHT(INDEX('General Inputs'!$C$8:$Q$8,1,MATCH(E$2,'General Inputs'!$C$10:$Q$10,0)),2)","v":0.86461949426838836},{"$f":"1/(1+INDEX('General Inputs'!$C$13:$Q$13,1,MATCH(\"Model Start Year\",'General Inputs'!$C$3:$Q$3,0)))^RIGHT(INDEX('General Inputs'!$C$8:$Q$8,1,MATCH(F$2,'General Inputs'!$C$10:$Q$10,0)),2)","v":0.82369550802064084},{"$f":"1/(1+INDEX('General Inputs'!$C$13:$Q$13,1,MATCH(\"Model Start Year\",'General Inputs'!$C$3:$Q$3,0)))^RIGHT(INDEX('General Inputs'!$C$8:$Q$8,1,MATCH(G$2,'General Inputs'!$C$10:$Q$10,0)),2)","v":0.78470852719725392}]
[]
["Public Lighting Non-Network Capex Rate"]
[]
["Contract Lighting Non-Network Capex Rate"]
[]
[]
["Non-Network Capex RAB Input"]
["Motor Vehicles",null,198019.93738223839,106875.29533415871,108955.91043749351,94667.073136812367,54330.878349288323,54330.878349288323,54330.878349288323,54330.878349288323,54330.878349288323,54330.878349288323]
["Minor Assets",null,1207583.1763264353,502790.33309233276,375515.4934792245,265386.86310638901,137227.03028900185,128369.50993454126,128369.50993454126,128369.50993454126,128369.50993454126,128369.50993454126]
["Non-System Property",null,94472.234751622542,51436.238293603063,52438.057900829081,45561.572857596431,26148.721702080664,35006.242056541269,35006.242056541269,35006.242056541269,35006.242056541269,35006.242056541269]
["Total",null,{"$f":"SUM(C40:C42)","v":1500075.3484602962},{"$f":"SUM(D40:D42)","v":661101.86672009458},536909.4618175471,405615.50910079782,217706.63034037084,217706.63034037084,217706.63034037084,217706.63034037084,217706.63034037084,217706.63034037084]
[]
["Check",null,{"$f":"ROUND(C29,2)=ROUND(C43,2)","v":true},{"$f":"ROUND(D29,2)=ROUND(D43,2)","v":true},true,true,true,true,true,true,true,true]