{"text_format":"1","workbook":"xlsx","n_sheets":9,"sheets":["Cover Sheet","Price Comparison","Smoothed Prices with Price Path","Smoothed Prices","Unsmoothed Prices","General Inputs","Volumes Input","RAB Input","Overhead & NonNetwork Input"],"not_rendered":{"charts":0,"images":1,"macros":1,"external_links":1,"defined_names":74,"comments":2,"pivot_tables":0},"unopened":[],"bounds":{"document_bytes":16777216,"sheet_cells":100000,"rows_first":2000,"rows_last":500,"rows_between":2000,"halvings":0,"cell_chars":16384,"cell_head_chars":4096},"cells_cut":0,"cells_raw":0,"read":"whole","date_system":"1900"}

{"sheet":"Cover Sheet","index":0,"n_rows":29,"n_cols":4,"rows_kept":29,"cut":false,"hidden":false,"merged":[[23,1,26,5],[30,1,33,5]]}
[]
[null,null,"Model Details"]
[]
[null,null,"Model Name:","TasNetworks (Public Lighting Model)"]
[]
[null,null,"Created By:"]
[null,null,"Phone Number:"]
[null,null,"Email:"]
[]
[null,null,"Date:"]
{"$rows_left_out":20}
{"sheet":"Price Comparison","index":1,"n_rows":86,"n_cols":17,"rows_kept":86,"cut":false,"hidden":false,"merged":[[1,4,1,6],[1,7,1,16]]}
[]
[null,null,null,null,"Annual Pricing Model Cents per day (Nominal)",null,null,"Annuity Model 2024-2029 cents per day (Nominal)"]
["Light Type","Contract/Public","2019–20","2020–21","2021–22","2022–23","2023–24","2024-25","2025-26","2026-27","2027-28","2028-29","2029-30","2030-31","2031-32","2032-33","2033-34"]
["50W Mercury Vapour","Contract Lighting",18.507999999999999,19.170000000000002,19.66,20.48,21.33,16.952732590315108,17.702564512399793,18.485562055919363,19.303192160880986,20.156986651135163,21.048545104236151,21.979537848238508,22.951709091044112,23.96688018816258,25.02695305500707]
["80W Mercury Vapour","Contract Lighting",18.471,19.13,19.62,20.440000000000001,21.29,16.937573316434648,17.686734732604691,18.46903211323626,19.285931086586626,20.138962106736706,21.029723320885275,21.959883563465695,22.931185482694712,23.945448805410749,25.004573746318453]
["125W Mercury Vapour","Contract Lighting",21.625,22.4,22.98,23.94,24.94,19.832994627602098,20.710222673469229,21.626251165708933,22.582796276810001,23.581650086841851,24.624683940903047,25.713851955072258,26.851194677430062,28.038842911010395,29.279021705844009]
["250W Mercury Vapour","Contract Lighting",21.625,22.4,22.98,23.94,24.94,20.150173281100912,21.041430373797525,21.972108428001551,22.943951062045908,23.958779015794168,25.018493561782964,26.125080067241807,27.28061171366366,28.487253380894852,29.747265703021196]
["400W Mercury Vapour","Contract Lighting",21.760999999999999,22.54,23.12,24.08,25.08,21.134359985339866,22.069148385110321,23.045283168350704,24.064593116233802,25.128987898278559,26.24046165010153,27.401096709414961,28.613067517270842,29.878644691859858,31.200199282497461]
["70W Sodium Vapour","Contract Lighting",18.919,19.600000000000001,20.100000000000001,20.94,21.81,18.022044447882788,18.819172825638933,19.651558782104395,20.520761786106455,21.42841028293396,22.376204745217336,23.365920858751277,24.399412849228689,25.478616956118625,26.60555506019632]
["100W Sodium Vapour","Contract Lighting",22.51,23.31,23.91,24.9,25.94,21.559985751983493,22.51359989474204,23.509393097530133,24.549230971421693,25.635061644850598,26.768919413414654,27.952928551113065,29.189307290157835,30.4803719768151,31.828541411062435]
{"$rows_left_out":77}
{"sheet":"Smoothed Prices with Price Path","index":2,"n_rows":160,"n_cols":82,"rows_kept":160,"cut":false,"hidden":false,"merged":[[84,72,84,76],[84,77,84,81],[9,15,9,19],[9,26,9,30],[9,37,9,41],[9,48,9,52],[9,60,9,64],[9,72,9,76],[84,2,84,7],[84,26,84,30],[84,37,84,41],[84,48,84,52],[84,60,84,64],[7,3,7,7],[7,8,7,12],[9,3,9,7],[9,8,9,12],[9,77,9,81]]}
[]
[]
[null,null,null,null,null,null,null,null,null,null,null,null,null,null,null,"THIS TAKES 21/22 SMOOTHED PRICES ADDS CPI",null,null,null,null,null,null,null,null,null,null,null,null,null,null,null,null,null,null,null,null,null,"THIS TAKES 21/22 SMOOTHED PRICES  and multiplys by no.days in year/100 to convert $s into cents",null,null,null,null,null,null,null,null,null,null,"THIS TAKES nominal and multiplys by no days in year/100"]
[null,"Private Contract Lights"]
[null,null,null,null,null,"Adjustment ('A')",null,null,null,null,"Adjustment ('A')"]
[null,null,"Adjustment CL",0,0,0,0,0,0,0,0,0,0]
[null,null,"Adjustment PL",0,0,0,0,0,0,0,0,0,0]
[null,null,null,"X Factor",null,null,null,null,"X Factor",null,null,null,null,null,"Days",365,365,365,366,365,365,365,366,365,365,null,null,null,null,null,null,null,null,null,null,null,null,365,365,365,366,365,365,365,366,365,365,null,365,365,365,366,365,365,365,366,365,365]
[null,null,null,1.04E-2,1.04E-2,1.04E-2,1.04E-2,1.04E-2,1.04E-2,1.04E-2,1.04E-2,1.04E-2,1.04E-2,null,"CPI",1.1660979908044509,1.2051418931651063,1.2454930838699401,1.287195334230514,1.3302938811323202,1.3748354761058921,1.4208684360409423,1.4684426955985361,1.5176098613781586,1.5684232678984287]
[null,"Private Contract Lights",null,"Price (cents) per Light per day Real 2021/22 Smoothed",null,null,null,null,"Price (cents) per Light per day Real 2021/22 Smoothed",null,null,null,null,null,null,"Price (cents) per Light per day Nominal Smoothed",null,null,null,null,null,null,null,null,null,null,"Volumes",null,null,null,null,null,null,null,null,null,null,"Smooth Real 2021/22 Cost Dollars Per  Year",null,null,null,null,null,null,null,null,null,null,"Smooth Nominal Cost Dollars Per Year",null,null,null,null,null,null,null,null,null,null,null,"Revenue Real Real Dollars Per Year",null,null,null,null,null,null,null,null,null,null,null,"Revenue Nominal Dollars Per Year",null,null,null,null,"Revenue Nominal Dollars Per Year"]
{"$rows_left_out":151}
{"sheet":"Smoothed Prices","index":3,"n_rows":157,"n_cols":82,"rows_kept":157,"cut":false,"hidden":false,"merged":[[82,72,82,76],[82,77,82,81],[9,15,9,19],[9,26,9,30],[9,37,9,41],[9,48,9,52],[9,60,9,64],[9,72,9,76],[82,2,82,7],[82,26,82,30],[82,37,82,41],[82,48,82,52],[82,60,82,64],[7,3,7,7],[7,8,7,12],[9,3,9,7],[9,8,9,12],[9,77,9,81]]}
[]
[]
[null,null,null,null,null,null,null,null,null,null,null,null,null,null,null,"THIS TAKES 21/22 SMOOTHED PRICES ADDS CPI",null,null,null,null,null,null,null,null,null,null,null,null,null,null,null,null,null,null,null,null,null,"THIS TAKES 18/19 SMOOTHED PRICES  and multiplys by no.days in year/100 to convert $s into cents",null,null,null,null,null,null,null,null,null,null,"THIS TAKES nominal and multiplys by no days in year/100"]
[null,"Private Contract Lights"]
[]
[]
[]
[null,null,null,"X Factor",null,null,null,null,"X Factor",null,null,null,null,null,"Days",365,365,365,366,365,365,365,366,365,365,null,null,null,null,null,null,null,null,null,null,null,null,365,365,365,366,365,365,365,366,365,365,null,365,365,365,366,365,365,365,366,365,365]
[null,null,null,1.04E-2,1.04E-2,1.04E-2,1.04E-2,1.04E-2,1.04E-2,1.04E-2,1.04E-2,1.04E-2,1.04E-2,null,"CPI",1.1660979908044509,1.2051418931651063,1.2454930838699401,1.287195334230514,1.3302938811323202,1.3748354761058921,1.4208684360409423,1.4684426955985361,1.5176098613781586,1.5684232678984287]
[null,"Private Contract Lights",null,"Price (cents) per Light per day Real 2021/22 Smoothed",null,null,null,null,"Price (cents) per Light per day Real 2021/22 Smoothed",null,null,null,null,null,null,"Price (cents) per Light per day Nominal Smoothed",null,null,null,null,null,null,null,null,null,null,"Volumes",null,null,null,null,null,null,null,null,null,null,"Smooth Real 2021/22 Cost Dollars Per  Year",null,null,null,null,null,null,null,null,null,null,"Smooth Nominal Cost Dollars Per Year",null,null,null,null,null,null,null,null,null,null,null,"Revenue Real Real Dollars Per Year",null,null,null,null,null,null,null,null,null,null,null,"Revenue Nominal Dollars Per Year",null,null,null,null,"Revenue Nominal Dollars Per Year"]
{"$rows_left_out":148}
{"sheet":"Unsmoothed Prices","index":4,"n_rows":161,"n_cols":38,"rows_kept":161,"cut":false,"hidden":false,"merged":[[7,2,7,8],[7,15,7,20],[7,27,7,32],[82,2,82,8],[82,15,82,20],[82,27,82,32]]}
[]
[]
[]
[null,"Private Contract Lights"]
[]
[null,null,null,null,null,null,null,null,null,null,null,null,null,null,"Days",null,365,365,365,366,365,365,365,366,365,365]
[null,null,null,2,16,17,18,19,20,21,22,23,24,25]
[null,null,"Price (cents) per Light per day",null,null,null,null,null,null,null,null,null,null,null,null,"Revenue ($m)  - Real",null,null,null,null,null,null,null,null,null,null,null,"Volumes"]
[null,"Private Contract Lights","Offered / No Longer Offered / NA","2023-24","2024-25","2025-26","2026-27","2027-28","2028-29","2029-30","2030-31","2031-32","2032-33","2033-34",null,null,"2024-25","2025-26","2026-27","2027-28","2028-29","2029-30","2030-31","2031-32","2032-33","2033-34",null,null,"2024-25","2025-26","2026-27","2027-28","2028-29","2029-30","2030-31","2031-32","2032-33","2033-34"]
[-0.29013671875000002,"50W Mercury Vapour","Obsolete, no new Connections",20.48,14.538,14.712,15.116,15.077999999999999,15.125999999999999,12.792999999999999,12.8,12.772,12.814,12.821,null,null,3.6295570800000004E-3,1.8364989600000001E-3,0,0,0,0,0,0,0,0,null,null,68.400000000000006,34.200000000000003,0,0,0,0,0,0,0,0]
{"$rows_left_out":152}
{"sheet":"General Inputs","index":5,"n_rows":35,"n_cols":17,"rows_kept":35,"cut":false,"hidden":false,"merged":[]}
[]
[null,null,null,null,null,"Start of Regulatory Control Period"]
["Year Count",null,"Model Start Year","Year 1","Year 2","Year 3","Year 4","Year 5","Year 6","Year 7","Year 8","Year 9","Year 10","Year 11","Year 12","Year 13","Year 14"]
["Year",null,2022,{"$f":"C4+1","v":2023},{"$f":"D4+1","v":2024},2025,2026,2027,2028,2029,2030,2031,2032,2033,2034,2035,2036]
["Financial Year",null,{"$f":"LEFT(C4,2)&RIGHT(C4,2)-1&\"-\"&RIGHT(C4,2)","v":"2021-22"},{"$f":"LEFT(D4,2)&RIGHT(D4,2)-1&\"-\"&RIGHT(D4,2)","v":"2022-23"},"2023-24","2024-25","2025-26","2026-27","2027-28","2028-29","2029-30","2030-31","2031-32","2032-33","2033-34","2034-35","2035-36"]
["End of Financial Year",null,{"$f":"DATE(C$4,6,30)","v":"2022-06-30"},{"$f":"DATE(D$4,6,30)","v":"2023-06-30"},"2024-06-30","2025-06-30","2026-06-30","2027-06-30","2028-06-30","2029-06-30","2030-06-30","2031-06-30","2032-06-30","2033-06-30","2034-06-30","2035-06-30","2036-06-30"]
["Days in the year",null,null,{"$f":"D6-C6","v":365},366,365,365,{"$f":"H6-G6","v":365},{"$f":"I6-H6","v":366},{"$f":"J6-I6","v":365},365,365,366,365,365,365,366]
["Reset Year Counter",null,null,null,null,1,2,3,4,5]
[null,null,{"$f":"C3","v":"Model Start Year"},{"$f":"D3","v":"Year 1"},"Year 2","Year 3","Year 4","Year 5","Year 6","Year 7","Year 8","Year 9","Year 10","Year 11","Year 12","Year 13","Year 14"]
[null,null,{"$f":"C5","v":"2021-22"},{"$f":"D5","v":"2022-23"},"2023-24","2024-25","2025-26","2026-27","2027-28","2028-29","2029-30","2030-31","2031-32","2032-33","2033-34","2034-35","2035-36"]
{"$rows_left_out":26}
{"sheet":"Volumes Input","index":6,"n_rows":146,"n_cols":16,"rows_kept":146,"cut":false,"hidden":false,"merged":[[1,3,1,7]]}
[]
[]
[null,null,null,{"$f":"D4&\" Regulatory Year\"","v":"2024-25 Regulatory Year"},{"$f":"E4&\" Regulatory Year\"","v":"2025-26 Regulatory Year"},"2026-27 Regulatory Year","2027-28 Regulatory Year","2028-29 Regulatory Year","2029-30 Regulatory Year","2030-31 Regulatory Year","2031-32 Regulatory Year","2032-33 Regulatory Year","2033-34 Regulatory Year"]
["Private Contract Lights","Light Description","Dbill code",{"$f":"INDEX('General Inputs'!$C$5:$Q$5,1,MATCH(\"Start of Regulatory Control Period\",'General Inputs'!$C$2:$Q$2,0))","v":"2024-25"},{"$f":"LEFT(D$4,2)&RIGHT(D$4,2)&\"-\"&RIGHT(D$4,2)+1","v":"2025-26"},{"$f":"LEFT(E$4,2)&RIGHT(E$4,2)&\"-\"&RIGHT(E$4,2)+1","v":"2026-27"},"2027-28","2028-29","2029-30","2030-31","2031-32","2032-33","2033-34",null,null,"Check to Unsmoothed Prices"]
[{"$f":"INDEX('[1]Master list'!$B$3:$B$68,MATCH(C5,'[1]Master list'!$A$3:$A$68,0),1)","v":"Mercury Vapour (elliptical) 50"},"50W Mercury Vapour","MV_50_E",68.400000000000006,34.200000000000003,0,0,0,0,0,0,0,0,null,null,{"$f":"VLOOKUP(B5,'Unsmoothed Prices'!$B$10:$B$80,1,FALSE)","v":"50W Mercury Vapour"}]
[{"$f":"INDEX('[1]Master list'!$B$3:$B$68,MATCH(C6,'[1]Master list'!$A$3:$A$68,0),1)","v":"Mercury Vapour (elliptical) 80"},"80W Mercury Vapour","MV_80_E",97.9,48.95,0,0,0,0,0,0,0,0,null,null,{"$f":"VLOOKUP(B6,'Unsmoothed Prices'!$B$10:$B$80,1,FALSE)","v":"80W Mercury Vapour"}]
[{"$f":"INDEX('[1]Master list'!$B$3:$B$68,MATCH(C7,'[1]Master list'!$A$3:$A$68,0),1)","v":"Mercury Vapour (elliptical) 125"},"125W Mercury Vapour","MV_125_E",138.80000000000001,69.400000000000006,0,0,0,0,0,0,0,0,null,null,{"$f":"VLOOKUP(B7,'Unsmoothed Prices'!$B$10:$B$80,1,FALSE)","v":"125W Mercury Vapour"}]
[{"$f":"INDEX('[1]Master list'!$B$3:$B$68,MATCH(C8,'[1]Master list'!$A$3:$A$68,0),1)","v":"Mercury Vapour (elliptical) 250"},"250W Mercury Vapour","MV_250_E",11.200000000000001,5.6000000000000005,0,0,0,0,0,0,0,0,null,null,{"$f":"VLOOKUP(B8,'Unsmoothed Prices'!$B$10:$B$80,1,FALSE)","v":"250W Mercury Vapour"}]
[{"$f":"INDEX('[1]Master list'!$B$3:$B$68,MATCH(C9,'[1]Master list'!$A$3:$A$68,0),1)","v":"Mercury Vapour (tubular) 250"},"250W Mercury Vapour","MV_250_T",0,0,0,0,0,0,0,0,0,0,null,null,{"$f":"VLOOKUP(B9,'Unsmoothed Prices'!$B$10:$B$80,1,FALSE)","v":"250W Mercury Vapour"}]
[{"$f":"INDEX('[1]Master list'!$B$3:$B$68,MATCH(C10,'[1]Master list'!$A$3:$A$68,0),1)","v":"Mercury Vapour (elliptical) 400"},"400W Mercury Vapour","MV_400_E",10.4,5.2,0,0,0,0,0,0,0,0,null,null,{"$f":"VLOOKUP(B10,'Unsmoothed Prices'!$B$10:$B$80,1,FALSE)","v":"400W Mercury Vapour"}]
{"$rows_left_out":137}
{"sheet":"RAB Input","index":7,"n_rows":62,"n_cols":10,"rows_kept":62,"cut":false,"hidden":false,"merged":[]}
[]
[]
[null,"Opening Regulatory Asset Base for 2021-22 ($m Nominal)","Opening Asset Value 2018-19 ($m Nominal) per R19 Final Decision","Average Remaining Life (Year) per R19 Decision","Opening Asset Value 2021-22 ($ Nominal) for R24 Modelling per RFM","Average Remaining Life (Year) for R24 per RFM","Standard Life (Year)","Opening Tax Value","Average Tax Remaining Life (Year)","Tax Standard Life (Year)"]
[null,"Spare Parts",0,"N/A",null,"N/A",5]
[null,"Motor Vehicles",323270.78237482277,4.6592782087319993,{"$f":"0.377695454554945*10^6","v":377695.454554945},4.5355088409034794,6]
[null,"Minor Assets",2371072.5227475758,3.977220119552209,{"$f":"1.76910091769034*10^6","v":1769100.91769034},3.8633226441847439,5]
[null,"NEM Assets",-5959.6732853384601,1,0,{"$f":"E42","v":0},5]
[null,"Streetlights"]
[null,"Non-System Property",206846.28634556208,42.494829550993522,{"$f":"0.200945954810357*10^6","v":200945.95481035701},38.869293429006376,40]
[null,"Business Management Systems",0,null,null,null,10]
{"$rows_left_out":53}
{"sheet":"Overhead & NonNetwork Input","index":8,"n_rows":45,"n_cols":12,"rows_kept":45,"cut":false,"hidden":false,"merged":[]}
[]
[null,null,"2024-25","2025-26","2026-27","2027-28","2028-29","2029-30","2030-31","2031-32","2032-33","2033-34"]
["Direct Opex per Program of Work","RLBLR",57000,142500,356250,356250,356250,356250,356250,356250,356250,356250]
["Indirect Opex per Program of Work","RLICM",47000,47000,47000,47000,47000,47000,47000,47000,47000,47000]
["Indirect Opex per Program of Work","RLDEC",350000,350000,350000,350000,350000,350000,350000,350000,350000,350000]
["Direct Opex per Program of Work","RLREM",128000,128000,128000,128000,128000,128000,128000,128000,128000,128000]
["Direct Opex per Program of Work","RLREM",210000,210000,210000,210000,210000,210000,210000,210000,210000,210000]
["Opex Overheads",null,{"$f":"SUM(C3:C7)*0.35","v":277200},{"$f":"SUM(D3:D7)*0.35","v":307125},381937.5,381937.5,381937.5,381937.5,381937.5,381937.5,381937.5,381937.5]
[]
["Direct Capex per Program of Work","RLMAJ",1982300,1982300,1982300,1982300,778300,778300,778300,778300,778300,778300]
{"$rows_left_out":35}