{"text_format":"1","workbook":"xlsx","n_sheets":4,"sheets":["Schema","Setup","Instructions","Data"],"not_rendered":{"charts":0,"images":1,"macros":1,"external_links":0,"defined_names":3,"comments":0,"pivot_tables":0},"unopened":[],"bounds":{"document_bytes":16777216,"sheet_cells":100000,"rows_first":2000,"rows_last":500,"rows_between":2000,"halvings":0,"cell_chars":16384,"cell_head_chars":4096},"cells_cut":0,"cells_raw":0,"read":"whole","date_system":"1900"}

{"sheet":"Schema","index":0,"n_rows":124,"n_cols":1,"rows_kept":124,"cut":false,"hidden":true,"merged":[]}
["<xs:schema xmlns:xs=\"http://www.w3.org/2001/XMLSchema\" xmlns:xdb=\"http://xmlns.oracle.com/xdb\" xdb:storeVarrayAsTable=\"true\">"]
[]
["<!--Define exclusion clause element-->"]
["<xs:simpleType name=\"extype\">"]
["<xs:restriction base=\"xs:string\">"]
["<xs:pattern value=\"[1-7]?|9|(8\\([a-f]\\))|(99)\" />"]
["</xs:restriction>"]
["</xs:simpleType>"]
[]
["<!--Define marginal value element-->"]
["<xs:simpleType name=\"mvtype\">"]
["<xs:restriction base=\"xs:decimal\">"]
["<xs:fractionDigits value=\"5\" />"]
["</xs:restriction>"]
["</xs:simpleType>"]
[]
["<!--Define TNSP element-->"]
["<xs:simpleType name=\"tnsptype\">"]
["<xs:restriction base=\"xs:string\">"]
["<xs:enumeration value=\"ELECTRANET\" />"]
["<xs:enumeration value=\"TRANSGRID\" />"]
["<xs:enumeration value=\"TRANSEND\" />"]
["<xs:enumeration value=\"POWERLINK\" />"]
["<xs:enumeration value=\"SP AUSNET\" />"]
["<xs:enumeration value=\"MURRAYLINK\" />"]
["<xs:enumeration value=\"DIRECTLINK\" />"]
["</xs:restriction>"]
["</xs:simpleType>"]
[]
["<!--Define network condition classifications-->"]
["<xs:simpleType name=\"constrainttype\">"]
["<xs:restriction base=\"xs:string\">"]
["<xs:enumeration value=\"SYSTEM NORMAL\" />"]
["<xs:enumeration value=\"OUTAGE\" />"]
["</xs:restriction>"]
["</xs:simpleType>"]
[]
["<!--Define sub category type for classification-->"]
["<xs:simpleType name=\"subcattype\">"]
["<xs:restriction base=\"xs:string\">"]
["<xs:enumeration value=\"NRM\" />"]
["<xs:enumeration value=\"NSA\" />"]
["<xs:enumeration value=\"RAMP\" />"]
["<xs:enumeration value=\"FCAS\" />"]
["<xs:enumeration value=\"RECLASS\" />"]
["<xs:enumeration value=\"NC\" />"]
["<xs:enumeration value=\"DIRECTION\" />"]
["<xs:enumeration value=\"MII\" />"]
["<xs:enumeration value=\"OTHER\" />"]
["</xs:restriction>"]
["</xs:simpleType>"]
[]
["<!--Define asset class type-->"]
["<xs:simpleType name=\"assettype\">"]
["<xs:restriction base=\"xs:string\">"]
["<xs:enumeration value=\"REGULATED\" />"]
["<xs:enumeration value=\"NON-REGULATED\" />"]
["</xs:restriction>"]
["</xs:simpleType>"]
[]
{"$rows_left_out":65}
{"sheet":"Setup","index":1,"n_rows":8,"n_cols":8,"rows_kept":8,"cut":false,"hidden":true,"merged":[]}
["TNSP","SCHEME","ENUMERATORS","CDATA","SUBMISSION_ID","TEMPLATEVER","EXCELVER","OSVER"]
["DIRECTLINK",2,"CLASSIFICATION","CONSTRAINTID",{"$f":"Instructions!$O$10 & \"V\" & TEXT(Instructions!$O$11,\"#\") & \"_\" &TEXT(Instructions!$O$17,\"YYYYMMDDHHMMSS\")","v":"TRANSENDV4_19000100000000"},"AERMIC_VER2",{"$f":"INFO(\"RELEASE\")","v":"14.0"},{"$f":"INFO(\"OSVERSION\")","v":"Windows (32-bit) NT 6.01"}]
["ELECTRANET",3,"SUB CATEGORY","DESCRIPTION"]
["MURRAYLINK",4,"ASSET CLASS","EQUIPMENTNAME"]
["POWERLINK",null,null,"EXCLUSION_DETAIL"]
["SP AUSNET",null,null,"TNSP_COMMENT"]
["TRANSEND"]
["TRANSGRID"]

{"sheet":"Instructions","index":2,"n_rows":65,"n_cols":15,"rows_kept":65,"cut":false,"hidden":false,"merged":[[8,10,8,15],[0,5,0,22],[7,5,7,22],[33,6,33,22],[21,5,21,22],[22,5,22,22],[23,5,23,22],[24,5,24,22],[26,5,26,22],[29,6,29,22],[30,6,30,22],[31,6,31,22],[32,6,32,22],[13,11,13,13],[14,11,14,13],[9,11,9,13],[45,6,45,22],[10,11,10,13],[40,6,40,22],[41,6,41,22],[42,6,42,22],[43,6,43,22],[11,11,11,13],[16,11,16,13],[34,6,34,22],[44,6,44,22],[35,6,35,22],[36,6,36,22],[37,6,37,22],[38,6,38,22],[39,6,39,22],[64,6,64,22],[69,5,69,22],[58,6,58,22],[59,6,59,22],[60,6,60,22],[61,6,61,22],[62,6,62,22],[63,6,63,22],[57,6,57,22],[46,6,46,22],[47,6,47,22],[48,6,48,22],[49,6,49,22],[50,6,50,22],[56,6,56,22],[51,6,51,22],[52,6,52,22],[53,6,53,22],[54,6,54,22],[55,6,55,22]]}
[]
[]
[]
[]
[]
[]
[]
[null,null,null,null,null,"Market Impact Parameter Data Template"]
[null,null,null,null,null,null,null,null,null,null,"Please complete these details prior to data validation"]
[null,null,null,null,null,null,null,null,null,null,null,"TNSP",null,null,"TRANSEND"]
[null,null,null,null,null,null,null,null,null,null,null,"Scheme Version",null,null,4]
[null,null,null,null,null,null,null,null,null,null,null,"Performance Year",null,null,2011]
[]
[null,null,null,null,null,null,null,null,null,null,null,"Performance measure",null,null,{"$f":"SUM(Data!$O:$O)","v":729}]
[null,null,null,null,null,null,null,null,null,null,null,"Exclusion count",null,null,{"$f":"COUNTIFS(Data!$M$2:$M$1048576,\"<>99\",Data!$M$2:$M$1048576,\"<>\")","v":11}]
[]
[null,null,null,null,null,null,null,null,null,null,null,"Last successful validation "]
[]
[]
[]
[]
[null,null,null,null,null,"TEMPLATE INSTRUCTIONS"]
[null,null,null,null,null,"TNSP must provide performance data in this workbook in the Data tab. The data submitted must conform to the data field requirements detailed below and must be validated prior to the data being submitted to the AER for assessment. TNSP is able to provide additional tabs in the workbook for the AER reference.  "]
[null,null,null,null,null,"Please provide ALL binding constraints with a marginal cost greater than $10 and is used to manage TNSP's network. The data is submitted on a 5 minute resolution and  sourced from the MCC_Constraintsolution table.   The TNSP is able to enter the exclusion clause number in the 'EXCLUSION CODE' field. Please use the code '99' for non-inclusion dispatch intervals."]
[null,null,null,null,null,"NOTE: All dispatch intervals with a marginal value greater than $10/MWh, classified as an OUTAGE and with no exclusion clause, will be used to calculate the TNSP's performance measure. "]
[]
[null,null,null,null,null,"When all data has been recorded in the Data tab, click the 'Validate Data' button to validate the data and resolve any issues prior to submission"]
[]
[null,null,null,null,null,"Description of fields:"]
[null,null,null,null,null,"Settlementdate ","Settlement date/time of the binding network constraint as detailed in the MCC_Constraintsolution table (MCC table) published in the AEMO Market Management System"]
[null,null,null,null,null,"Constraint ID","Constraint identifier as detailed in the MCC table"]
[null,null,null,null,null,"Effective date","Effective date of the relevant binding network constraint, for the relevant settlement date/time"]
[null,null,null,null,null,"Version number","Version number of the relevant binding network constraint, for the relevant settlement date/time"]
[null,null,null,null,null,"Marginal value","Marginal value of the relevant binding network constraint, for the relevant settlement date time"]
[null,null,null,null,null,"Constraint description","Description of the binding network constraint "]
[null,null,null,null,null,"Network condition","Classification of the network constraint as \"System Normal\" or \"Outage\" constraint"]
[null,null,null,null,null,"Category","Additional categorisation of the network constraint as one of:"]
[null,null,null,null,null,null,"NRM (negative residues management) "]
[null,null,null,null,null,null,"NSA (network support agreement)  - must have an associated exclusion code value of 7"]
[null,null,null,null,null,null,"RAMP( ramping constraint) - must have an associated weighting value of 0"]
[null,null,null,null,null,null,"FCAS (frequency control constraint)"]
[null,null,null,null,null,null,"RECLASS (reclassification) - must have an associated exclusion code value of 2"]
[null,null,null,null,null,null,"NC (non-conformance)"]
[null,null,null,null,null,null,"DIRECTION (AEMO direction)"]
[null,null,null,null,null,null,"MII (manifestly incorrect input) - must have an associated exclusion code value of 8(a)"]
[null,null,null,null,null,null,"OTHER (none of the above)"]
[null,null,null,null,null,"Outage equipment ","The equipment that the constraint is used to manage"]
[null,null,null,null,null,"Asset class","Identify whether the equipment is either a regulated asset or non-regulated asset (accepted values: Regulated | Non-Regulated). If the outage is related to non-regulated assets, TNSP must enter exclusion code 4."]
[null,null,null,null,null,"Exclusion code ","Provide the relevant exclusion code under version 2, 3 or 4 of the scheme in the specified format. Valid exclusion codes are: "]
[null,null,null,null,null,null,"1 to 7"]
[null,null,null,null,null,null,"8(a)"]
[null,null,null,null,null,null,"8(b)"]
[null,null,null,null,null,null,"8(c) "]
[null,null,null,null,null,null,"8(d)"]
[null,null,null,null,null,null,"8(e)"]
[null,null,null,null,null,null,"8(f)"]
[null,null,null,null,null,null,"9 (only valid in version 4)"]
[null,null,null,null,null,null,"99(non-inclusion)"]
[null,null,null,null,null,"Exclusion detail","Free text for TNSP to provide details on the exclusion claim (i.e reference to supportive evidence, or outage details)"]
[null,null,null,null,null,"Weighting ","The following values are valid for weighting:"]
{"$rows_left_out":6}
{"sheet":"Data","index":3,"n_rows":916,"n_cols":16,"rows_kept":916,"cut":false,"hidden":false,"merged":[]}
["OUTAGE ID","SUBMISSION ID","SETTLEMENT DATE","CONSTRAINT ID","EFFECTIVE DATE","VERSION NUMBER","MARGINAL VALUE","CONSTRAINT DESCRIPTION","NETWORK CONDITION","CATEGORY","OUTAGE EQUIPMENT","ASSET CLASS","EXCLUSION CODE","EXCLUSION DETAIL","WEIGHTING","TNSP COMMENT"]
[null,null,"2011-01-21T09:05:00","T_FASH_MIN_RC1","n/a",1,24,"Minimum limit on Reece 1 for Farrell to Sheffield outages to allow PSS to be in service","Outage","Other","SH-FA 1 220 kV Transmission Circuit","Regulated",null,null,1]
[null,null,"2011-01-21T09:10:00","T_FASH_MIN_RC1","n/a",1,23.58,"Minimum limit on Reece 1 for Farrell to Sheffield outages to allow PSS to be in service","Outage","Other","SH-FA 1 220 kV Transmission Circuit","Regulated",null,null,1]
[null,null,"2011-01-21T09:15:00","T_FASH_MIN_RC1","n/a",1,23.47,"Minimum limit on Reece 1 for Farrell to Sheffield outages to allow PSS to be in service","Outage","Other","SH-FA 1 220 kV Transmission Circuit","Regulated",null,null,1]
[null,null,"2011-01-21T09:20:00","T_FASH_MIN_RC1","n/a",1,23.66,"Minimum limit on Reece 1 for Farrell to Sheffield outages to allow PSS to be in service","Outage","Other","SH-FA 1 220 kV Transmission Circuit","Regulated",null,null,1]
[null,null,"2011-01-21T09:25:00","T_FASH_MIN_RC1","n/a",1,24.9,"Minimum limit on Reece 1 for Farrell to Sheffield outages to allow PSS to be in service","Outage","Other","SH-FA 1 220 kV Transmission Circuit","Regulated",null,null,1]
[null,null,"2011-01-21T09:30:00","T_FASH_MIN_RC1","n/a",1,250000,"Minimum limit on Reece 1 for Farrell to Sheffield outages to allow PSS to be in service","Outage","Other","SH-FA 1 220 kV Transmission Circuit","Regulated",null,null,1]
[null,null,"2011-01-21T09:35:00","T_FASH_MIN_RC1","n/a",1,250000,"Minimum limit on Reece 1 for Farrell to Sheffield outages to allow PSS to be in service","Outage","Other","SH-FA 1 220 kV Transmission Circuit","Regulated",null,null,1]
[null,null,"2011-01-21T09:40:00","T_FASH_MIN_RC1","n/a",1,25.1,"Minimum limit on Reece 1 for Farrell to Sheffield outages to allow PSS to be in service","Outage","Other","SH-FA 1 220 kV Transmission Circuit","Regulated",null,null,1]
[null,null,"2011-02-09T11:55:00","T_GO13_250","n/a",1,-35.04,"Out = Gordon CB C752, discretionary 250 MW upper limit on Gordon Unit 1 & 3 combined generation","Outage","Other","GO 220 kV C7 Bus Coupler Circuit","Regulated",null,null,1]
[null,null,"2011-02-09T12:00:00","T_GO13_250","n/a",1,-231.16,"Out = Gordon CB C752, discretionary 250 MW upper limit on Gordon Unit 1 & 3 combined generation","Outage","Other","GO 220 kV C7 Bus Coupler Circuit","Regulated",null,null,1]
[null,null,"2011-02-09T12:05:00","T_GO13_250","n/a",1,-53.73,"Out = Gordon CB C752, discretionary 250 MW upper limit on Gordon Unit 1 & 3 combined generation","Outage","Other","GO 220 kV C7 Bus Coupler Circuit","Regulated",null,null,1]
[null,null,"2011-02-17T12:40:00","T>T_LIPM_110_2A","n/a",1,520.33000000000004,"Out = Liapootah to Palmerston line, avoid O/L the Palmerston to Waddamana line (flow to North) for loss of the other Liapootah to Palmerston line","System Normal","Other","nil","n/a","8b","No outage of LI-PM circuits at this time",0]
[null,null,"2011-02-17T12:45:00","T>T_LIPM_110_2A","n/a",1,522.62,"Out = Liapootah to Palmerston line, avoid O/L the Palmerston to Waddamana line (flow to North) for loss of the other Liapootah to Palmerston line","System Normal","Other","nil","n/a","8b","No outage of LI-PM circuits at this time",0]
[null,null,"2011-02-17T12:50:00","T>T_LIPM_110_2A","n/a",1,524.35,"Out = Liapootah to Palmerston line, avoid O/L the Palmerston to Waddamana line (flow to North) for loss of the other Liapootah to Palmerston line","System Normal","Other","nil","n/a","8b","No outage of LI-PM circuits at this time",0]
[null,null,"2011-02-17T12:55:00","T>T_LIPM_110_2A","n/a",1,523.45000000000005,"Out = Liapootah to Palmerston line, avoid O/L the Palmerston to Waddamana line (flow to North) for loss of the other Liapootah to Palmerston line","System Normal","Other","nil","n/a","8b","No outage of LI-PM circuits at this time",0]
[null,null,"2011-02-17T13:00:00","T>T_LIPM_110_2A","n/a",1,522.9,"Out = Liapootah to Palmerston line, avoid O/L the Palmerston to Waddamana line (flow to North) for loss of the other Liapootah to Palmerston line","System Normal","Other","nil","n/a","8b","No outage of LI-PM circuits at this time",0]
[null,null,"2011-02-17T13:05:00","T>T_LIPM_110_2A","n/a",1,522.03,"Out = Liapootah to Palmerston line, avoid O/L the Palmerston to Waddamana line (flow to North) for loss of the other Liapootah to Palmerston line","System Normal","Other","nil","n/a","8b","No outage of LI-PM circuits at this time",0]
[null,null,"2011-02-17T13:10:00","T>T_LIPM_110_2A","n/a",1,520.87,"Out = Liapootah to Palmerston line, avoid O/L the Palmerston to Waddamana line (flow to North) for loss of the other Liapootah to Palmerston line","System Normal","Other","nil","n/a","8b","No outage of LI-PM circuits at this time",0]
[null,null,"2011-02-17T13:15:00","T>T_LIPM_110_2A","n/a",1,519.6,"Out = Liapootah to Palmerston line, avoid O/L the Palmerston to Waddamana line (flow to North) for loss of the other Liapootah to Palmerston line","System Normal","Other","nil","n/a","8b","No outage of LI-PM circuits at this time",0]
[null,null,"2011-02-17T13:20:00","T>T_LIPM_110_2A","n/a",1,518.6,"Out = Liapootah to Palmerston line, avoid O/L the Palmerston to Waddamana line (flow to North) for loss of the other Liapootah to Palmerston line","System Normal","Other","nil","n/a","8b","No outage of LI-PM circuits at this time",0]
[null,null,"2011-02-17T13:25:00","T>T_LIPM_110_2A","n/a",1,517.55999999999995,"Out = Liapootah to Palmerston line, avoid O/L the Palmerston to Waddamana line (flow to North) for loss of the other Liapootah to Palmerston line","System Normal","Other","nil","n/a","8b","No outage of LI-PM circuits at this time",0]
[null,null,"2011-02-17T13:30:00","T>T_LIPM_110_2A","n/a",1,516.04,"Out = Liapootah to Palmerston line, avoid O/L the Palmerston to Waddamana line (flow to North) for loss of the other Liapootah to Palmerston line","System Normal","Other","nil","n/a","8b","No outage of LI-PM circuits at this time",0]
[null,null,"2011-03-08T08:15:00","T>T_BWWA_110_7B","n/a",2,-26.19,"Out = Bridgewater to Waddamana 110kV line, avoid O/L Tungatinah to Tarraleah No. 2 110 kV line for loss of the Tungatinah to Tarraleah No. 1 110 kV line. Feedback","Outage","Other","WA-BW 110 kV Transmission Circuit","Regulated",null,null,1]
[null,null,"2011-03-08T09:10:00","T>T_BWWA_110_6","n/a",2,-26.12,"Out = Bridgewater to Waddamana 110kV line, avoid O/L the Tarraleah to New Norfolk No.2 110 kV (flow to South) line for loss of the Meadowbank to New Norfolk 110 kV line. Feedback","Outage","Other","WA-BW 110 kV Transmission Circuit","Regulated",null,null,1]
[null,null,"2011-03-08T11:40:00","T>T_BWWA_110_6","n/a",2,-12.93,"Out = Bridgewater to Waddamana 110kV line, avoid O/L the Tarraleah to New Norfolk No.2 110 kV (flow to South) line for loss of the Meadowbank to New Norfolk 110 kV line. Feedback","Outage","Other","WA-BW 110 kV Transmission Circuit","Regulated",null,null,1]
[null,null,"2011-03-08T11:45:00","T>T_BWWA_110_6","n/a",2,-12.42,"Out = Bridgewater to Waddamana 110kV line, avoid O/L the Tarraleah to New Norfolk No.2 110 kV (flow to South) line for loss of the Meadowbank to New Norfolk 110 kV line. Feedback","Outage","Other","WA-BW 110 kV Transmission Circuit","Regulated",null,null,1]
[null,null,"2011-03-08T11:50:00","T>T_BWWA_110_7B","n/a",2,-11.1,"Out = Bridgewater to Waddamana 110kV line, avoid O/L Tungatinah to Tarraleah No. 2 110 kV line for loss of the Tungatinah to Tarraleah No. 1 110 kV line. Feedback","Outage","Other","WA-BW 110 kV Transmission Circuit","Regulated",null,null,1]
[null,null,"2011-03-09T07:15:00","T>T_BWWA_110_7B","n/a",2,-11.04,"Out = Bridgewater to Waddamana 110kV line, avoid O/L Tungatinah to Tarraleah No. 2 110 kV line for loss of the Tungatinah to Tarraleah No. 1 110 kV line. Feedback","Outage","Other","WA-BW 110 kV Transmission Circuit","Regulated",null,null,1]
[null,null,"2011-03-09T09:00:00","T>T_BWWA_110_6","n/a",2,-12.32,"Out = Bridgewater to Waddamana 110kV line, avoid O/L the Tarraleah to New Norfolk No.2 110 kV (flow to South) line for loss of the Meadowbank to New Norfolk 110 kV line. Feedback","Outage","Other","WA-BW 110 kV Transmission Circuit","Regulated",null,null,1]
[null,null,"2011-03-09T09:25:00","T>T_BWWA_110_6","n/a",2,-16.03,"Out = Bridgewater to Waddamana 110kV line, avoid O/L the Tarraleah to New Norfolk No.2 110 kV (flow to South) line for loss of the Meadowbank to New Norfolk 110 kV line. Feedback","Outage","Other","WA-BW 110 kV Transmission Circuit","Regulated",null,null,1]
[null,null,"2011-03-28T19:15:00","F_T+FASH1_B_RREG","n/a",2,-13.34,"Out = Farrell to Sheffield No.1 or 2 line, Bastyan, Reece 1 & 2 and Tribute Raise Regulation Requirement = 0, Note Farrell 220kV bus configured as per OAN 180","Outage","FCAS","SH-FA 2 220 kV Transmission Circuit","Regulated",null,null,1]
[null,null,"2011-04-13T11:50:00","T>T_LIPM_110_2","n/a",2,-250000,"Out = Liapootah to Palmerston 220 kV line, avoid O/L the Palmerston to Waddamana 110 kV line (flow to South) for loss of the other Liapootah to Palmerston 220 kV line, feedback","Outage","Other","LI-WA-PM 2 220 kV Transmission Circuit","Regulated",null,null,1]
[null,null,"2011-04-13T11:55:00","T>T_LIPM_110_2","n/a",2,-44.11,"Out = Liapootah to Palmerston 220 kV line, avoid O/L the Palmerston to Waddamana 110 kV line (flow to South) for loss of the other Liapootah to Palmerston 220 kV line, feedback","Outage","Other","LI-WA-PM 2 220 kV Transmission Circuit","Regulated",null,null,1]
[null,null,"2011-04-13T12:00:00","T>T_LIPM_110_2","n/a",2,-39.880000000000003,"Out = Liapootah to Palmerston 220 kV line, avoid O/L the Palmerston to Waddamana 110 kV line (flow to South) for loss of the other Liapootah to Palmerston 220 kV line, feedback","Outage","Other","LI-WA-PM 2 220 kV Transmission Circuit","Regulated",null,null,1]
[null,null,"2011-05-03T08:15:00","T_GO23_250","n/a",1,-37.6,"Out = Gordon CB A752, discretionary 250 MW upper limit on Gordon Unit 2 & 3 combined generation","Outage","Other","GO 220 kV A7 Bus Coupler Circuit","Regulated",null,null,1]
[null,null,"2011-05-03T08:20:00","T_GO23_250","n/a",1,-38.6,"Out = Gordon CB A752, discretionary 250 MW upper limit on Gordon Unit 2 & 3 combined generation","Outage","Other","GO 220 kV A7 Bus Coupler Circuit","Regulated",null,null,1]
[null,null,"2011-05-03T08:35:00","T_GO23_250","n/a",1,-10.029999999999999,"Out = Gordon CB A752, discretionary 250 MW upper limit on Gordon Unit 2 & 3 combined generation","Outage","Other","GO 220 kV A7 Bus Coupler Circuit","Regulated",null,null,1]
[null,null,"2011-05-03T09:50:00","T_GO23_250","n/a",1,-10.27,"Out = Gordon CB A752, discretionary 250 MW upper limit on Gordon Unit 2 & 3 combined generation","Outage","Other","GO 220 kV A7 Bus Coupler Circuit","Regulated",null,null,1]
[null,null,"2011-05-03T10:15:00","T_GO23_250","n/a",1,-17.649999999999999,"Out = Gordon CB A752, discretionary 250 MW upper limit on Gordon Unit 2 & 3 combined generation","Outage","Other","GO 220 kV A7 Bus Coupler Circuit","Regulated",null,null,1]
[null,null,"2011-05-03T10:20:00","T_GO23_250","n/a",1,-14.54,"Out = Gordon CB A752, discretionary 250 MW upper limit on Gordon Unit 2 & 3 combined generation","Outage","Other","GO 220 kV A7 Bus Coupler Circuit","Regulated",null,null,1]
[null,null,"2011-05-03T10:30:00","T_GO23_250","n/a",1,-10.86,"Out = Gordon CB A752, discretionary 250 MW upper limit on Gordon Unit 2 & 3 combined generation","Outage","Other","GO 220 kV A7 Bus Coupler Circuit","Regulated",null,null,1]
[null,null,"2011-05-03T10:40:00","T_GO23_250","n/a",1,-14.54,"Out = Gordon CB A752, discretionary 250 MW upper limit on Gordon Unit 2 & 3 combined generation","Outage","Other","GO 220 kV A7 Bus Coupler Circuit","Regulated",null,null,1]
[null,null,"2011-05-03T11:00:00","T_GO23_250","n/a",1,-14.76,"Out = Gordon CB A752, discretionary 250 MW upper limit on Gordon Unit 2 & 3 combined generation","Outage","Other","GO 220 kV A7 Bus Coupler Circuit","Regulated",null,null,1]
[null,null,"2011-05-03T11:05:00","T_GO23_250","n/a",1,-14.72,"Out = Gordon CB A752, discretionary 250 MW upper limit on Gordon Unit 2 & 3 combined generation","Outage","Other","GO 220 kV A7 Bus Coupler Circuit","Regulated",null,null,1]
[null,null,"2011-05-03T11:15:00","T_GO23_250","n/a",1,-14.69,"Out = Gordon CB A752, discretionary 250 MW upper limit on Gordon Unit 2 & 3 combined generation","Outage","Other","GO 220 kV A7 Bus Coupler Circuit","Regulated",null,null,1]
[null,null,"2011-05-03T13:15:00","T_GO23_250","n/a",1,-14.19,"Out = Gordon CB A752, discretionary 250 MW upper limit on Gordon Unit 2 & 3 combined generation","Outage","Other","GO 220 kV A7 Bus Coupler Circuit","Regulated",null,null,1]
[null,null,"2011-05-03T13:35:00","T_GO23_250","n/a",1,-14.71,"Out = Gordon CB A752, discretionary 250 MW upper limit on Gordon Unit 2 & 3 combined generation","Outage","Other","GO 220 kV A7 Bus Coupler Circuit","Regulated",null,null,1]
[null,null,"2011-05-03T13:50:00","T_GO23_250","n/a",1,-12.81,"Out = Gordon CB A752, discretionary 250 MW upper limit on Gordon Unit 2 & 3 combined generation","Outage","Other","GO 220 kV A7 Bus Coupler Circuit","Regulated",null,null,1]
[null,null,"2011-05-03T17:50:00","T_GO23_250","n/a",1,-26.65,"Out = Gordon CB A752, discretionary 250 MW upper limit on Gordon Unit 2 & 3 combined generation","Outage","Other","GO 220 kV A7 Bus Coupler Circuit","Regulated",null,null,1]
[null,null,"2011-05-03T17:55:00","T_GO23_250","n/a",1,-20.91,"Out = Gordon CB A752, discretionary 250 MW upper limit on Gordon Unit 2 & 3 combined generation","Outage","Other","GO 220 kV A7 Bus Coupler Circuit","Regulated",null,null,1]
[null,null,"2011-05-03T18:00:00","T_GO23_250","n/a",1,-26.96,"Out = Gordon CB A752, discretionary 250 MW upper limit on Gordon Unit 2 & 3 combined generation","Outage","Other","GO 220 kV A7 Bus Coupler Circuit","Regulated",null,null,1]
[null,null,"2011-05-03T18:05:00","T_GO23_250","n/a",1,-39.54,"Out = Gordon CB A752, discretionary 250 MW upper limit on Gordon Unit 2 & 3 combined generation","Outage","Other","GO 220 kV A7 Bus Coupler Circuit","Regulated",null,null,1]
[null,null,"2011-05-03T18:10:00","T_GO23_250","n/a",1,-22.18,"Out = Gordon CB A752, discretionary 250 MW upper limit on Gordon Unit 2 & 3 combined generation","Outage","Other","GO 220 kV A7 Bus Coupler Circuit","Regulated",null,null,1]
[null,null,"2011-05-03T18:15:00","T_GO23_250","n/a",1,-38.840000000000003,"Out = Gordon CB A752, discretionary 250 MW upper limit on Gordon Unit 2 & 3 combined generation","Outage","Other","GO 220 kV A7 Bus Coupler Circuit","Regulated",null,null,1]
[null,null,"2011-05-03T18:20:00","T_GO23_250","n/a",1,-11.56,"Out = Gordon CB A752, discretionary 250 MW upper limit on Gordon Unit 2 & 3 combined generation","Outage","Other","GO 220 kV A7 Bus Coupler Circuit","Regulated",null,null,1]
[null,null,"2011-05-03T18:25:00","T_GO23_250","n/a",1,-30.03,"Out = Gordon CB A752, discretionary 250 MW upper limit on Gordon Unit 2 & 3 combined generation","Outage","Other","GO 220 kV A7 Bus Coupler Circuit","Regulated",null,null,1]
[null,null,"2011-05-03T18:35:00","T_GO23_250","n/a",1,-23.62,"Out = Gordon CB A752, discretionary 250 MW upper limit on Gordon Unit 2 & 3 combined generation","Outage","Other","GO 220 kV A7 Bus Coupler Circuit","Regulated",null,null,1]
[null,null,"2011-05-04T06:50:00","T_GO23_250","n/a",1,-12.94,"Out = Gordon CB A752, discretionary 250 MW upper limit on Gordon Unit 2 & 3 combined generation","Outage","Other","GO 220 kV A7 Bus Coupler Circuit","Regulated",null,null,1]
[null,null,"2011-05-04T14:50:00","T_GO23_250","n/a",1,-34.520000000000003,"Out = Gordon CB A752, discretionary 250 MW upper limit on Gordon Unit 2 & 3 combined generation","Outage","Other","GO 220 kV A7 Bus Coupler Circuit","Regulated",null,null,1]
{"$rows_left_out":856}