{"text_format":"1","workbook":"xlsx","n_sheets":15,"sheets":["Legend","Inflation","Historical Expenditure-Volumes","Historical Contributions","ACIF Growth Figures","Major Projects","Function Code Mapping","Growth Rates","Unit Rates","Forecast Expenditure-Volumes","Forecast Contributions","Forecast Contributions-AER DD","Expenditure & Volume Output","Gross Capex","Gross Capex-AER DD"],"not_rendered":{"charts":0,"images":0,"macros":0,"external_links":0,"defined_names":0,"comments":0,"pivot_tables":0},"unopened":[],"bounds":{"document_bytes":16777216,"sheet_cells":100000,"rows_first":2000,"rows_last":500,"rows_between":2000,"halvings":0,"cell_chars":16384,"cell_head_chars":4096},"cells_cut":0,"cells_raw":0,"read":"whole","date_system":"1900"}

{"sheet":"Legend","index":0,"n_rows":48,"n_cols":8,"rows_kept":48,"cut":false,"hidden":false,"merged":[]}
[]
[null,"Style legend",null,null,null,null,null,"Menu"]
[]
[]
[]
[null,"Style",null,"Design",null,"Comment"]
[]
[null,"Header1",null,"Header1"]
{"$rows_left_out":41}
{"sheet":"Inflation","index":1,"n_rows":12,"n_cols":13,"rows_kept":12,"cut":false,"hidden":false,"merged":[]}
["United Energy - Connections",null,null,null,null,null,"AER draft decision",null,null,null,null,null,"Menu"]
[{"$f":"RIGHT(CELL(\"filename\", $A$1), LEN(CELL(\"filename\", $A$1)) - SEARCH(\"]\", CELL(\"filename\", $A$1)))","v":"Inflation"},null,null,null,null,null,"RRP change",null,null,null,null,"Sheet Check",{"$f":"IF(COUNTIF(C9:M9,\"=0\")>0,\"Check!\",\"OK\")","v":"OK"}]
[]
[null,"Output Year",2021]
[]
[null,{"$f":"\"Inflation Rates and Conversion factor to\" & \" June \" &C4","v":"Inflation Rates and Conversion factor to June 2021"}]
[null,"Financial Year","FY11/12","FY12/13","FY13/14","FY14/15","FY15/16","FY16/17","FY17/18","FY18/19","FY19/20","FY20/21","FY21/22"]
[null,"Calendar Year",2011,{"$f":"C8+1","v":2012},{"$f":"D8+1","v":2013},2014,2015,2016,2017,2018,2019,{"$f":"K8+1","v":2020},2021]
{"$rows_left_out":5}
{"sheet":"Historical Expenditure-Volumes","index":2,"n_rows":102,"n_cols":9,"rows_kept":102,"cut":false,"hidden":false,"merged":[[70,2,70,7],[5,2,5,6],[37,2,37,7],[35,1,35,8]]}
[{"$f":"Inflation!A1","v":"United Energy - Connections"},null,null,null,null,null,null,null,"Menu"]
[{"$f":"RIGHT(CELL(\"filename\", $A$1), LEN(CELL(\"filename\", $A$1)) - SEARCH(\"]\", CELL(\"filename\", $A$1)))","v":"Historical Expenditure-Volumes"}]
[]
[null,"Historical Expenditure by Function Code"]
[]
[null,null,"$ Nominal"]
[null,"Function Code","Description","2015/16","2016/17","2017/18","2018/19",null,"Build Up Method"]
[null,"CBE1",null,1540400.7450000001,1835027.085,2554261.83,2423252.3483716701,null,"Averaging"]
{"$rows_left_out":95}
{"sheet":"Historical Contributions","index":3,"n_rows":237,"n_cols":14,"rows_kept":237,"cut":false,"hidden":false,"merged":[[205,2,205,6],[137,9,137,13],[172,9,172,13],[5,9,5,13],[38,9,38,13],[104,9,104,13],[172,2,172,6],[104,2,104,6],[137,2,137,6],[5,2,5,6],[38,2,38,6],[71,2,71,6]]}
[{"$f":"Inflation!A1","v":"United Energy - Connections"},null,null,null,null,null,null,null,null,null,null,null,null,"Menu"]
[{"$f":"RIGHT(CELL(\"filename\", $A$1), LEN(CELL(\"filename\", $A$1)) - SEARCH(\"]\", CELL(\"filename\", $A$1)))","v":"Historical Contributions"},null,null,null,null,null,null,null,null,null,null,null,"Sheet Check",{"$f":"IF(SUM(C166:G166)=(SUM(C133:G133)-SUM(C67:G67)+SUM(C34:G34)),\"OK\",\"Check!\")","v":"OK"}]
[]
[null,"Historical Gifted Assets by Function Code"]
[]
[null,null,"$ Nominal",null,null,null,null,null,null,{"$f":"\"$ \"&Inflation!$C$4","v":"$ 2021"}]
[null,"Function Code","Description","2015/16","2016/17","2017/18","2018/19",null,"Function Code","Description","2015/16","2016/17","2017/18","2018/19"]
[null,{"$f":"IF('Historical Expenditure-Volumes'!B8=0,\" \",'Historical Expenditure-Volumes'!B8)","v":"CBE1"},null,36006,105714,228340,538021,null,{"$f":"B8","v":"CBE1"},null,{"$f":"IF(D8<>\"\",D8*Inflation!G$10,\"\")","v":39508},{"$f":"IF(E8<>\"\",E8*Inflation!H$10,\"\")","v":114269.45860465117},{"$f":"IF(F8<>\"\",F8*Inflation!I$10,\"\")","v":244319.59484346226},{"$f":"IF(G8<>\"\",G8*Inflation!J$10,\"\")","v":564751.9439927733}]
{"$rows_left_out":230}
{"sheet":"ACIF Growth Figures","index":4,"n_rows":77,"n_cols":15,"rows_kept":77,"cut":false,"hidden":false,"merged":[[5,2,5,14]]}
[{"$f":"Inflation!A1","v":"United Energy - Connections"},null,null,null,null,null,null,null,null,null,null,null,null,null,"Menu"]
[{"$f":"RIGHT(CELL(\"filename\", $A$1), LEN(CELL(\"filename\", $A$1)) - SEARCH(\"]\", CELL(\"filename\", $A$1)))","v":"ACIF Growth Figures"}]
[]
[null,"Growth Indices by Industry Type"]
[]
[null,null,"Growth Rate"]
[null,"Function Code","Description",null,"2015-16","2016-17","2017-18","2018-19","2019-20","2020-21","2021-22","2022-23","2023-24","2024-25","2025-26"]
[null,{"$f":"IF('Historical Expenditure-Volumes'!B8=0,\" \",'Historical Expenditure-Volumes'!B8)","v":"CBE1"},"Business Supply - LV connections  & LV augmentation as required (SR>150kVA) <=$400k",null,1.0348263817546743,1.0439789536384394,1.1481551920882465,1.0437303296339242,0.97579749246151404,1.0243148735463934,0.98261352810416003,0.93237456572675126,0.99263431542461,1.0213007420340463,1.0102572869476023]
{"$rows_left_out":70}
{"sheet":"Major Projects","index":5,"n_rows":15,"n_cols":9,"rows_kept":15,"cut":false,"hidden":false,"merged":[[5,2,5,8]]}
[{"$f":"Inflation!A1","v":"United Energy - Connections"},null,null,null,null,null,"Menu"]
[{"$f":"RIGHT(CELL(\"filename\", $A$1), LEN(CELL(\"filename\", $A$1)) - SEARCH(\"]\", CELL(\"filename\", $A$1)))","v":"Major Projects"}]
[]
[null,"Major Projects"]
[]
[null,null,{"$f":"\"$ 2019\"","v":"$ 2019"}]
[null,"Function Code","2019/20","2020/21","2021/22","2022/23","2023/24","2024/25","2025/26"]
[null,{"$f":"'Historical Expenditure-Volumes'!B10","v":"CBH1"},430115.50239098724,430115.50239098724,430115.50239098724,430115.50239098724,430115.50239098724,430115.50239098724,430115.50239098724]
{"$rows_left_out":8}
{"sheet":"Function Code Mapping","index":6,"n_rows":54,"n_cols":19,"rows_kept":54,"cut":false,"hidden":false,"merged":[[6,1,8,1],[9,1,13,1],[14,1,16,1],[17,1,19,1],[23,3,23,16]]}
[{"$f":"Inflation!A1","v":"United Energy - Connections"},null,null,"Menu"]
[{"$f":"RIGHT(CELL(\"filename\", $A$1), LEN(CELL(\"filename\", $A$1)) - SEARCH(\"]\", CELL(\"filename\", $A$1)))","v":"Function Code Mapping"},null,"Sheet Check",{"$f":"IF(SUM(S26:S51)<>0,\"Check!\",\"OK\")","v":"OK"}]
[]
[null,"Allocation of RIN categories expenditure to FC"]
[]
[null,"CONNECTION SUBCATEGORY","CONNECTION CLASSIFICATION","CODE"]
[null,"RESIDENTIAL","SIMPLE CONNECTION LV","R1"]
[null,null,"COMPLEX CONNECTION LV","R2"]
{"$rows_left_out":47}
{"sheet":"Growth Rates","index":7,"n_rows":38,"n_cols":12,"rows_kept":38,"cut":false,"hidden":false,"merged":[[6,2,6,11]]}
[{"$f":"Inflation!A1","v":"United Energy - Connections"},null,null,null,null,null,null,null,null,null,null,"Menu"]
[{"$f":"RIGHT(CELL(\"filename\", $A$1), LEN(CELL(\"filename\", $A$1)) - SEARCH(\"]\", CELL(\"filename\", $A$1)))","v":"Growth Rates"}]
[]
[]
[null,"Growth Rate by Function Code"]
[null,"ACIF rates"]
[null,null,"Growth Rate"]
[null,"Function Code","2016/17","2017/18","2018/19","2019/20","2020/21","2021/22","2022/23","2023/24","2024/25","2025/26"]
{"$rows_left_out":31}
{"sheet":"Unit Rates","index":8,"n_rows":35,"n_cols":4,"rows_kept":35,"cut":false,"hidden":false,"merged":[[5,2,5,3]]}
[{"$f":"Inflation!A1","v":"United Energy - Connections"},null,null,"Menu"]
[{"$f":"RIGHT(CELL(\"filename\", $A$1), LEN(CELL(\"filename\", $A$1)) - SEARCH(\"]\", CELL(\"filename\", $A$1)))","v":"Unit Rates"}]
[]
[null,"Average Unit Rates by Function Code"]
[]
[null,null,{"$f":"\"Unit Rate \"&\"$ \"& Inflation!C4","v":"Unit Rate $ 2021"}]
[null,"Function Code","Description","Average"]
[null,{"$f":"IF('Historical Expenditure-Volumes'!B8=0,\" \",'Historical Expenditure-Volumes'!B8)","v":"CBE1"},"Business Supply - LV connections  & LV augmentation as required (SR>150kVA) <=$400k",{"$f":"IFERROR(SUM('Historical Expenditure-Volumes'!D40:G40)/SUM('Historical Expenditure-Volumes'!D73:G73), 0)","v":4454.0936354030655}]
{"$rows_left_out":28}
{"sheet":"Forecast Expenditure-Volumes","index":9,"n_rows":239,"n_cols":24,"rows_kept":239,"cut":false,"hidden":false,"merged":[[227,1,229,1],[227,2,227,11],[228,2,228,11],[229,2,229,11],[230,1,232,1],[230,2,230,11],[231,2,231,11],[232,2,232,11],[222,1,226,1],[222,2,222,11],[223,2,223,11],[224,2,224,11],[225,2,225,11],[226,2,226,11],[217,13,217,23],[218,2,218,11],[219,1,221,1],[219,2,219,11],[220,2,220,11],[221,2,221,11],[197,13,197,23],[38,13,38,23],[40,1,42,1],[40,2,40,11],[41,2,41,11],[42,2,42,11],[48,2,48,11],[43,1,47,1],[43,2,43,11],[44,2,44,11],[51,1,53,1],[51,2,51,11],[52,2,52,11],[53,2,53,11],[45,2,45,11],[46,2,46,11],[210,1,212,1],[210,2,210,11],[204,2,204,11],[205,2,205,11],[206,2,206,11],[212,2,212,11],[202,1,206,1],[202,2,202,11],[203,2,203,11],[207,1,209,1],[207,2,207,11],[208,2,208,11],[209,2,209,11],[48,1,50,1],[199,1,201,1],[199,2,199,11],[200,2,200,11],[201,2,201,11],[49,2,49,11],[198,2,198,11],[50,2,50,11],[161,2,161,12],[192,1,192,12],[5,2,5,12],[59,2,59,12],[93,2,93,12],[127,2,127,12],[211,2,211,11],[39,2,39,11],[47,2,47,11]]}
[{"$f":"Inflation!A1","v":"United Energy - Connections"},null,null,null,null,null,null,null,null,null,null,null,"Menu"]
[{"$f":"RIGHT(CELL(\"filename\", $A$1), LEN(CELL(\"filename\", $A$1)) - SEARCH(\"]\", CELL(\"filename\", $A$1)))","v":"Forecast Expenditure-Volumes"},null,null,null,null,null,null,null,null,null,null,"Sheet Check",{"$f":"IF(CEILING(SUM(C8:M33),1)=CEILING(SUM(N41:X54),1),\"OK\",\"Check!\")","v":"OK"}]
[]
[null,"Forecast Volumes - Growth Rate by Function Code"]
[]
[null,null,"0's"]
[null,"Function Code","2015/16","2016/17","2017/18","2018/19","2019/20","2020/21","2021/22","2022/23","2023/24","2024/25","2025/26"]
[null,{"$f":"IF('Historical Expenditure-Volumes'!B8=0,\" \",'Historical Expenditure-Volumes'!B8)","v":"CBE1"},{"$f":"'Historical Expenditure-Volumes'!D73","v":327.50993487233728},{"$f":"'Historical Expenditure-Volumes'!E73","v":475.08852467964124},{"$f":"'Historical Expenditure-Volumes'!F73","v":628.14046191907289},{"$f":"'Historical Expenditure-Volumes'!G73","v":578.74301744880313},{"$f":"'Historical Expenditure-Volumes'!H73","v":502.37048472996366},{"$f":"G8*(1+'Growth Rates'!G9)","v":514.58555953961309},{"$f":"H8*(1+'Growth Rates'!H9)","v":505.63873217067254},{"$f":"I8*(1+'Growth Rates'!I9)","v":471.44469332225589},{"$f":"J8*(1+'Growth Rates'!J9)","v":467.97218041650268},{"$f":"K8*(1+'Growth Rates'!K9)","v":477.94033511066476},{"$f":"L8*(1+'Growth Rates'!L9)","v":482.84270627172805}]
{"$rows_left_out":232}
{"sheet":"Forecast Contributions","index":10,"n_rows":172,"n_cols":29,"rows_kept":172,"cut":false,"hidden":false,"merged":[[5,18,5,28],[39,18,39,28],[106,18,106,28],[140,18,140,28],[39,2,39,12],[5,2,5,12],[73,2,73,12],[106,2,106,12],[140,2,140,12]]}
[{"$f":"Inflation!A1","v":"United Energy - Connections"},null,null,null,null,null,null,null,"AER draft decision",null,null,null,"Menu"]
[{"$f":"RIGHT(CELL(\"filename\", $A$1), LEN(CELL(\"filename\", $A$1)) - SEARCH(\"]\", CELL(\"filename\", $A$1)))","v":"Forecast Contributions"},null,null,null,null,null,null,null,"RRP change",null,null,null,null,null,null,"HIA factor applied",0.57999999999999996]
[]
[null,"Historical/Forecast Gifted Assets by Function Code",null,null,null,null,null,null,null,null,null,null,null,null,null,"AER draft decision",null,"GA with Connection Policy Shared Network Factor Change"]
[null,null,null,null,null,null,null,null,null,null,null,null,null,null,null,"2021/22"]
[null,null,{"$f":"\"$ \"&Inflation!$C$4","v":"$ 2021"},null,null,null,null,null,null,null,null,null,null,null,null,{"$f":"\"$'000 \"&Inflation!$C$4","v":"$'000 2021"},null,null,"$ 2021"]
[null,"Function Code","2015/16","2016/17","2017/18","2018/19","2019/20","2020/21","2021/22","2022/23","2023/24","2024/25","2025/26",null,null,"Forecast",null,"Function Code","2015/16","2016/17","2017/18","2018/19","2019/20","2020/21","2021/22","2022/23","2023/24","2024/25","2025/26"]
[null,{"$f":"'Forecast Expenditure-Volumes'!B8","v":"CBE1"},{"$f":"'Historical Contributions'!K8","v":39508},{"$f":"'Historical Contributions'!L8","v":114269.45860465117},{"$f":"'Historical Contributions'!M8","v":244319.59484346226},{"$f":"'Historical Contributions'!N8","v":564751.9439927733},{"$f":"AVERAGE($D8:$F8)","v":307780.33248029556},{"$f":"AVERAGE($D8:$F8)","v":307780.33248029556},{"$f":"P8/$Q$2","v":277956.17156187072},288987.93639914924,270281.69624594226,288567.33274356829,316090.56214699795,null,null,161214.57950588502,null,{"$f":"B8","v":"CBE1"},null,null,null,null,null,null,{"$f":"I8*Y143","v":222197.73385189599},232256.83883609821,216626.92178516104,232372.28680466479,254521.82659067219]
{"$rows_left_out":165}
{"sheet":"Forecast Contributions-AER DD","index":11,"n_rows":172,"n_cols":13,"rows_kept":172,"cut":false,"hidden":false,"merged":[[5,2,5,12],[39,2,39,12],[73,2,73,12],[106,2,106,12],[140,2,140,12]]}
[{"$f":"Inflation!A1","v":"United Energy - Connections"},null,null,null,null,null,null,null,null,null,null,null,"Menu"]
[{"$f":"RIGHT(CELL(\"filename\", $A$1), LEN(CELL(\"filename\", $A$1)) - SEARCH(\"]\", CELL(\"filename\", $A$1)))","v":"Forecast Contributions-AER DD"}]
[]
[null,"Historical/Forecast Gifted Assets by Function Code"]
[]
[null,null,"$ 2021"]
[null,"Function Code","2015/16","2016/17","2017/18","2018/19","2019/20","2020/21","2021/22","2022/23","2023/24","2024/25","2025/26"]
[null,"CBE1",39508,114269.45860465117,244319.59484346226,564751.9439927733,307780.33248029556,307780.33248029556,161214.57950588502,288987.93639914924,270281.69624594226,288567.33274356829,316090.56214699795]
{"$rows_left_out":165}
{"sheet":"Expenditure & Volume Output","index":12,"n_rows":44,"n_cols":15,"rows_kept":44,"cut":false,"hidden":false,"merged":[[4,4,4,14],[23,4,23,14],[33,1,35,1],[36,1,38,1],[28,1,32,1],[25,1,27,1],[14,1,16,1],[17,1,19,1],[9,1,13,1],[6,1,8,1]]}
[{"$f":"Inflation!A1","v":"United Energy - Connections"},null,null,null,null,null,null,null,null,null,null,null,null,null,"Menu"]
[{"$f":"RIGHT(CELL(\"filename\", $A$1), LEN(CELL(\"filename\", $A$1)) - SEARCH(\"]\", CELL(\"filename\", $A$1)))","v":"Expenditure & Volume Output"},null,null,null,null,null,null,null,null,null,null,null,null,"Sheet Check",{"$f":"IF(SUM(E22:P22,E41:P41)=0,\"OK\",\"Check!\")","v":"OK"}]
[]
[null,"Expenditure"]
[null,null,null,null,{"$f":"\"$ \"&Inflation!$C$4","v":"$ 2021"}]
[null,"CONNECTION SUBCATEGORY","CONNECTION CLASSIFICATION","CODE","2015/16","2016/17","2017/18","2018/19","2019/20","2020/21","2021/22","2022/23","2023/24","2024/25","2025/26"]
[null,"RESIDENTIAL","SIMPLE CONNECTION LV","R1",{"$f":"'Forecast Expenditure-Volumes'!N200","v":14718604.671388101},{"$f":"'Forecast Expenditure-Volumes'!O200","v":13633228.774883721},{"$f":"'Forecast Expenditure-Volumes'!P200","v":16014200.903314918},{"$f":"'Forecast Expenditure-Volumes'!Q200","v":16718300.001902433},{"$f":"'Forecast Expenditure-Volumes'!R200","v":15271083.587872293},{"$f":"'Forecast Expenditure-Volumes'!S200","v":15097917.019968253},{"$f":"'Forecast Expenditure-Volumes'!T200","v":15464947.355127415},{"$f":"'Forecast Expenditure-Volumes'!U200","v":15983757.152194506},{"$f":"'Forecast Expenditure-Volumes'!V200","v":16243162.050728045},{"$f":"'Forecast Expenditure-Volumes'!W200","v":16370104.873414671},{"$f":"'Forecast Expenditure-Volumes'!X200","v":16454273.484109068}]
[null,null,"COMPLEX CONNECTION LV","R2",{"$f":"'Forecast Expenditure-Volumes'!N201","v":0},{"$f":"'Forecast Expenditure-Volumes'!O201","v":0},{"$f":"'Forecast Expenditure-Volumes'!P201","v":0},{"$f":"'Forecast Expenditure-Volumes'!Q201","v":0},{"$f":"'Forecast Expenditure-Volumes'!R201","v":0},{"$f":"'Forecast Expenditure-Volumes'!S201","v":0},{"$f":"'Forecast Expenditure-Volumes'!T201","v":0},{"$f":"'Forecast Expenditure-Volumes'!U201","v":0},{"$f":"'Forecast Expenditure-Volumes'!V201","v":0},{"$f":"'Forecast Expenditure-Volumes'!W201","v":0},{"$f":"'Forecast Expenditure-Volumes'!X201","v":0}]
{"$rows_left_out":37}
{"sheet":"Gross Capex","index":13,"n_rows":40,"n_cols":17,"rows_kept":40,"cut":false,"hidden":false,"merged":[[5,1,6,1],[5,2,6,2]]}
[{"$f":"Inflation!A1","v":"United Energy - Connections"},null,null,null,null,"AER draft decision",null,null,null,null,null,null,null,null,"Menu"]
[{"$f":"RIGHT(CELL(\"filename\", $A$1), LEN(CELL(\"filename\", $A$1)) - SEARCH(\"]\", CELL(\"filename\", $A$1)))","v":"Gross Capex"},null,null,null,null,"RRP change"]
[null,null,null,null,null,null,null,null,null,"HIA factor applied",0.57999999999999996]
[null,"Direct Capex by Function Code",null,null,null,null,null,null,null,null,null,null,null,null,null,null,"AER draft decision"]
[null,null,null,null,null,"2016/17","2017/18","2018/19","2019/20","2020/21","2021/22","2022/23","2023/24","2024/25","2025/26",null,"2021/22"]
[null,"Function Code","Description",null,null,"$'000 Nom","$'000 Nom","$'000 Nom",{"$f":"\"$'000 \"&Inflation!$C$4","v":"$'000 2021"},{"$f":"\"$'000 \"&Inflation!$C$4","v":"$'000 2021"},{"$f":"\"$'000 \"&Inflation!$C$4","v":"$'000 2021"},{"$f":"\"$'000 \"&Inflation!$C$4","v":"$'000 2021"},{"$f":"\"$'000 \"&Inflation!$C$4","v":"$'000 2021"},{"$f":"\"$'000 \"&Inflation!$C$4","v":"$'000 2021"},{"$f":"\"$'000 \"&Inflation!$C$4","v":"$'000 2021"},null,{"$f":"\"$'000 \"&Inflation!$C$4","v":"$'000 2021"}]
[null,null,null,null,null,"Actual","Actual","Actual","Forecast","Forecast","Forecast","Forecast","Forecast","Forecast","Forecast",null,"Forecast"]
[null,"CBE1",{"$f":"'Function Code Mapping'!C26","v":"Business Supply - LV connections  & LV augmentation as required (SR>150kVA) <=$400k"},null,null,{"$f":"('Forecast Expenditure-Volumes'!D130)/1000/Inflation!H$10","v":1835.0270849999999},{"$f":"('Forecast Expenditure-Volumes'!E130)/1000/Inflation!I$10","v":2554.2618300000004},{"$f":"('Forecast Expenditure-Volumes'!F130)/1000/Inflation!J$10","v":2423.2523483716705},{"$f":"('Forecast Expenditure-Volumes'!G130)/1000","v":2237.6051786500839},{"$f":"('Forecast Expenditure-Volumes'!H130)/1000","v":2292.0122656157155},{"$f":"Q8/$K$3","v":2001.7359117641954},1939.248798065287,1824.7348585380198,1939.2536132142691,2139.8518818864377,null,1161.0068288232333]
{"$rows_left_out":33}
{"sheet":"Gross Capex-AER DD","index":14,"n_rows":40,"n_cols":15,"rows_kept":40,"cut":false,"hidden":false,"merged":[[5,1,6,1],[5,2,6,2]]}
[{"$f":"Inflation!A1","v":"United Energy - Connections"},null,null,null,null,null,null,null,null,null,null,null,null,null,"Menu"]
[{"$f":"RIGHT(CELL(\"filename\", $A$1), LEN(CELL(\"filename\", $A$1)) - SEARCH(\"]\", CELL(\"filename\", $A$1)))","v":"Gross Capex-AER DD"},null,null,null,null,null,null,null,null,null,null,null,null,"Sheet Check"]
[]
[null,"Direct Capex by Function Code"]
[null,null,null,null,null,"2016/17","2017/18","2018/19","2019/20","2020/21","2021/22","2022/23","2023/24","2024/25","2025/26"]
[null,"Function Code","Description",null,null,"$'000 Nom","$'000 Nom","$'000 Nom","$'000 2021","$'000 2021","$'000 2021","$'000 2021","$'000 2021","$'000 2021","$'000 2021"]
[null,null,null,null,null,"Actual","Actual","Actual","Forecast","Forecast","Forecast","Forecast","Forecast","Forecast","Forecast"]
[null,"CBE1","Business Supply - LV connections  & LV augmentation as required (SR>150kVA) <=$400k",null,null,1835.0270849999999,2554.2618300000004,2423.2523483716705,2237.6051786500839,2292.0122656157155,1161.0068288232333,1939.248798065287,1824.7348585380198,1939.2536132142691,2139.8518818864377]
{"$rows_left_out":32}